{"text_format":"1","workbook":"xlsx","n_sheets":12,"sheets":["Introduksjon","Prisliste","Beregning","Månedlig registrering","Oppstartskostnad","Mellomregning - teknologikostna","Mellomlagring - antall besøk","Mellomlagring - utsatt døgn","Mellomlagring - kvalitet","Spart tid - ungått besøk","Gevinst-utsatt plass","Resultater"],"not_rendered":{"charts":4,"images":3,"macros":1,"external_links":0,"defined_names":58,"comments":8,"pivot_tables":0},"unopened":[],"bounds":{"document_bytes":16777216,"sheet_cells":100000,"rows_first":2000,"rows_last":500,"rows_between":2000,"halvings":0,"cell_chars":16384,"cell_head_chars":4096},"cells_cut":0,"cells_raw":0,"read":"row_number_cap","date_system":"1900"}

{"sheet":"Introduksjon","index":0,"n_rows":0,"n_cols":0,"rows_kept":0,"cut":false,"hidden":false,"merged":[]}

{"sheet":"Prisliste","index":1,"n_rows":37,"n_cols":7,"rows_kept":37,"cut":false,"hidden":false,"merged":[[14,1,15,6],[0,1,0,6],[5,1,5,6]]}
[null,"Kostnad for lønn til pleiere"]
[null,"Gjennomsnittlig kostnad pleier per time (inkl. arb.avgift, feriepenger osv.)",null,null,null,370,"kr "]
[null,"Påslag for innetid, utgifter knyttet til kjøring osv.",null,null,null,0.1]
[null,"Timeskostnad pleier (inkludert avgifter)",null,null,null,{"$f":"F2*(1+F3)","v":407.00000000000006},"kr"]
[]
[null,"Kostnad for institusjonsplass og overliggerdøgn"]
[null,"Gjennomsnittlig årskostnad for institusjonsplass (korttid)",null,null,null,1000000,"kr"]
[null,"Gjennomsnittlig årskostnad for institusjonsplass (langtid)",null,null,null,1400000,"kr"]
[null,"Gjennomsnittlig dagskostnad for institusjonsplass (korttid) ",null,null,null,{"$f":"F7/365","v":2739.7260273972602},"kr"]
[null,"Gjennomsnittlig dagskostnad for institusjonsplass (langtid) ",null,null,null,{"$f":"F8/365","v":3835.6164383561645},"kr"]
[null,"Gjennomsnittlig årkostnad bruker av hjemmetjenester ",null,null,null,{"$f":"300000","v":300000},"kr"]
[null,"Gjennomsnittlig månedlig kostnad per bruker av hjemmetjenester",null,null,null,{"$f":"F11/12","v":25000},"kr"]
[null,"Kostnad for overliggerdøgn på sykehus",null,null,null,6000,"kr"]
[]
[null,"Prisliste for velferdsteknologier i kommunen eks. mva. "]
[]
[null,"Type teknologi","Innkjøpspris","Etableringspris","Lisens per måned","Estimert levetid på teknologi (år)","Estimert månedlig kostnad"]
[1,"Digital trygghetsalarm, 4G",3000,null,100,5,{"$f":"(C18)/12/F18+E18","v":150}]
[2,"Digital trygghetsalarm, 2G",2000,0,100,5,{"$f":"(C19)/12/F19+E19","v":133.33333333333331}]
[3,"Mobil trygghetsalarm",1000,900,0,5,16.666666666666664]
[4,"Medisindispenser, Medidos",3000,1500,98,5,148]
[5,"Medisindispenser, Pilly",3000,1500,0,5,50]
[6,"Døralarm",1000,0,0,5,16.666666666666664]
[7,"E-lås hjemmetjeneste",1000,500,0,5,16.666666666666664]
[8," ",null,null,null,null,{"$error":"#DIV/0!"}]
[9," ",null,null,null,null,{"$error":"#DIV/0!"}]
[10," ",null,null,null,null,{"$error":"#DIV/0!"}]
[11," ",null,null,null,null,{"$error":"#DIV/0!"}]
[12," ",null,null,null,null,{"$error":"#DIV/0!"}]
[13," ",null,null,null,null,{"$error":"#DIV/0!"}]
[14," ",null," ",null,null,{"$error":"#DIV/0!"}]
[15," ",null,null,null,null,{"$error":"#DIV/0!"}]
[16," ",null,null,null,null,{"$error":"#DIV/0!"}]
[17," ",null,null,null,null,{"$error":"#DIV/0!"}]
[18," ",null,null,null,null,{"$error":"#DIV/0!"}]
[19," ",null,null,null,null,{"$error":"#DIV/0!"}]
[20," ",null,null,null,null,{"$error":"#DIV/0!"}]

{"sheet":"Beregning","index":2,"n_rows":62,"n_cols":12,"rows_kept":62,"cut":false,"hidden":false,"merged":[[5,0,6,0],[41,4,42,4],[43,4,46,4],[1,0,3,4]],"read":"row_number_cap"}
[]
["Gevinstberegning"]
[]
[]
[]
[]
[]
[]
[null,null,null,null,null,null,null,"Oversikt over navngitte celler"]
[null,"Bruker-ID?",1003,null,null,null,null,"Beskrivelse","Cellenavn","For bruk i VBA",null,"Offset-nummer i VBA (beskriver hvor i listen i \"Antall besøk\" dataen lagrers"]
[null,"Når mottar bruker velferdsteknologi?","15.01.2018",null,null,null,null,"Bruker-ID?","BrukerID",{"$f":"\"[\"&I11&\"]\"","v":"[BrukerID]"},null,0]
[null,"Hvem registrerer brukeren","Sykepleier 1",null,null,null,null,"Når mottar bruker velferdsteknologi?","StartDato",{"$f":"\"[\"&I12&\"]\"","v":"[StartDato]"},null,1]
[null,null,null,null,null,null,null,"Hvem registrerer brukeren","Navn_registrerer","[Navn_registrerer]",null,2]
[null,"Hva slags teknologi mottar brukeren?"]
[null,{"$f":"Prisliste!B18","v":"Digital trygghetsalarm, 4G"},"Ja",{"$f":"IF(C15=\"Ja\",Prisliste!G18,)","v":150},{"$f":"IF(C15=\"Ja\",Prisliste!D18)","v":0},null,1,"Installasjonskostnad","Installasjonskostnad","[Installasjonskostnad]",null,3]
[null,{"$f":"Prisliste!B19","v":"Digital trygghetsalarm, 2G"},"Nei",{"$f":"IF(C16=\"Ja\",Prisliste!G19,)","v":0},{"$f":"IF(C16=\"Ja\",Prisliste!D19)","v":false},null,2,"Opplæringskostnad","Opplæringskostnad","[Opplæringskostnad]",null,4]
[null,{"$f":"Prisliste!B20","v":"Mobil trygghetsalarm"},"Ja",{"$f":"IF(C17=\"Ja\",Prisliste!G20,)","v":16.666666666666664},{"$f":"IF(C17=\"Ja\",Prisliste!D20)","v":900},null,3]
[null,{"$f":"Prisliste!B21","v":"Medisindispenser, Medidos"},"Nei",{"$f":"IF(C18=\"Ja\",Prisliste!G21,)","v":0},{"$f":"IF(C18=\"Ja\",Prisliste!D21)","v":false},null,4]
[null,{"$f":"Prisliste!B22","v":"Medisindispenser, Pilly"},"Nei",{"$f":"IF(C19=\"Ja\",Prisliste!G22,)","v":0},{"$f":"IF(C19=\"Ja\",Prisliste!D22)","v":false},null,5,"Antatt tid per besøk med UTEN velferdsteknologi (ansikt-til-ansikt + total kjøretid)","Tid_Medisin_UtenVFT",{"$f":"\"[\"&I19&\"]\"","v":"[Tid_Medisin_UtenVFT]"},null,5]
[null,{"$f":"Prisliste!B23","v":"Døralarm"},"Nei",{"$f":"IF(C20=\"Ja\",Prisliste!G23,)","v":0},{"$f":"IF(C20=\"Ja\",Prisliste!D23)","v":false},null,6,"Antatt tid per besøk med MED velferdsteknologi (ansikt-til-ansikt + total kjøretid)","Tid_medisin_medVFT",{"$f":"\"[\"&I20&\"]\"","v":"[Tid_medisin_medVFT]"},null,6]
[null,{"$f":"Prisliste!B24","v":"E-lås hjemmetjeneste"},"Nei",{"$f":"IF(C21=\"Ja\",Prisliste!G24,)","v":0},{"$f":"IF(C21=\"Ja\",Prisliste!D24)","v":false},null,7,"Ordinær tjeneste: antall fysiske besøk per måned ","Besøk_medisin_utenVFT",{"$f":"\"[\"&I21&\"]\"","v":"[Besøk_medisin_utenVFT]"},null,7]
[null,{"$f":"Prisliste!B25","v":" "},"Nei",{"$f":"IF(C22=\"Ja\",Prisliste!G25,)","v":0},{"$f":"IF(C22=\"Ja\",Prisliste!D25)","v":false},null,8,"Med velferdsteknologi: antall fysiske besøk per måned","Besøk_medisin_medVFT",{"$f":"\"[\"&I22&\"]\"","v":"[Besøk_medisin_medVFT]"},null,8]
[null,{"$f":"Prisliste!B26","v":" "},"Nei",{"$f":"IF(C23=\"Ja\",Prisliste!G26,)","v":0},{"$f":"IF(C23=\"Ja\",Prisliste!D26)","v":false},null,9,"Kommentar på hvordan tid er beregnet","Kommentar_medisin",{"$f":"\"[\"&I23&\"]\"","v":"[Kommentar_medisin]"},null,9]
[null,{"$f":"Prisliste!B27","v":" "},"Nei",{"$f":"IF(C24=\"Ja\",Prisliste!G27,)","v":0},{"$f":"IF(C24=\"Ja\",Prisliste!D27)","v":false},null,10]
[null,{"$f":"Prisliste!B28","v":" "},"Nei",{"$f":"IF(C25=\"Ja\",Prisliste!G28,)","v":0},{"$f":"IF(C25=\"Ja\",Prisliste!D28)","v":false},null,11,"Antatt tid per besøk med uten velferdsteknologi (ansikt-til-ansikt + total kjøretid)","Tid_tilsyn_utenVFT",{"$f":"\"[\"&I25&\"]\"","v":"[Tid_tilsyn_utenVFT]"},null,10]
[null,{"$f":"Prisliste!B29","v":" "},"Nei",{"$f":"IF(C26=\"Ja\",Prisliste!G29,)","v":0},{"$f":"IF(C26=\"Ja\",Prisliste!D29)","v":false},null,12,"Antatt tid per besøk med med velferdsteknologi (ansikt-til-ansikt + total kjøretid)","Tid_tilsyn_medVFT",{"$f":"\"[\"&I26&\"]\"","v":"[Tid_tilsyn_medVFT]"},null,11]
[null,{"$f":"Prisliste!B30","v":" "},"Nei",{"$f":"IF(C27=\"Ja\",Prisliste!G30,)","v":0},{"$f":"IF(C27=\"Ja\",Prisliste!D30)","v":false},null,13,"Ordinær tjeneste: antall fysiske besøk per måned ","Besøk_tilsyn_utenVFT",{"$f":"\"[\"&I27&\"]\"","v":"[Besøk_tilsyn_utenVFT]"},null,12]
[null,{"$f":"Prisliste!B31","v":" "},"Nei",{"$f":"IF(C28=\"Ja\",Prisliste!G31,)","v":0},{"$f":"IF(C28=\"Ja\",Prisliste!D31)","v":false},null,14,"Med velferdsteknologi: antall fysiske besøk per måned","Besøk_tilsyn_medVFT",{"$f":"\"[\"&I28&\"]\"","v":"[Besøk_tilsyn_medVFT]"},null,13]
[null,{"$f":"Prisliste!B32","v":" "},"Nei",{"$f":"IF(C29=\"Ja\",Prisliste!G32,)","v":0},{"$f":"IF(C29=\"Ja\",Prisliste!D32)","v":false},null,15,"Kommentar på hvordan tid er beregnet","Kommentar_tilsyn",{"$f":"\"[\"&I29&\"]\"","v":"[Kommentar_tilsyn]"},null,14]
[null,{"$f":"Prisliste!B33","v":" "},"Nei",{"$f":"IF(C30=\"Ja\",Prisliste!G33,)","v":0},{"$f":"IF(C30=\"Ja\",Prisliste!D33)","v":false},null,16]
[null,{"$f":"Prisliste!B34","v":" "},"Nei",{"$f":"IF(C31=\"Ja\",Prisliste!G34,)","v":0},{"$f":"IF(C31=\"Ja\",Prisliste!D34)","v":false},null,17,"Vil bruk av velferdsteknologi gi utsatt plass på korttidsavdeling?","Utsatt_korttidsavd",{"$f":"\"[\"&I31&\"]\"","v":"[Utsatt_korttidsavd]"},null,15]
[null,{"$f":"Prisliste!B35","v":" "},"Nei",{"$f":"IF(C32=\"Ja\",Prisliste!G35,)","v":0},{"$f":"IF(C32=\"Ja\",Prisliste!D35)","v":false},null,18,"Vil bruk av velferdsteknologi gi utsatt plass på langtidsavdeling?","Utsatt_langtidsavd",{"$f":"\"[\"&I32&\"]\"","v":"[Utsatt_langtidsavd]"},null,16]
[null,{"$f":"Prisliste!B36","v":" "},"Nei",{"$f":"IF(C33=\"Ja\",Prisliste!G36,)","v":0},{"$f":"IF(C33=\"Ja\",Prisliste!D36)","v":false},null,19,"Vil bruk av veldferdsteknologi redusere antall overliggerdøgn på sykehus?","Reduksjon_overliggerdøgn",{"$f":"\"[\"&I33&\"]\"","v":"[Reduksjon_overliggerdøgn]"},null,17]
[null,{"$f":"Prisliste!B37","v":" "},"Nei",{"$f":"IF(C34=\"Ja\",Prisliste!G37,)","v":0},{"$f":"IF(C34=\"Ja\",Prisliste!D37)","v":false},null,20]
[null,null,"SUM Måned",{"$f":"SUM(D14:D34)","v":166.66666666666666}]
[null,null,"Sum Etablering",{"$f":"SUM(E15:E34)","v":900}]
[]
[]
[null,"Er det knyttet kostnader til installasjon og opplæring hos bruker?"]
[null,"Installasjonskostnad",0,"kr"]
[null,"Opplæringskostnad",0,"kr"]
[null,null,null,null,"Kommentar på hvordan tid og besøk er beregnet"]
[null,"Gevinster for redusert antall besøk"]
[null,"Antatt tid per besøk UTEN velferdsteknologi (ansikt-til-ansikt + total kjøretid)",null,"Minutter (inkluder kjøretid til og fra)","Skriv inn kommentar på hvordan besøk og tid er beregnet."]
[null,"Antatt tid per besøk MED velferdsteknologi   (ansikt-til-ansikt + total kjøretid)",null,"Minutter (inkluder kjøretid til og fra)"]
[null,"Ordinær tjeneste:           antall fysiske besøk per måned ",null,"Mangler du informasjon? Gjør enkel antakelse"]
[null,"Med velferdsteknologi: antall fysiske besøk per måned",null,"Mangler du informasjon? Gjør enkel antakelse"]
[]
[null,"Gevinster ved utsatt institusjonsopphold"]
[null,"Vil bruk av velferdsteknologi gi utsatt plass på korttidsavdeling?","Nei","Kun hvis du er sikker på at det unngås innleggelse ved bruk av velferdsteknologi. "]
[null,"Vil bruk av velferdsteknologi gi utsatt plass på langtidsavdeling?","Ja","Kun hvis du er sikker på at det unngås innleggelse ved bruk av velferdsteknologi. "]
[null,"Hvor mange overliggerdøgn på sykehus antas ungått?",0,"Kun hvis du er sikker på at velferdsteknologi reduserer overliggerdøgn. "]
[]
[null,"Gevinstestimering"]
[null,"Sammenlign tid/kostnad for ordinær og velferdsteknologi som tjeneste","Tid ","Kostnad","Beskrivelse"]
[null,"Månedlig kostnad for velferdsteknologi",null,{"$f":"KostnadMånedUtstyr","v":166.66666666666666},"Per måned"]
[null,"Tid brukt på besøk ordinær tjeneste",{"$f":"(Tid_Medisin_UtenVFT*Besøk_medisin_utenVFT)/60","v":0},{"$f":"C57*Timeslønn.Sykepleier","v":0},"Per måned"]
[null,"Kostnad ved besøk med velferdsteknologi",{"$f":"(Tid_medisin_medVFT*Besøk_medisin_medVFT)/60","v":0},{"$f":"C58*Timeslønn.Sykepleier","v":0},"Per måned"]
[null,"Gevinst ved bruk av velferdsteknologi",{"$f":"C57-C58","v":0},{"$f":"D57-D58-D56","v":-166.66666666666666},"Per måned"]
[null,"Gevinst ved utsatt institusjonsinnleggelse",null,{"$f":"_xlfn.IFS(Utsatt_korttidsavd=\"Ja\",Årskostnad_Korttid/12,Utsatt_langtidsavd=\"Ja\",Årskostnad_Langtid/12,Reduksjon_overliggerdøgn>0,Dagskost_Overliggerdøgn*Reduksjon_overliggerdøgn,AND(Utsatt_korttidsavd=\"Nei\",Utsatt_langtidsavd=\"Nei\",Reduksjon_overliggerdøgn=0),0)","v":116666.66666666667},"Per måned"]
[null,"Spart tid og kostnad ved bruk av velferdsteknologi (positive tall er besparelse)",{"$f":"C59*12","v":0},{"$f":"D59*12-Opplæringskostnad-Installasjonskostnad-Etableringskostnad+D60","v":113766.66666666667},"Per år, inkl. installasjons- og oppstartskostnader"]
[null,"Spart tid/spart kostnad ved bruk av velferdsteknologi?",null,{"$f":"+IF(D61>0,\"JA\",\"NEI\")","v":"JA"}]

{"sheet":"Månedlig registrering","index":3,"n_rows":107,"n_cols":147,"rows_kept":107,"cut":false,"hidden":false,"merged":[[5,123,5,125],[5,126,5,128],[5,129,5,131],[5,132,5,134],[5,135,5,137],[5,108,5,110],[5,111,5,113],[5,114,5,116],[5,117,5,119],[5,120,5,122],[5,93,5,95],[5,96,5,98],[5,99,5,101],[5,102,5,104],[5,105,5,107],[3,2,3,8],[5,39,5,41],[4,31,6,31],[4,37,6,37],[4,33,6,33],[4,34,6,34],[4,35,6,35],[4,36,6,36],[5,7,6,7],[5,5,6,5],[5,6,6,6],[1,38,2,51],[4,30,6,30],[4,23,6,23],[4,24,6,24],[4,25,6,25],[4,26,6,26],[4,27,6,27],[5,42,5,44],[5,45,5,47],[5,48,5,50],[5,51,5,53],[4,38,6,38],[4,19,6,19],[4,20,6,20],[4,21,6,21],[4,22,6,22],[5,16,6,16],[5,0,6,0],[5,14,6,14],[4,32,6,32],[5,8,6,8],[5,15,6,15],[5,10,6,10],[5,11,6,11],[5,12,6,12],[5,13,6,13],[5,2,6,2],[5,3,6,3],[5,4,6,4],[5,1,6,1],[4,28,6,28],[4,29,6,29],[4,18,6,18],[5,138,5,140],[5,141,5,143],[5,144,5,146],[5,54,5,56],[5,57,5,59],[5,60,5,62],[5,63,5,65],[5,66,5,68],[5,69,5,71],[5,72,5,74],[5,75,5,77],[5,78,5,80],[5,81,5,83],[5,84,5,86],[5,87,5,89],[5,90,5,92]]}
[null,null,null,null,null,null,null,null,null,null,null,null,null,null,null,null,null,null,null,null,null,null,null,null,null,null,null,null,null,null,null,null,null,null,null,null,null,null,null,"Klikk på +/- ovenfor for å vise / skjule informasjon fra kartlegging",null,null,null,null,null,null,null,null,null,null,null,null,null,null,null,null,null,null,null,null,null,null,null,null,null,null,null,null,null,null,null,null,null,null,null,null,null,null,null,null,null,null,"Ja"]
[null,null,null,null,null,null,null,null,null,null,null,null,null,null,null,null,null,null,null,null,null,null,null,null,null,null,null,null,null,null,null,null,null,null,null,null,null,null,"Registrering av månedlige resultater",null,null,null,null,null,null,null,null,null,null,null,null,null,null,null,null,null,null,null,null,null,null,null,null,null,null,null,null,null,null,null,null,null,null,null,null,null,null,null,null,null,null,null,"Nei"]
[null,null,null,null,null,null,null,null,null,null,null,null,null,null,null,null,null,null,1,2,3,4,5,6,{"$f":"+X3+1","v":7},8,9,10,11,12,13,14,15,16,17,18,19,20]
[null,null,"Informasjon fra kartlegging"]
[1,2,3,31,32,35,36,37,38,"Kommentar ",41,42,43,44,"BLANK",47,48,49,{"$f":"INDEX(Prisliste!$B$18:$B$37,S3,0)","v":"Digital trygghetsalarm, 4G"},{"$f":"INDEX(Prisliste!$B$18:$B$37,T3,0)","v":"Digital trygghetsalarm, 2G"},{"$f":"INDEX(Prisliste!$B$18:$B$37,U3,0)","v":"Mobil trygghetsalarm"},{"$f":"INDEX(Prisliste!$B$18:$B$37,V3,0)","v":"Medisindispenser, Medidos"},{"$f":"INDEX(Prisliste!$B$18:$B$37,W3,0)","v":"Medisindispenser, Pilly"},{"$f":"INDEX(Prisliste!$B$18:$B$37,X3,0)","v":"Døralarm"},{"$f":"INDEX(Prisliste!$B$18:$B$37,Y3,0)","v":"E-lås hjemmetjeneste"},{"$f":"INDEX(Prisliste!$B$18:$B$37,Z3,0)","v":" "},{"$f":"INDEX(Prisliste!$B$18:$B$37,AA3,0)","v":" "},{"$f":"INDEX(Prisliste!$B$18:$B$37,AB3,0)","v":" "},{"$f":"INDEX(Prisliste!$B$18:$B$37,AC3,0)","v":" "},{"$f":"INDEX(Prisliste!$B$18:$B$37,AD3,0)","v":" "},{"$f":"INDEX(Prisliste!$B$18:$B$37,AE3,0)","v":" "},{"$f":"INDEX(Prisliste!$B$18:$B$37,AF3,0)","v":" "},{"$f":"INDEX(Prisliste!$B$18:$B$37,AG3,0)","v":" "},{"$f":"INDEX(Prisliste!$B$18:$B$37,AH3,0)","v":" "},{"$f":"INDEX(Prisliste!$B$18:$B$37,AI3,0)","v":" "},{"$f":"INDEX(Prisliste!$B$18:$B$37,AJ3,0)","v":" "},{"$f":"INDEX(Prisliste!$B$18:$B$37,AK3,0)","v":" "},{"$f":"INDEX(Prisliste!$B$18:$B$37,AL3,0)","v":" "},"Gevinstestimat for bruker"]
[{"$f":"INDEX(Beregning!$B$10:$B$54,'Månedlig registrering'!A5)","v":"Bruker-ID?"},{"$f":"INDEX(Beregning!$B$10:$B$54,'Månedlig registrering'!B5)","v":"Når mottar bruker velferdsteknologi?"},{"$f":"INDEX(Beregning!$B$10:$B$54,'Månedlig registrering'!C5)","v":"Hvem registrerer brukeren"},{"$f":"INDEX(Beregning!$B$10:$B$54,'Månedlig registrering'!D5)","v":"Installasjonskostnad"},{"$f":"INDEX(Beregning!$B$10:$B$54,'Månedlig registrering'!E5)","v":"Opplæringskostnad"},{"$f":"INDEX(Beregning!$B$10:$B$54,'Månedlig registrering'!F5)","v":"Antatt tid per besøk UTEN velferdsteknologi (ansikt-til-ansikt + total kjøretid)"},{"$f":"INDEX(Beregning!$B$10:$B$54,'Månedlig registrering'!G5)","v":"Antatt tid per besøk MED velferdsteknologi   (ansikt-til-ansikt + total kjøretid)"},{"$f":"INDEX(Beregning!$B$10:$B$54,'Månedlig registrering'!H5)","v":"Ordinær tjeneste:           antall fysiske besøk per måned "},{"$f":"INDEX(Beregning!$B$10:$B$54,'Månedlig registrering'!I5)","v":"Med velferdsteknologi: antall fysiske besøk per måned"},null,"BLANK","BLANK","BLANK","BLANK",{"$f":"Beregning!B50","v":"Vil bruk av velferdsteknologi gi utsatt plass på korttidsavdeling?"},{"$f":"Beregning!B51","v":"Vil bruk av velferdsteknologi gi utsatt plass på langtidsavdeling?"},{"$f":"Beregning!B52","v":"Hvor mange overliggerdøgn på sykehus antas ungått?"},null,null,null,null,null,null,null,null,null,null,null,null,null,null,null,null,null,null,null,null,null,null,"2018-01-01",null,null,"2018-02-01",null,null,"2018-03-01",null,null,"2018-04-01",null,null,"2018-05-01",null,null,"2018-06-01",null,null,"2018-07-01",null,null,"2018-08-01",null,null,"2018-09-01",null,null,"2018-10-01",null,null,"2018-11-01",null,null,"2018-12-01",null,null,"2019-01-01",null,null,"2019-02-01",null,null,"2019-03-01",null,null,"2019-04-01",null,null,"2019-05-01",null,null,"2019-06-01",null,null,"2019-07-01",null,null,"2019-08-01",null,null,"2019-09-01",null,null,"2019-10-01",null,null,"2019-11-01",null,null,"2019-12-01",null,null,"2020-01-01",null,null,"2020-02-01",null,null,"2020-03-01",null,null,"2020-04-01",null,null,"2020-05-01",null,null,"2020-06-01",null,null,"2020-07-01",null,null,"2020-08-01",null,null,"2020-09-01",null,null,"2020-10-01",null,null,"2020-11-01",null,null,"2020-12-01"]
[null,null,null,null,null,null,null,null,null,{"$f":"+Beregning!E42","v":"Kommentar på hvordan tid og besøk er beregnet"},null,null,null,null,null,null,null,"Etablerings-kostnad for teknologi",null,null,null,null,null,null,null,null,null,null,null,null,null,null,null,null,null,null,null,null,null,"Antall besøk per måned","Dager utsatt institusjons- opphold (kortid - langtid - overliggerdøgn)","Bruker fornøyd?","Antall besøk per måned","Dager utsatt institusjons- opphold (kortid - langtid - overliggerdøgn)","Bruker fornøyd?","Antall besøk per måned","Dager utsatt institusjons- opphold (kortid - langtid - overliggerdøgn)","Bruker fornøyd?","Antall besøk per måned","Dager utsatt institusjons- opphold (kortid - langtid - overliggerdøgn)","Bruker fornøyd?","Antall besøk per måned","Dager utsatt institusjons- opphold (kortid - langtid - overliggerdøgn)","Bruker fornøyd?","Antall besøk per måned","Dager utsatt institusjons- opphold (kortid - langtid - overliggerdøgn)","Bruker fornøyd?","Antall besøk per måned","Dager utsatt institusjons- opphold (kortid - langtid - overliggerdøgn)","Bruker fornøyd?","Antall besøk per måned","Dager utsatt institusjons- opphold (kortid - langtid - overliggerdøgn)","Bruker fornøyd?","Antall besøk per måned","Dager utsatt institusjons- opphold (kortid - langtid - overliggerdøgn)","Bruker fornøyd?","Antall besøk per måned","Dager utsatt institusjons- opphold (kortid - langtid - overliggerdøgn)","Bruker fornøyd?","Antall besøk per måned","Dager utsatt institusjons- opphold (kortid - langtid - overliggerdøgn)","Bruker fornøyd?","Antall besøk per måned","Dager utsatt institusjons- opphold (kortid - langtid - overliggerdøgn)","Bruker fornøyd?","Antall besøk per måned","Dager utsatt institusjons- opphold (kortid - langtid - overliggerdøgn)","Bruker fornøyd?","Antall besøk per måned","Dager utsatt institusjons- opphold (kortid - langtid - overliggerdøgn)","Bruker fornøyd?","Antall besøk per måned","Dager utsatt institusjons- opphold (kortid - langtid - overliggerdøgn)","Bruker fornøyd?","Antall besøk per måned","Dager utsatt institusjons- opphold (kortid - langtid - overliggerdøgn)","Bruker fornøyd?","Antall besøk per måned","Dager utsatt institusjons- opphold (kortid - langtid - overliggerdøgn)","Bruker fornøyd?","Antall besøk per måned","Dager utsatt institusjons- opphold (kortid - langtid - overliggerdøgn)","Bruker fornøyd?","Antall besøk per måned","Dager utsatt institusjons- opphold (kortid - langtid - overliggerdøgn)","Bruker fornøyd?","Antall besøk per måned","Dager utsatt institusjons- opphold (kortid - langtid - overliggerdøgn)","Bruker fornøyd?","Antall besøk per måned","Dager utsatt institusjons- opphold (kortid - langtid - overliggerdøgn)","Bruker fornøyd?","Antall besøk per måned","Dager utsatt institusjons- opphold (kortid - langtid - overliggerdøgn)","Bruker fornøyd?","Antall besøk per måned","Dager utsatt institusjons- opphold (kortid - langtid - overliggerdøgn)","Bruker fornøyd?","Antall besøk per måned","Dager utsatt institusjons- opphold (kortid - langtid - overliggerdøgn)","Bruker fornøyd?","Antall besøk per måned","Dager utsatt institusjons- opphold (kortid - langtid - overliggerdøgn)","Bruker fornøyd?","Antall besøk per måned","Dager utsatt institusjons- opphold (kortid - langtid - overliggerdøgn)","Bruker fornøyd?","Antall besøk per måned","Dager utsatt institusjons- opphold (kortid - langtid - overliggerdøgn)","Bruker fornøyd?","Antall besøk per måned","Dager utsatt institusjons- opphold (kortid - langtid - overliggerdøgn)","Bruker fornøyd?","Antall besøk per måned","Dager utsatt institusjons- opphold (kortid - langtid - overliggerdøgn)","Bruker fornøyd?","Antall besøk per måned","Dager utsatt institusjons- opphold (kortid - langtid - overliggerdøgn)","Bruker fornøyd?","Antall besøk per måned","Dager utsatt institusjons- opphold (kortid - langtid - overliggerdøgn)","Bruker fornøyd?","Antall besøk per måned","Dager utsatt institusjons- opphold (kortid - langtid - overliggerdøgn)","Bruker fornøyd?","Antall besøk per måned","Dager utsatt institusjons- opphold (kortid - langtid - overliggerdøgn)","Bruker fornøyd?","Antall besøk per måned","Dager utsatt institusjons- opphold (kortid - langtid - overliggerdøgn)","Bruker fornøyd?","Antall besøk per måned","Dager utsatt institusjons- opphold (kortid - langtid - overliggerdøgn)","Bruker fornøyd?","Antall besøk per måned","Dager utsatt institusjons- opphold (kortid - langtid - overliggerdøgn)","Bruker fornøyd?"]
[1001,"01.01.2018","Sykepleier 1",1000,1000,30,30,90,10,"Skriv inn kommentar på hvordan besøk og tid er beregnet.",null,null,null,null,"Nei","Nei",0,1500,150,0,0,148,0,0,0,0,0,0,0,0,0,0,0,0,0,0,0,0,{"$f":"OFFSET(Start_ungått_besøk,'Spart tid - ungått besøk'!A3,0)*Timeslønn.Sykepleier+OFFSET(Start_gevinst_utsatt_plass,'Gevinst-utsatt plass'!A3,0)-OFFSET(Start_teknologikostnad,'Mellomregning - teknologikostna'!A3,0)","v":78147.000000000015},90,null,"Nøytral",10,null,"Fornøyd",10,null,"Fornøyd",10,null,"Fornøyd",10,null,"Fornøyd"]
[1002,"05.03.2018","Sykepleier 2",500,1000,10,20,30,2,"Skriv inn kommentar på hvordan besøk og tid er beregnet.",null,null,null,null,"Nei","Nei",0,2000,0,0,0,0,50,0,16.670000000000002,0,0,0,0,0,0,0,0,0,0,0,0,0,{"$f":"OFFSET(Start_ungått_besøk,'Spart tid - ungått besøk'!A4,0)*Timeslønn.Sykepleier+OFFSET(Start_gevinst_utsatt_plass,'Gevinst-utsatt plass'!A4,0)-OFFSET(Start_teknologikostnad,'Mellomregning - teknologikostna'!A4,0)","v":3697.313333333333},null,null,null,null,null,null,30,null,"Fornøyd",2,null,"Fornøyd",2,null,"Fornøyd"]
[1003,"15.01.2018","Sykepleier 1",0,0,null,null,null,null,"Skriv inn kommentar på hvordan besøk og tid er beregnet.",null,null,null,null,"Nei","Ja",0,900,150,0,16.670000000000002,0,0,0,0,0,0,0,0,0,0,0,0,0,0,0,0,0,{"$f":"OFFSET(Start_ungått_besøk,'Spart tid - ungått besøk'!A5,0)*Timeslønn.Sykepleier+OFFSET(Start_gevinst_utsatt_plass,'Gevinst-utsatt plass'!A5,0)-OFFSET(Start_teknologikostnad,'Mellomregning - teknologikostna'!A5,0)","v":453031.48684931512},null,15,null,null,28,null,null,31,null,null,30,null,null,31]
[null,null,null,null,null,null,null,null,null,null,null,null,null,null,null,null,null,null,null,null,null,null,null,null,null,null,null,null,null,null,null,null,null,null,null,null,null,null,{"$f":"OFFSET(Start_ungått_besøk,'Spart tid - ungått besøk'!A6,0)*Timeslønn.Sykepleier+OFFSET(Start_gevinst_utsatt_plass,'Gevinst-utsatt plass'!A6,0)-OFFSET(Start_teknologikostnad,'Mellomregning - teknologikostna'!A6,0)","v":0}]
[null,null,null,null,null,null,null,null,null,null,null,null,null,null,null,null,null,null,null,null,null,null,null,null,null,null,null,null,null,null,null,null,null,null,null,null,null,null,{"$f":"OFFSET(Start_ungått_besøk,'Spart tid - ungått besøk'!A7,0)*Timeslønn.Sykepleier+OFFSET(Start_gevinst_utsatt_plass,'Gevinst-utsatt plass'!A7,0)-OFFSET(Start_teknologikostnad,'Mellomregning - teknologikostna'!A7,0)","v":0}]
[null,null,null,null,null,null,null,null,null,null,null,null,null,null,null,null,null,null,null,null,null,null,null,null,null,null,null,null,null,null,null,null,null,null,null,null,null,null,{"$f":"OFFSET(Start_ungått_besøk,'Spart tid - ungått besøk'!A8,0)*Timeslønn.Sykepleier+OFFSET(Start_gevinst_utsatt_plass,'Gevinst-utsatt plass'!A8,0)-OFFSET(Start_teknologikostnad,'Mellomregning - teknologikostna'!A8,0)","v":0}]
[null,null,null,null,null,null,null,null,null,null,null,null,null,null,null,null,null,null,null,null,null,null,null,null,null,null,null,null,null,null,null,null,null,null,null,null,null,null,{"$f":"OFFSET(Start_ungått_besøk,'Spart tid - ungått besøk'!A9,0)*Timeslønn.Sykepleier+OFFSET(Start_gevinst_utsatt_plass,'Gevinst-utsatt plass'!A9,0)-OFFSET(Start_teknologikostnad,'Mellomregning - teknologikostna'!A9,0)","v":0}]
[null,null,null,null,null,null,null,null,null,null,null,null,null,null,null,null,null,null,null,null,null,null,null,null,null,null,null,null,null,null,null,null,null,null,null,null,null,null,{"$f":"OFFSET(Start_ungått_besøk,'Spart tid - ungått besøk'!A10,0)*Timeslønn.Sykepleier+OFFSET(Start_gevinst_utsatt_plass,'Gevinst-utsatt plass'!A10,0)-OFFSET(Start_teknologikostnad,'Mellomregning - teknologikostna'!A10,0)","v":0}]
[null,null,null,null,null,null,null,null,null,null,null,null,null,null,null,null,null,null,null,null,null,null,null,null,null,null,null,null,null,null,null,null,null,null,null,null,null,null,{"$f":"OFFSET(Start_ungått_besøk,'Spart tid - ungått besøk'!A11,0)*Timeslønn.Sykepleier+OFFSET(Start_gevinst_utsatt_plass,'Gevinst-utsatt plass'!A11,0)-OFFSET(Start_teknologikostnad,'Mellomregning - teknologikostna'!A11,0)","v":0}]
[null,null,null,null,null,null,null,null,null,null,null,null,null,null,null,null,null,null,null,null,null,null,null,null,null,null,null,null,null,null,null,null,null,null,null,null,null,null,{"$f":"OFFSET(Start_ungått_besøk,'Spart tid - ungått besøk'!A12,0)*Timeslønn.Sykepleier+OFFSET(Start_gevinst_utsatt_plass,'Gevinst-utsatt plass'!A12,0)-OFFSET(Start_teknologikostnad,'Mellomregning - teknologikostna'!A12,0)","v":0}]
[null,null,null,null,null,null,null,null,null,null,null,null,null,null,null,null,null,null,null,null,null,null,null,null,null,null,null,null,null,null,null,null,null,null,null,null,null,null,{"$f":"OFFSET(Start_ungått_besøk,'Spart tid - ungått besøk'!A13,0)*Timeslønn.Sykepleier+OFFSET(Start_gevinst_utsatt_plass,'Gevinst-utsatt plass'!A13,0)-OFFSET(Start_teknologikostnad,'Mellomregning - teknologikostna'!A13,0)","v":0}]
[null,null,null,null,null,null,null,null,null,null,null,null,null,null,null,null,null,null,null,null,null,null,null,null,null,null,null,null,null,null,null,null,null,null,null,null,null,null,{"$f":"OFFSET(Start_ungått_besøk,'Spart tid - ungått besøk'!A14,0)*Timeslønn.Sykepleier+OFFSET(Start_gevinst_utsatt_plass,'Gevinst-utsatt plass'!A14,0)-OFFSET(Start_teknologikostnad,'Mellomregning - teknologikostna'!A14,0)","v":0}]
[null,null,null,null,null,null,null,null,null,null,null,null,null,null,null,null,null,null,null,null,null,null,null,null,null,null,null,null,null,null,null,null,null,null,null,null,null,null,{"$f":"OFFSET(Start_ungått_besøk,'Spart tid - ungått besøk'!A15,0)*Timeslønn.Sykepleier+OFFSET(Start_gevinst_utsatt_plass,'Gevinst-utsatt plass'!A15,0)-OFFSET(Start_teknologikostnad,'Mellomregning - teknologikostna'!A15,0)","v":0}]
[null,null,null,null,null,null,null,null,null,null,null,null,null,null,null,null,null,null,null,null,null,null,null,null,null,null,null,null,null,null,null,null,null,null,null,null,null,null,{"$f":"OFFSET(Start_ungått_besøk,'Spart tid - ungått besøk'!A16,0)*Timeslønn.Sykepleier+OFFSET(Start_gevinst_utsatt_plass,'Gevinst-utsatt plass'!A16,0)-OFFSET(Start_teknologikostnad,'Mellomregning - teknologikostna'!A16,0)","v":0}]
[null,null,null,null,null,null,null,null,null,null,null,null,null,null,null,null,null,null,null,null,null,null,null,null,null,null,null,null,null,null,null,null,null,null,null,null,null,null,{"$f":"OFFSET(Start_ungått_besøk,'Spart tid - ungått besøk'!A17,0)*Timeslønn.Sykepleier+OFFSET(Start_gevinst_utsatt_plass,'Gevinst-utsatt plass'!A17,0)-OFFSET(Start_teknologikostnad,'Mellomregning - teknologikostna'!A17,0)","v":0}]
[null,null,null,null,null,null,null,null,null,null,null,null,null,null,null,null,null,null,null,null,null,null,null,null,null,null,null,null,null,null,null,null,null,null,null,null,null,null,{"$f":"OFFSET(Start_ungått_besøk,'Spart tid - ungått besøk'!A18,0)*Timeslønn.Sykepleier+OFFSET(Start_gevinst_utsatt_plass,'Gevinst-utsatt plass'!A18,0)-OFFSET(Start_teknologikostnad,'Mellomregning - teknologikostna'!A18,0)","v":0}]
[null,null,null,null,null,null,null,null,null,null,null,null,null,null,null,null,null,null,null,null,null,null,null,null,null,null,null,null,null,null,null,null,null,null,null,null,null,null,{"$f":"OFFSET(Start_ungått_besøk,'Spart tid - ungått besøk'!A19,0)*Timeslønn.Sykepleier+OFFSET(Start_gevinst_utsatt_plass,'Gevinst-utsatt plass'!A19,0)-OFFSET(Start_teknologikostnad,'Mellomregning - teknologikostna'!A19,0)","v":0}]
[null,null,null,null,null,null,null,null,null,null,null,null,null,null,null,null,null,null,null,null,null,null,null,null,null,null,null,null,null,null,null,null,null,null,null,null,null,null,{"$f":"OFFSET(Start_ungått_besøk,'Spart tid - ungått besøk'!A20,0)*Timeslønn.Sykepleier+OFFSET(Start_gevinst_utsatt_plass,'Gevinst-utsatt plass'!A20,0)-OFFSET(Start_teknologikostnad,'Mellomregning - teknologikostna'!A20,0)","v":0}]
[null,null,null,null,null,null,null,null,null,null,null,null,null,null,null,null,null,null,null,null,null,null,null,null,null,null,null,null,null,null,null,null,null,null,null,null,null,null,{"$f":"OFFSET(Start_ungått_besøk,'Spart tid - ungått besøk'!A21,0)*Timeslønn.Sykepleier+OFFSET(Start_gevinst_utsatt_plass,'Gevinst-utsatt plass'!A21,0)-OFFSET(Start_teknologikostnad,'Mellomregning - teknologikostna'!A21,0)","v":0}]
[null,null,null,null,null,null,null,null,null,null,null,null,null,null,null,null,null,null,null,null,null,null,null,null,null,null,null,null,null,null,null,null,null,null,null,null,null,null,{"$f":"OFFSET(Start_ungått_besøk,'Spart tid - ungått besøk'!A22,0)*Timeslønn.Sykepleier+OFFSET(Start_gevinst_utsatt_plass,'Gevinst-utsatt plass'!A22,0)-OFFSET(Start_teknologikostnad,'Mellomregning - teknologikostna'!A22,0)","v":0}]
[null,null,null,null,null,null,null,null,null,null,null,null,null,null,null,null,null,null,null,null,null,null,null,null,null,null,null,null,null,null,null,null,null,null,null,null,null,null,{"$f":"OFFSET(Start_ungått_besøk,'Spart tid - ungått besøk'!A23,0)*Timeslønn.Sykepleier+OFFSET(Start_gevinst_utsatt_plass,'Gevinst-utsatt plass'!A23,0)-OFFSET(Start_teknologikostnad,'Mellomregning - teknologikostna'!A23,0)","v":0}]
[null,null,null,null,null,null,null,null,null,null,null,null,null,null,null,null,null,null,null,null,null,null,null,null,null,null,null,null,null,null,null,null,null,null,null,null,null,null,{"$f":"OFFSET(Start_ungått_besøk,'Spart tid - ungått besøk'!A24,0)*Timeslønn.Sykepleier+OFFSET(Start_gevinst_utsatt_plass,'Gevinst-utsatt plass'!A24,0)-OFFSET(Start_teknologikostnad,'Mellomregning - teknologikostna'!A24,0)","v":0}]
[null,null,null,null,null,null,null,null,null,null,null,null,null,null,null,null,null,null,null,null,null,null,null,null,null,null,null,null,null,null,null,null,null,null,null,null,null,null,{"$f":"OFFSET(Start_ungått_besøk,'Spart tid - ungått besøk'!A25,0)*Timeslønn.Sykepleier+OFFSET(Start_gevinst_utsatt_plass,'Gevinst-utsatt plass'!A25,0)-OFFSET(Start_teknologikostnad,'Mellomregning - teknologikostna'!A25,0)","v":0}]
[null,null,null,null,null,null,null,null,null,null,null,null,null,null,null,null,null,null,null,null,null,null,null,null,null,null,null,null,null,null,null,null,null,null,null,null,null,null,{"$f":"OFFSET(Start_ungått_besøk,'Spart tid - ungått besøk'!A26,0)*Timeslønn.Sykepleier+OFFSET(Start_gevinst_utsatt_plass,'Gevinst-utsatt plass'!A26,0)-OFFSET(Start_teknologikostnad,'Mellomregning - teknologikostna'!A26,0)","v":0}]
[null,null,null,null,null,null,null,null,null,null,null,null,null,null,null,null,null,null,null,null,null,null,null,null,null,null,null,null,null,null,null,null,null,null,null,null,null,null,{"$f":"OFFSET(Start_ungått_besøk,'Spart tid - ungått besøk'!A27,0)*Timeslønn.Sykepleier+OFFSET(Start_gevinst_utsatt_plass,'Gevinst-utsatt plass'!A27,0)-OFFSET(Start_teknologikostnad,'Mellomregning - teknologikostna'!A27,0)","v":0}]
[null,null,null,null,null,null,null,null,null,null,null,null,null,null,null,null,null,null,null,null,null,null,null,null,null,null,null,null,null,null,null,null,null,null,null,null,null,null,{"$f":"OFFSET(Start_ungått_besøk,'Spart tid - ungått besøk'!A28,0)*Timeslønn.Sykepleier+OFFSET(Start_gevinst_utsatt_plass,'Gevinst-utsatt plass'!A28,0)-OFFSET(Start_teknologikostnad,'Mellomregning - teknologikostna'!A28,0)","v":0}]
[null,null,null,null,null,null,null,null,null,null,null,null,null,null,null,null,null,null,null,null,null,null,null,null,null,null,null,null,null,null,null,null,null,null,null,null,null,null,{"$f":"OFFSET(Start_ungått_besøk,'Spart tid - ungått besøk'!A29,0)*Timeslønn.Sykepleier+OFFSET(Start_gevinst_utsatt_plass,'Gevinst-utsatt plass'!A29,0)-OFFSET(Start_teknologikostnad,'Mellomregning - teknologikostna'!A29,0)","v":0}]
[null,null,null,null,null,null,null,null,null,null,null,null,null,null,null,null,null,null,null,null,null,null,null,null,null,null,null,null,null,null,null,null,null,null,null,null,null,null,{"$f":"OFFSET(Start_ungått_besøk,'Spart tid - ungått besøk'!A30,0)*Timeslønn.Sykepleier+OFFSET(Start_gevinst_utsatt_plass,'Gevinst-utsatt plass'!A30,0)-OFFSET(Start_teknologikostnad,'Mellomregning - teknologikostna'!A30,0)","v":0}]
[null,null,null,null,null,null,null,null,null,null,null,null,null,null,null,null,null,null,null,null,null,null,null,null,null,null,null,null,null,null,null,null,null,null,null,null,null,null,{"$f":"OFFSET(Start_ungått_besøk,'Spart tid - ungått besøk'!A31,0)*Timeslønn.Sykepleier+OFFSET(Start_gevinst_utsatt_plass,'Gevinst-utsatt plass'!A31,0)-OFFSET(Start_teknologikostnad,'Mellomregning - teknologikostna'!A31,0)","v":0}]
[null,null,null,null,null,null,null,null,null,null,null,null,null,null,null,null,null,null,null,null,null,null,null,null,null,null,null,null,null,null,null,null,null,null,null,null,null,null,{"$f":"OFFSET(Start_ungått_besøk,'Spart tid - ungått besøk'!A32,0)*Timeslønn.Sykepleier+OFFSET(Start_gevinst_utsatt_plass,'Gevinst-utsatt plass'!A32,0)-OFFSET(Start_teknologikostnad,'Mellomregning - teknologikostna'!A32,0)","v":0}]
[null,null,null,null,null,null,null,null,null,null,null,null,null,null,null,null,null,null,null,null,null,null,null,null,null,null,null,null,null,null,null,null,null,null,null,null,null,null,{"$f":"OFFSET(Start_ungått_besøk,'Spart tid - ungått besøk'!A33,0)*Timeslønn.Sykepleier+OFFSET(Start_gevinst_utsatt_plass,'Gevinst-utsatt plass'!A33,0)-OFFSET(Start_teknologikostnad,'Mellomregning - teknologikostna'!A33,0)","v":0}]
[null,null,null,null,null,null,null,null,null,null,null,null,null,null,null,null,null,null,null,null,null,null,null,null,null,null,null,null,null,null,null,null,null,null,null,null,null,null,{"$f":"OFFSET(Start_ungått_besøk,'Spart tid - ungått besøk'!A34,0)*Timeslønn.Sykepleier+OFFSET(Start_gevinst_utsatt_plass,'Gevinst-utsatt plass'!A34,0)-OFFSET(Start_teknologikostnad,'Mellomregning - teknologikostna'!A34,0)","v":0}]
[null,null,null,null,null,null,null,null,null,null,null,null,null,null,null,null,null,null,null,null,null,null,null,null,null,null,null,null,null,null,null,null,null,null,null,null,null,null,{"$f":"OFFSET(Start_ungått_besøk,'Spart tid - ungått besøk'!A35,0)*Timeslønn.Sykepleier+OFFSET(Start_gevinst_utsatt_plass,'Gevinst-utsatt plass'!A35,0)-OFFSET(Start_teknologikostnad,'Mellomregning - teknologikostna'!A35,0)","v":0}]
[null,null,null,null,null,null,null,null,null,null,null,null,null,null,null,null,null,null,null,null,null,null,null,null,null,null,null,null,null,null,null,null,null,null,null,null,null,null,{"$f":"OFFSET(Start_ungått_besøk,'Spart tid - ungått besøk'!A36,0)*Timeslønn.Sykepleier+OFFSET(Start_gevinst_utsatt_plass,'Gevinst-utsatt plass'!A36,0)-OFFSET(Start_teknologikostnad,'Mellomregning - teknologikostna'!A36,0)","v":0}]
[null,null,null,null,null,null,null,null,null,null,null,null,null,null,null,null,null,null,null,null,null,null,null,null,null,null,null,null,null,null,null,null,null,null,null,null,null,null,{"$f":"OFFSET(Start_ungått_besøk,'Spart tid - ungått besøk'!A37,0)*Timeslønn.Sykepleier+OFFSET(Start_gevinst_utsatt_plass,'Gevinst-utsatt plass'!A37,0)-OFFSET(Start_teknologikostnad,'Mellomregning - teknologikostna'!A37,0)","v":0}]
[null,null,null,null,null,null,null,null,null,null,null,null,null,null,null,null,null,null,null,null,null,null,null,null,null,null,null,null,null,null,null,null,null,null,null,null,null,null,{"$f":"OFFSET(Start_ungått_besøk,'Spart tid - ungått besøk'!A38,0)*Timeslønn.Sykepleier+OFFSET(Start_gevinst_utsatt_plass,'Gevinst-utsatt plass'!A38,0)-OFFSET(Start_teknologikostnad,'Mellomregning - teknologikostna'!A38,0)","v":0}]
[null,null,null,null,null,null,null,null,null,null,null,null,null,null,null,null,null,null,null,null,null,null,null,null,null,null,null,null,null,null,null,null,null,null,null,null,null,null,{"$f":"OFFSET(Start_ungått_besøk,'Spart tid - ungått besøk'!A39,0)*Timeslønn.Sykepleier+OFFSET(Start_gevinst_utsatt_plass,'Gevinst-utsatt plass'!A39,0)-OFFSET(Start_teknologikostnad,'Mellomregning - teknologikostna'!A39,0)","v":0}]
[null,null,null,null,null,null,null,null,null,null,null,null,null,null,null,null,null,null,null,null,null,null,null,null,null,null,null,null,null,null,null,null,null,null,null,null,null,null,{"$f":"OFFSET(Start_ungått_besøk,'Spart tid - ungått besøk'!A40,0)*Timeslønn.Sykepleier+OFFSET(Start_gevinst_utsatt_plass,'Gevinst-utsatt plass'!A40,0)-OFFSET(Start_teknologikostnad,'Mellomregning - teknologikostna'!A40,0)","v":0}]
[null,null,null,null,null,null,null,null,null,null,null,null,null,null,null,null,null,null,null,null,null,null,null,null,null,null,null,null,null,null,null,null,null,null,null,null,null,null,{"$f":"OFFSET(Start_ungått_besøk,'Spart tid - ungått besøk'!A41,0)*Timeslønn.Sykepleier+OFFSET(Start_gevinst_utsatt_plass,'Gevinst-utsatt plass'!A41,0)-OFFSET(Start_teknologikostnad,'Mellomregning - teknologikostna'!A41,0)","v":0}]
[null,null,null,null,null,null,null,null,null,null,null,null,null,null,null,null,null,null,null,null,null,null,null,null,null,null,null,null,null,null,null,null,null,null,null,null,null,null,{"$f":"OFFSET(Start_ungått_besøk,'Spart tid - ungått besøk'!A42,0)*Timeslønn.Sykepleier+OFFSET(Start_gevinst_utsatt_plass,'Gevinst-utsatt plass'!A42,0)-OFFSET(Start_teknologikostnad,'Mellomregning - teknologikostna'!A42,0)","v":0}]
[null,null,null,null,null,null,null,null,null,null,null,null,null,null,null,null,null,null,null,null,null,null,null,null,null,null,null,null,null,null,null,null,null,null,null,null,null,null,{"$f":"OFFSET(Start_ungått_besøk,'Spart tid - ungått besøk'!A43,0)*Timeslønn.Sykepleier+OFFSET(Start_gevinst_utsatt_plass,'Gevinst-utsatt plass'!A43,0)-OFFSET(Start_teknologikostnad,'Mellomregning - teknologikostna'!A43,0)","v":0}]
[null,null,null,null,null,null,null,null,null,null,null,null,null,null,null,null,null,null,null,null,null,null,null,null,null,null,null,null,null,null,null,null,null,null,null,null,null,null,{"$f":"OFFSET(Start_ungått_besøk,'Spart tid - ungått besøk'!A44,0)*Timeslønn.Sykepleier+OFFSET(Start_gevinst_utsatt_plass,'Gevinst-utsatt plass'!A44,0)-OFFSET(Start_teknologikostnad,'Mellomregning - teknologikostna'!A44,0)","v":0}]
[null,null,null,null,null,null,null,null,null,null,null,null,null,null,null,null,null,null,null,null,null,null,null,null,null,null,null,null,null,null,null,null,null,null,null,null,null,null,{"$f":"OFFSET(Start_ungått_besøk,'Spart tid - ungått besøk'!A45,0)*Timeslønn.Sykepleier+OFFSET(Start_gevinst_utsatt_plass,'Gevinst-utsatt plass'!A45,0)-OFFSET(Start_teknologikostnad,'Mellomregning - teknologikostna'!A45,0)","v":0}]
[null,null,null,null,null,null,null,null,null,null,null,null,null,null,null,null,null,null,null,null,null,null,null,null,null,null,null,null,null,null,null,null,null,null,null,null,null,null,{"$f":"OFFSET(Start_ungått_besøk,'Spart tid - ungått besøk'!A46,0)*Timeslønn.Sykepleier+OFFSET(Start_gevinst_utsatt_plass,'Gevinst-utsatt plass'!A46,0)-OFFSET(Start_teknologikostnad,'Mellomregning - teknologikostna'!A46,0)","v":0}]
[null,null,null,null,null,null,null,null,null,null,null,null,null,null,null,null,null,null,null,null,null,null,null,null,null,null,null,null,null,null,null,null,null,null,null,null,null,null,{"$f":"OFFSET(Start_ungått_besøk,'Spart tid - ungått besøk'!A47,0)*Timeslønn.Sykepleier+OFFSET(Start_gevinst_utsatt_plass,'Gevinst-utsatt plass'!A47,0)-OFFSET(Start_teknologikostnad,'Mellomregning - teknologikostna'!A47,0)","v":0}]
[null,null,null,null,null,null,null,null,null,null,null,null,null,null,null,null,null,null,null,null,null,null,null,null,null,null,null,null,null,null,null,null,null,null,null,null,null,null,{"$f":"OFFSET(Start_ungått_besøk,'Spart tid - ungått besøk'!A48,0)*Timeslønn.Sykepleier+OFFSET(Start_gevinst_utsatt_plass,'Gevinst-utsatt plass'!A48,0)-OFFSET(Start_teknologikostnad,'Mellomregning - teknologikostna'!A48,0)","v":0}]
[null,null,null,null,null,null,null,null,null,null,null,null,null,null,null,null,null,null,null,null,null,null,null,null,null,null,null,null,null,null,null,null,null,null,null,null,null,null,{"$f":"OFFSET(Start_ungått_besøk,'Spart tid - ungått besøk'!A49,0)*Timeslønn.Sykepleier+OFFSET(Start_gevinst_utsatt_plass,'Gevinst-utsatt plass'!A49,0)-OFFSET(Start_teknologikostnad,'Mellomregning - teknologikostna'!A49,0)","v":0}]
[null,null,null,null,null,null,null,null,null,null,null,null,null,null,null,null,null,null,null,null,null,null,null,null,null,null,null,null,null,null,null,null,null,null,null,null,null,null,{"$f":"OFFSET(Start_ungått_besøk,'Spart tid - ungått besøk'!A50,0)*Timeslønn.Sykepleier+OFFSET(Start_gevinst_utsatt_plass,'Gevinst-utsatt plass'!A50,0)-OFFSET(Start_teknologikostnad,'Mellomregning - teknologikostna'!A50,0)","v":0}]
[null,null,null,null,null,null,null,null,null,null,null,null,null,null,null,null,null,null,null,null,null,null,null,null,null,null,null,null,null,null,null,null,null,null,null,null,null,null,{"$f":"OFFSET(Start_ungått_besøk,'Spart tid - ungått besøk'!A51,0)*Timeslønn.Sykepleier+OFFSET(Start_gevinst_utsatt_plass,'Gevinst-utsatt plass'!A51,0)-OFFSET(Start_teknologikostnad,'Mellomregning - teknologikostna'!A51,0)","v":0}]
[null,null,null,null,null,null,null,null,null,null,null,null,null,null,null,null,null,null,null,null,null,null,null,null,null,null,null,null,null,null,null,null,null,null,null,null,null,null,{"$f":"OFFSET(Start_ungått_besøk,'Spart tid - ungått besøk'!A52,0)*Timeslønn.Sykepleier+OFFSET(Start_gevinst_utsatt_plass,'Gevinst-utsatt plass'!A52,0)-OFFSET(Start_teknologikostnad,'Mellomregning - teknologikostna'!A52,0)","v":0}]
[null,null,null,null,null,null,null,null,null,null,null,null,null,null,null,null,null,null,null,null,null,null,null,null,null,null,null,null,null,null,null,null,null,null,null,null,null,null,{"$f":"OFFSET(Start_ungått_besøk,'Spart tid - ungått besøk'!A53,0)*Timeslønn.Sykepleier+OFFSET(Start_gevinst_utsatt_plass,'Gevinst-utsatt plass'!A53,0)-OFFSET(Start_teknologikostnad,'Mellomregning - teknologikostna'!A53,0)","v":0}]
[null,null,null,null,null,null,null,null,null,null,null,null,null,null,null,null,null,null,null,null,null,null,null,null,null,null,null,null,null,null,null,null,null,null,null,null,null,null,{"$f":"OFFSET(Start_ungått_besøk,'Spart tid - ungått besøk'!A54,0)*Timeslønn.Sykepleier+OFFSET(Start_gevinst_utsatt_plass,'Gevinst-utsatt plass'!A54,0)-OFFSET(Start_teknologikostnad,'Mellomregning - teknologikostna'!A54,0)","v":0}]
[null,null,null,null,null,null,null,null,null,null,null,null,null,null,null,null,null,null,null,null,null,null,null,null,null,null,null,null,null,null,null,null,null,null,null,null,null,null,{"$f":"OFFSET(Start_ungått_besøk,'Spart tid - ungått besøk'!A55,0)*Timeslønn.Sykepleier+OFFSET(Start_gevinst_utsatt_plass,'Gevinst-utsatt plass'!A55,0)-OFFSET(Start_teknologikostnad,'Mellomregning - teknologikostna'!A55,0)","v":0}]
[null,null,null,null,null,null,null,null,null,null,null,null,null,null,null,null,null,null,null,null,null,null,null,null,null,null,null,null,null,null,null,null,null,null,null,null,null,null,{"$f":"OFFSET(Start_ungått_besøk,'Spart tid - ungått besøk'!A56,0)*Timeslønn.Sykepleier+OFFSET(Start_gevinst_utsatt_plass,'Gevinst-utsatt plass'!A56,0)-OFFSET(Start_teknologikostnad,'Mellomregning - teknologikostna'!A56,0)","v":0}]
[null,null,null,null,null,null,null,null,null,null,null,null,null,null,null,null,null,null,null,null,null,null,null,null,null,null,null,null,null,null,null,null,null,null,null,null,null,null,{"$f":"OFFSET(Start_ungått_besøk,'Spart tid - ungått besøk'!A57,0)*Timeslønn.Sykepleier+OFFSET(Start_gevinst_utsatt_plass,'Gevinst-utsatt plass'!A57,0)-OFFSET(Start_teknologikostnad,'Mellomregning - teknologikostna'!A57,0)","v":0}]
[null,null,null,null,null,null,null,null,null,null,null,null,null,null,null,null,null,null,null,null,null,null,null,null,null,null,null,null,null,null,null,null,null,null,null,null,null,null,{"$f":"OFFSET(Start_ungått_besøk,'Spart tid - ungått besøk'!A58,0)*Timeslønn.Sykepleier+OFFSET(Start_gevinst_utsatt_plass,'Gevinst-utsatt plass'!A58,0)-OFFSET(Start_teknologikostnad,'Mellomregning - teknologikostna'!A58,0)","v":0}]
[null,null,null,null,null,null,null,null,null,null,null,null,null,null,null,null,null,null,null,null,null,null,null,null,null,null,null,null,null,null,null,null,null,null,null,null,null,null,{"$f":"OFFSET(Start_ungått_besøk,'Spart tid - ungått besøk'!A59,0)*Timeslønn.Sykepleier+OFFSET(Start_gevinst_utsatt_plass,'Gevinst-utsatt plass'!A59,0)-OFFSET(Start_teknologikostnad,'Mellomregning - teknologikostna'!A59,0)","v":0}]
[null,null,null,null,null,null,null,null,null,null,null,null,null,null,null,null,null,null,null,null,null,null,null,null,null,null,null,null,null,null,null,null,null,null,null,null,null,null,{"$f":"OFFSET(Start_ungått_besøk,'Spart tid - ungått besøk'!A60,0)*Timeslønn.Sykepleier+OFFSET(Start_gevinst_utsatt_plass,'Gevinst-utsatt plass'!A60,0)-OFFSET(Start_teknologikostnad,'Mellomregning - teknologikostna'!A60,0)","v":0}]
[null,null,null,null,null,null,null,null,null,null,null,null,null,null,null,null,null,null,null,null,null,null,null,null,null,null,null,null,null,null,null,null,null,null,null,null,null,null,{"$f":"OFFSET(Start_ungått_besøk,'Spart tid - ungått besøk'!A61,0)*Timeslønn.Sykepleier+OFFSET(Start_gevinst_utsatt_plass,'Gevinst-utsatt plass'!A61,0)-OFFSET(Start_teknologikostnad,'Mellomregning - teknologikostna'!A61,0)","v":0}]
[null,null,null,null,null,null,null,null,null,null,null,null,null,null,null,null,null,null,null,null,null,null,null,null,null,null,null,null,null,null,null,null,null,null,null,null,null,null,{"$f":"OFFSET(Start_ungått_besøk,'Spart tid - ungått besøk'!A62,0)*Timeslønn.Sykepleier+OFFSET(Start_gevinst_utsatt_plass,'Gevinst-utsatt plass'!A62,0)-OFFSET(Start_teknologikostnad,'Mellomregning - teknologikostna'!A62,0)","v":0}]
[null,null,null,null,null,null,null,null,null,null,null,null,null,null,null,null,null,null,null,null,null,null,null,null,null,null,null,null,null,null,null,null,null,null,null,null,null,null,{"$f":"OFFSET(Start_ungått_besøk,'Spart tid - ungått besøk'!A63,0)*Timeslønn.Sykepleier+OFFSET(Start_gevinst_utsatt_plass,'Gevinst-utsatt plass'!A63,0)-OFFSET(Start_teknologikostnad,'Mellomregning - teknologikostna'!A63,0)","v":0}]
[null,null,null,null,null,null,null,null,null,null,null,null,null,null,null,null,null,null,null,null,null,null,null,null,null,null,null,null,null,null,null,null,null,null,null,null,null,null,{"$f":"OFFSET(Start_ungått_besøk,'Spart tid - ungått besøk'!A64,0)*Timeslønn.Sykepleier+OFFSET(Start_gevinst_utsatt_plass,'Gevinst-utsatt plass'!A64,0)-OFFSET(Start_teknologikostnad,'Mellomregning - teknologikostna'!A64,0)","v":0}]
[null,null,null,null,null,null,null,null,null,null,null,null,null,null,null,null,null,null,null,null,null,null,null,null,null,null,null,null,null,null,null,null,null,null,null,null,null,null,{"$f":"OFFSET(Start_ungått_besøk,'Spart tid - ungått besøk'!A65,0)*Timeslønn.Sykepleier+OFFSET(Start_gevinst_utsatt_plass,'Gevinst-utsatt plass'!A65,0)-OFFSET(Start_teknologikostnad,'Mellomregning - teknologikostna'!A65,0)","v":0}]
[null,null,null,null,null,null,null,null,null,null,null,null,null,null,null,null,null,null,null,null,null,null,null,null,null,null,null,null,null,null,null,null,null,null,null,null,null,null,{"$f":"OFFSET(Start_ungått_besøk,'Spart tid - ungått besøk'!A66,0)*Timeslønn.Sykepleier+OFFSET(Start_gevinst_utsatt_plass,'Gevinst-utsatt plass'!A66,0)-OFFSET(Start_teknologikostnad,'Mellomregning - teknologikostna'!A66,0)","v":0}]
[null,null,null,null,null,null,null,null,null,null,null,null,null,null,null,null,null,null,null,null,null,null,null,null,null,null,null,null,null,null,null,null,null,null,null,null,null,null,{"$f":"OFFSET(Start_ungått_besøk,'Spart tid - ungått besøk'!A67,0)*Timeslønn.Sykepleier+OFFSET(Start_gevinst_utsatt_plass,'Gevinst-utsatt plass'!A67,0)-OFFSET(Start_teknologikostnad,'Mellomregning - teknologikostna'!A67,0)","v":0}]
[null,null,null,null,null,null,null,null,null,null,null,null,null,null,null,null,null,null,null,null,null,null,null,null,null,null,null,null,null,null,null,null,null,null,null,null,null,null,{"$f":"OFFSET(Start_ungått_besøk,'Spart tid - ungått besøk'!A68,0)*Timeslønn.Sykepleier+OFFSET(Start_gevinst_utsatt_plass,'Gevinst-utsatt plass'!A68,0)-OFFSET(Start_teknologikostnad,'Mellomregning - teknologikostna'!A68,0)","v":0}]
[null,null,null,null,null,null,null,null,null,null,null,null,null,null,null,null,null,null,null,null,null,null,null,null,null,null,null,null,null,null,null,null,null,null,null,null,null,null,{"$f":"OFFSET(Start_ungått_besøk,'Spart tid - ungått besøk'!A69,0)*Timeslønn.Sykepleier+OFFSET(Start_gevinst_utsatt_plass,'Gevinst-utsatt plass'!A69,0)-OFFSET(Start_teknologikostnad,'Mellomregning - teknologikostna'!A69,0)","v":0}]
[null,null,null,null,null,null,null,null,null,null,null,null,null,null,null,null,null,null,null,null,null,null,null,null,null,null,null,null,null,null,null,null,null,null,null,null,null,null,{"$f":"OFFSET(Start_ungått_besøk,'Spart tid - ungått besøk'!A70,0)*Timeslønn.Sykepleier+OFFSET(Start_gevinst_utsatt_plass,'Gevinst-utsatt plass'!A70,0)-OFFSET(Start_teknologikostnad,'Mellomregning - teknologikostna'!A70,0)","v":0}]
[null,null,null,null,null,null,null,null,null,null,null,null,null,null,null,null,null,null,null,null,null,null,null,null,null,null,null,null,null,null,null,null,null,null,null,null,null,null,{"$f":"OFFSET(Start_ungått_besøk,'Spart tid - ungått besøk'!A71,0)*Timeslønn.Sykepleier+OFFSET(Start_gevinst_utsatt_plass,'Gevinst-utsatt plass'!A71,0)-OFFSET(Start_teknologikostnad,'Mellomregning - teknologikostna'!A71,0)","v":0}]
[null,null,null,null,null,null,null,null,null,null,null,null,null,null,null,null,null,null,null,null,null,null,null,null,null,null,null,null,null,null,null,null,null,null,null,null,null,null,{"$f":"OFFSET(Start_ungått_besøk,'Spart tid - ungått besøk'!A72,0)*Timeslønn.Sykepleier+OFFSET(Start_gevinst_utsatt_plass,'Gevinst-utsatt plass'!A72,0)-OFFSET(Start_teknologikostnad,'Mellomregning - teknologikostna'!A72,0)","v":0}]
[null,null,null,null,null,null,null,null,null,null,null,null,null,null,null,null,null,null,null,null,null,null,null,null,null,null,null,null,null,null,null,null,null,null,null,null,null,null,{"$f":"OFFSET(Start_ungått_besøk,'Spart tid - ungått besøk'!A73,0)*Timeslønn.Sykepleier+OFFSET(Start_gevinst_utsatt_plass,'Gevinst-utsatt plass'!A73,0)-OFFSET(Start_teknologikostnad,'Mellomregning - teknologikostna'!A73,0)","v":0}]
[null,null,null,null,null,null,null,null,null,null,null,null,null,null,null,null,null,null,null,null,null,null,null,null,null,null,null,null,null,null,null,null,null,null,null,null,null,null,{"$f":"OFFSET(Start_ungått_besøk,'Spart tid - ungått besøk'!A74,0)*Timeslønn.Sykepleier+OFFSET(Start_gevinst_utsatt_plass,'Gevinst-utsatt plass'!A74,0)-OFFSET(Start_teknologikostnad,'Mellomregning - teknologikostna'!A74,0)","v":0}]
[null,null,null,null,null,null,null,null,null,null,null,null,null,null,null,null,null,null,null,null,null,null,null,null,null,null,null,null,null,null,null,null,null,null,null,null,null,null,{"$f":"OFFSET(Start_ungått_besøk,'Spart tid - ungått besøk'!A75,0)*Timeslønn.Sykepleier+OFFSET(Start_gevinst_utsatt_plass,'Gevinst-utsatt plass'!A75,0)-OFFSET(Start_teknologikostnad,'Mellomregning - teknologikostna'!A75,0)","v":0}]
[null,null,null,null,null,null,null,null,null,null,null,null,null,null,null,null,null,null,null,null,null,null,null,null,null,null,null,null,null,null,null,null,null,null,null,null,null,null,{"$f":"OFFSET(Start_ungått_besøk,'Spart tid - ungått besøk'!A76,0)*Timeslønn.Sykepleier+OFFSET(Start_gevinst_utsatt_plass,'Gevinst-utsatt plass'!A76,0)-OFFSET(Start_teknologikostnad,'Mellomregning - teknologikostna'!A76,0)","v":0}]
[null,null,null,null,null,null,null,null,null,null,null,null,null,null,null,null,null,null,null,null,null,null,null,null,null,null,null,null,null,null,null,null,null,null,null,null,null,null,{"$f":"OFFSET(Start_ungått_besøk,'Spart tid - ungått besøk'!A77,0)*Timeslønn.Sykepleier+OFFSET(Start_gevinst_utsatt_plass,'Gevinst-utsatt plass'!A77,0)-OFFSET(Start_teknologikostnad,'Mellomregning - teknologikostna'!A77,0)","v":0}]
[null,null,null,null,null,null,null,null,null,null,null,null,null,null,null,null,null,null,null,null,null,null,null,null,null,null,null,null,null,null,null,null,null,null,null,null,null,null,{"$f":"OFFSET(Start_ungått_besøk,'Spart tid - ungått besøk'!A78,0)*Timeslønn.Sykepleier+OFFSET(Start_gevinst_utsatt_plass,'Gevinst-utsatt plass'!A78,0)-OFFSET(Start_teknologikostnad,'Mellomregning - teknologikostna'!A78,0)","v":0}]
[null,null,null,null,null,null,null,null,null,null,null,null,null,null,null,null,null,null,null,null,null,null,null,null,null,null,null,null,null,null,null,null,null,null,null,null,null,null,{"$f":"OFFSET(Start_ungått_besøk,'Spart tid - ungått besøk'!A79,0)*Timeslønn.Sykepleier+OFFSET(Start_gevinst_utsatt_plass,'Gevinst-utsatt plass'!A79,0)-OFFSET(Start_teknologikostnad,'Mellomregning - teknologikostna'!A79,0)","v":0}]
[null,null,null,null,null,null,null,null,null,null,null,null,null,null,null,null,null,null,null,null,null,null,null,null,null,null,null,null,null,null,null,null,null,null,null,null,null,null,{"$f":"OFFSET(Start_ungått_besøk,'Spart tid - ungått besøk'!A80,0)*Timeslønn.Sykepleier+OFFSET(Start_gevinst_utsatt_plass,'Gevinst-utsatt plass'!A80,0)-OFFSET(Start_teknologikostnad,'Mellomregning - teknologikostna'!A80,0)","v":0}]
[null,null,null,null,null,null,null,null,null,null,null,null,null,null,null,null,null,null,null,null,null,null,null,null,null,null,null,null,null,null,null,null,null,null,null,null,null,null,{"$f":"OFFSET(Start_ungått_besøk,'Spart tid - ungått besøk'!A81,0)*Timeslønn.Sykepleier+OFFSET(Start_gevinst_utsatt_plass,'Gevinst-utsatt plass'!A81,0)-OFFSET(Start_teknologikostnad,'Mellomregning - teknologikostna'!A81,0)","v":0}]
[null,null,null,null,null,null,null,null,null,null,null,null,null,null,null,null,null,null,null,null,null,null,null,null,null,null,null,null,null,null,null,null,null,null,null,null,null,null,{"$f":"OFFSET(Start_ungått_besøk,'Spart tid - ungått besøk'!A82,0)*Timeslønn.Sykepleier+OFFSET(Start_gevinst_utsatt_plass,'Gevinst-utsatt plass'!A82,0)-OFFSET(Start_teknologikostnad,'Mellomregning - teknologikostna'!A82,0)","v":0}]
[null,null,null,null,null,null,null,null,null,null,null,null,null,null,null,null,null,null,null,null,null,null,null,null,null,null,null,null,null,null,null,null,null,null,null,null,null,null,{"$f":"OFFSET(Start_ungått_besøk,'Spart tid - ungått besøk'!A83,0)*Timeslønn.Sykepleier+OFFSET(Start_gevinst_utsatt_plass,'Gevinst-utsatt plass'!A83,0)-OFFSET(Start_teknologikostnad,'Mellomregning - teknologikostna'!A83,0)","v":0}]
[null,null,null,null,null,null,null,null,null,null,null,null,null,null,null,null,null,null,null,null,null,null,null,null,null,null,null,null,null,null,null,null,null,null,null,null,null,null,{"$f":"OFFSET(Start_ungått_besøk,'Spart tid - ungått besøk'!A84,0)*Timeslønn.Sykepleier+OFFSET(Start_gevinst_utsatt_plass,'Gevinst-utsatt plass'!A84,0)-OFFSET(Start_teknologikostnad,'Mellomregning - teknologikostna'!A84,0)","v":0}]
[null,null,null,null,null,null,null,null,null,null,null,null,null,null,null,null,null,null,null,null,null,null,null,null,null,null,null,null,null,null,null,null,null,null,null,null,null,null,{"$f":"OFFSET(Start_ungått_besøk,'Spart tid - ungått besøk'!A85,0)*Timeslønn.Sykepleier+OFFSET(Start_gevinst_utsatt_plass,'Gevinst-utsatt plass'!A85,0)-OFFSET(Start_teknologikostnad,'Mellomregning - teknologikostna'!A85,0)","v":0}]
[null,null,null,null,null,null,null,null,null,null,null,null,null,null,null,null,null,null,null,null,null,null,null,null,null,null,null,null,null,null,null,null,null,null,null,null,null,null,{"$f":"OFFSET(Start_ungått_besøk,'Spart tid - ungått besøk'!A86,0)*Timeslønn.Sykepleier+OFFSET(Start_gevinst_utsatt_plass,'Gevinst-utsatt plass'!A86,0)-OFFSET(Start_teknologikostnad,'Mellomregning - teknologikostna'!A86,0)","v":0}]
[null,null,null,null,null,null,null,null,null,null,null,null,null,null,null,null,null,null,null,null,null,null,null,null,null,null,null,null,null,null,null,null,null,null,null,null,null,null,{"$f":"OFFSET(Start_ungått_besøk,'Spart tid - ungått besøk'!A87,0)*Timeslønn.Sykepleier+OFFSET(Start_gevinst_utsatt_plass,'Gevinst-utsatt plass'!A87,0)-OFFSET(Start_teknologikostnad,'Mellomregning - teknologikostna'!A87,0)","v":0}]
[null,null,null,null,null,null,null,null,null,null,null,null,null,null,null,null,null,null,null,null,null,null,null,null,null,null,null,null,null,null,null,null,null,null,null,null,null,null,{"$f":"OFFSET(Start_ungått_besøk,'Spart tid - ungått besøk'!A88,0)*Timeslønn.Sykepleier+OFFSET(Start_gevinst_utsatt_plass,'Gevinst-utsatt plass'!A88,0)-OFFSET(Start_teknologikostnad,'Mellomregning - teknologikostna'!A88,0)","v":0}]
[null,null,null,null,null,null,null,null,null,null,null,null,null,null,null,null,null,null,null,null,null,null,null,null,null,null,null,null,null,null,null,null,null,null,null,null,null,null,{"$f":"OFFSET(Start_ungått_besøk,'Spart tid - ungått besøk'!A89,0)*Timeslønn.Sykepleier+OFFSET(Start_gevinst_utsatt_plass,'Gevinst-utsatt plass'!A89,0)-OFFSET(Start_teknologikostnad,'Mellomregning - teknologikostna'!A89,0)","v":0}]
[null,null,null,null,null,null,null,null,null,null,null,null,null,null,null,null,null,null,null,null,null,null,null,null,null,null,null,null,null,null,null,null,null,null,null,null,null,null,{"$f":"OFFSET(Start_ungått_besøk,'Spart tid - ungått besøk'!A90,0)*Timeslønn.Sykepleier+OFFSET(Start_gevinst_utsatt_plass,'Gevinst-utsatt plass'!A90,0)-OFFSET(Start_teknologikostnad,'Mellomregning - teknologikostna'!A90,0)","v":0}]
[null,null,null,null,null,null,null,null,null,null,null,null,null,null,null,null,null,null,null,null,null,null,null,null,null,null,null,null,null,null,null,null,null,null,null,null,null,null,{"$f":"OFFSET(Start_ungått_besøk,'Spart tid - ungått besøk'!A91,0)*Timeslønn.Sykepleier+OFFSET(Start_gevinst_utsatt_plass,'Gevinst-utsatt plass'!A91,0)-OFFSET(Start_teknologikostnad,'Mellomregning - teknologikostna'!A91,0)","v":0}]
[null,null,null,null,null,null,null,null,null,null,null,null,null,null,null,null,null,null,null,null,null,null,null,null,null,null,null,null,null,null,null,null,null,null,null,null,null,null,{"$f":"OFFSET(Start_ungått_besøk,'Spart tid - ungått besøk'!A92,0)*Timeslønn.Sykepleier+OFFSET(Start_gevinst_utsatt_plass,'Gevinst-utsatt plass'!A92,0)-OFFSET(Start_teknologikostnad,'Mellomregning - teknologikostna'!A92,0)","v":0}]
[null,null,null,null,null,null,null,null,null,null,null,null,null,null,null,null,null,null,null,null,null,null,null,null,null,null,null,null,null,null,null,null,null,null,null,null,null,null,{"$f":"OFFSET(Start_ungått_besøk,'Spart tid - ungått besøk'!A93,0)*Timeslønn.Sykepleier+OFFSET(Start_gevinst_utsatt_plass,'Gevinst-utsatt plass'!A93,0)-OFFSET(Start_teknologikostnad,'Mellomregning - teknologikostna'!A93,0)","v":0}]
[null,null,null,null,null,null,null,null,null,null,null,null,null,null,null,null,null,null,null,null,null,null,null,null,null,null,null,null,null,null,null,null,null,null,null,null,null,null,{"$f":"OFFSET(Start_ungått_besøk,'Spart tid - ungått besøk'!A94,0)*Timeslønn.Sykepleier+OFFSET(Start_gevinst_utsatt_plass,'Gevinst-utsatt plass'!A94,0)-OFFSET(Start_teknologikostnad,'Mellomregning - teknologikostna'!A94,0)","v":0}]
[null,null,null,null,null,null,null,null,null,null,null,null,null,null,null,null,null,null,null,null,null,null,null,null,null,null,null,null,null,null,null,null,null,null,null,null,null,null,{"$f":"OFFSET(Start_ungått_besøk,'Spart tid - ungått besøk'!A95,0)*Timeslønn.Sykepleier+OFFSET(Start_gevinst_utsatt_plass,'Gevinst-utsatt plass'!A95,0)-OFFSET(Start_teknologikostnad,'Mellomregning - teknologikostna'!A95,0)","v":0}]
[null,null,null,null,null,null,null,null,null,null,null,null,null,null,null,null,null,null,null,null,null,null,null,null,null,null,null,null,null,null,null,null,null,null,null,null,null,null,{"$f":"OFFSET(Start_ungått_besøk,'Spart tid - ungått besøk'!A96,0)*Timeslønn.Sykepleier+OFFSET(Start_gevinst_utsatt_plass,'Gevinst-utsatt plass'!A96,0)-OFFSET(Start_teknologikostnad,'Mellomregning - teknologikostna'!A96,0)","v":0}]
[null,null,null,null,null,null,null,null,null,null,null,null,null,null,null,null,null,null,null,null,null,null,null,null,null,null,null,null,null,null,null,null,null,null,null,null,null,null,{"$f":"OFFSET(Start_ungått_besøk,'Spart tid - ungått besøk'!A97,0)*Timeslønn.Sykepleier+OFFSET(Start_gevinst_utsatt_plass,'Gevinst-utsatt plass'!A97,0)-OFFSET(Start_teknologikostnad,'Mellomregning - teknologikostna'!A97,0)","v":0}]
[null,null,null,null,null,null,null,null,null,null,null,null,null,null,null,null,null,null,null,null,null,null,null,null,null,null,null,null,null,null,null,null,null,null,null,null,null,null,{"$f":"OFFSET(Start_ungått_besøk,'Spart tid - ungått besøk'!A98,0)*Timeslønn.Sykepleier+OFFSET(Start_gevinst_utsatt_plass,'Gevinst-utsatt plass'!A98,0)-OFFSET(Start_teknologikostnad,'Mellomregning - teknologikostna'!A98,0)","v":0}]
[null,null,null,null,null,null,null,null,null,null,null,null,null,null,null,null,null,null,null,null,null,null,null,null,null,null,null,null,null,null,null,null,null,null,null,null,null,null,{"$f":"OFFSET(Start_ungått_besøk,'Spart tid - ungått besøk'!A99,0)*Timeslønn.Sykepleier+OFFSET(Start_gevinst_utsatt_plass,'Gevinst-utsatt plass'!A99,0)-OFFSET(Start_teknologikostnad,'Mellomregning - teknologikostna'!A99,0)","v":0}]
[null,null,null,null,null,null,null,null,null,null,null,null,null,null,null,null,null,null,null,null,null,null,null,null,null,null,null,null,null,null,null,null,null,null,null,null,null,null,{"$f":"OFFSET(Start_ungått_besøk,'Spart tid - ungått besøk'!A100,0)*Timeslønn.Sykepleier+OFFSET(Start_gevinst_utsatt_plass,'Gevinst-utsatt plass'!A100,0)-OFFSET(Start_teknologikostnad,'Mellomregning - teknologikostna'!A100,0)","v":0}]
[null,null,null,null,null,null,null,null,null,null,null,null,null,null,null,null,null,null,null,null,null,null,null,null,null,null,null,null,null,null,null,null,null,null,null,null,null,null,{"$f":"OFFSET(Start_ungått_besøk,'Spart tid - ungått besøk'!A101,0)*Timeslønn.Sykepleier+OFFSET(Start_gevinst_utsatt_plass,'Gevinst-utsatt plass'!A101,0)-OFFSET(Start_teknologikostnad,'Mellomregning - teknologikostna'!A101,0)","v":0}]
[null,null,null,null,null,null,null,null,null,null,null,null,null,null,null,null,null,null,null,null,null,null,null,null,null,null,null,null,null,null,null,null,null,null,null,null,null,null,{"$f":"OFFSET(Start_ungått_besøk,'Spart tid - ungått besøk'!A102,0)*Timeslønn.Sykepleier+OFFSET(Start_gevinst_utsatt_plass,'Gevinst-utsatt plass'!A102,0)-OFFSET(Start_teknologikostnad,'Mellomregning - teknologikostna'!A102,0)","v":0}]

{"sheet":"Oppstartskostnad","index":4,"n_rows":103,"n_cols":39,"rows_kept":103,"cut":false,"hidden":true,"merged":[]}
[null,null,39,{"$f":"C1+3","v":42},{"$f":"D1+3","v":45},48,51,54,57,60,63,66,69,72,75,78,81,84,87,90,93,96,99,102,105,108,111,114,117,120,123,126,129,132,135,138,141,144]
["Nummer","Bruker ID",{"$f":"OFFSET('Månedlig registrering'!$AN$6,0,COLUMN(C:C)*3-9)","v":"2018-01-01"},{"$f":"OFFSET('Månedlig registrering'!$AN$6,0,COLUMN(D:D)*3-9)","v":"2018-02-01"},{"$f":"OFFSET('Månedlig registrering'!$AN$6,0,COLUMN(E:E)*3-9)","v":"2018-03-01"},{"$f":"OFFSET('Månedlig registrering'!$AN$6,0,COLUMN(F:F)*3-9)","v":"2018-04-01"},{"$f":"OFFSET('Månedlig registrering'!$AN$6,0,COLUMN(G:G)*3-9)","v":"2018-05-01"},{"$f":"OFFSET('Månedlig registrering'!$AN$6,0,COLUMN(H:H)*3-9)","v":"2018-06-01"},{"$f":"OFFSET('Månedlig registrering'!$AN$6,0,COLUMN(I:I)*3-9)","v":"2018-07-01"},{"$f":"OFFSET('Månedlig registrering'!$AN$6,0,COLUMN(J:J)*3-9)","v":"2018-08-01"},{"$f":"OFFSET('Månedlig registrering'!$AN$6,0,COLUMN(K:K)*3-9)","v":"2018-09-01"},{"$f":"OFFSET('Månedlig registrering'!$AN$6,0,COLUMN(L:L)*3-9)","v":"2018-10-01"},{"$f":"OFFSET('Månedlig registrering'!$AN$6,0,COLUMN(M:M)*3-9)","v":"2018-11-01"},{"$f":"OFFSET('Månedlig registrering'!$AN$6,0,COLUMN(N:N)*3-9)","v":"2018-12-01"},{"$f":"OFFSET('Månedlig registrering'!$AN$6,0,COLUMN(O:O)*3-9)","v":"2019-01-01"},{"$f":"OFFSET('Månedlig registrering'!$AN$6,0,COLUMN(P:P)*3-9)","v":"2019-02-01"},{"$f":"OFFSET('Månedlig registrering'!$AN$6,0,COLUMN(Q:Q)*3-9)","v":"2019-03-01"},{"$f":"OFFSET('Månedlig registrering'!$AN$6,0,COLUMN(R:R)*3-9)","v":"2019-04-01"},{"$f":"OFFSET('Månedlig registrering'!$AN$6,0,COLUMN(S:S)*3-9)","v":"2019-05-01"},{"$f":"OFFSET('Månedlig registrering'!$AN$6,0,COLUMN(T:T)*3-9)","v":"2019-06-01"},{"$f":"OFFSET('Månedlig registrering'!$AN$6,0,COLUMN(U:U)*3-9)","v":"2019-07-01"},{"$f":"OFFSET('Månedlig registrering'!$AN$6,0,COLUMN(V:V)*3-9)","v":"2019-08-01"},{"$f":"OFFSET('Månedlig registrering'!$AN$6,0,COLUMN(W:W)*3-9)","v":"2019-09-01"},{"$f":"OFFSET('Månedlig registrering'!$AN$6,0,COLUMN(X:X)*3-9)","v":"2019-10-01"},{"$f":"OFFSET('Månedlig registrering'!$AN$6,0,COLUMN(Y:Y)*3-9)","v":"2019-11-01"},{"$f":"OFFSET('Månedlig registrering'!$AN$6,0,COLUMN(Z:Z)*3-9)","v":"2019-12-01"},{"$f":"OFFSET('Månedlig registrering'!$AN$6,0,COLUMN(AA:AA)*3-9)","v":"2020-01-01"},{"$f":"OFFSET('Månedlig registrering'!$AN$6,0,COLUMN(AB:AB)*3-9)","v":"2020-02-01"},{"$f":"OFFSET('Månedlig registrering'!$AN$6,0,COLUMN(AC:AC)*3-9)","v":"2020-03-01"},{"$f":"OFFSET('Månedlig registrering'!$AN$6,0,COLUMN(AD:AD)*3-9)","v":"2020-04-01"},{"$f":"OFFSET('Månedlig registrering'!$AN$6,0,COLUMN(AE:AE)*3-9)","v":"2020-05-01"},{"$f":"OFFSET('Månedlig registrering'!$AN$6,0,COLUMN(AF:AF)*3-9)","v":"2020-06-01"},{"$f":"OFFSET('Månedlig registrering'!$AN$6,0,COLUMN(AG:AG)*3-9)","v":"2020-07-01"},{"$f":"OFFSET('Månedlig registrering'!$AN$6,0,COLUMN(AH:AH)*3-9)","v":"2020-08-01"},{"$f":"OFFSET('Månedlig registrering'!$AN$6,0,COLUMN(AI:AI)*3-9)","v":"2020-09-01"},{"$f":"OFFSET('Månedlig registrering'!$AN$6,0,COLUMN(AJ:AJ)*3-9)","v":"2020-10-01"},{"$f":"OFFSET('Månedlig registrering'!$AN$6,0,COLUMN(AK:AK)*3-9)","v":"2020-11-01"},{"$f":"OFFSET('Månedlig registrering'!$AN$6,0,COLUMN(AL:AL)*3-9)","v":"2020-12-01"},"SUM Oppstartskostnad"]
[2,{"$f":"OFFSET(Start,'Mellomlagring - antall besøk'!A3,0)","v":1001},{"$f":"IF(AND((OFFSET(Start,$A3,1)-C$2)<DAY(EOMONTH(C$2,0)),(OFFSET(Start,$A3,1)-C$2)>=0),OFFSET(Start,$A3,3)+OFFSET(Start,$A3,4)+OFFSET(Start,$A3,17),0)","v":3500},0,0,0,0,0,0,0,0,0,{"$f":"IF(AND((OFFSET(Start,$A3,1)-M$2)<DAY(EOMONTH(M$2,0)),(OFFSET(Start,$A3,1)-M$2)>=0),OFFSET(Start,$A3,3)+OFFSET(Start,$A3,4)+OFFSET(Start,$A3,17),0)","v":0},0,0,0,0,0,0,0,0,0,{"$f":"IF(AND((OFFSET(Start,$A3,1)-W$2)<DAY(EOMONTH(W$2,0)),(OFFSET(Start,$A3,1)-W$2)>=0),OFFSET(Start,$A3,3)+OFFSET(Start,$A3,4)+OFFSET(Start,$A3,17),0)","v":0},0,0,0,0,0,0,0,0,0,{"$f":"IF(AND((OFFSET(Start,$A3,1)-AG$2)<DAY(EOMONTH(AG$2,0)),(OFFSET(Start,$A3,1)-AG$2)>=0),OFFSET(Start,$A3,3)+OFFSET(Start,$A3,4)+OFFSET(Start,$A3,17),0)","v":0},0,0,0,0,0,{"$f":"SUM(C3:AL3)","v":3500}]
[{"$f":"+A3+1","v":3},{"$f":"OFFSET(Start,'Mellomlagring - antall besøk'!A4,0)","v":1002},0,0,3500,0,0,0,0,0,0,0,0,0,0,0,0,0,0,0,0,0,0,0,0,0,0,0,0,0,0,0,0,0,0,0,0,0,{"$f":"SUM(C4:AL4)","v":3500}]
[{"$f":"+A4+1","v":4},{"$f":"OFFSET(Start,'Mellomlagring - antall besøk'!A5,0)","v":1003},900,0,0,0,0,0,0,0,0,0,0,0,0,0,0,0,0,0,0,0,0,0,0,0,0,0,0,0,0,0,0,0,0,0,0,0,900]
[5,{"$f":"OFFSET(Start,'Mellomlagring - antall besøk'!A6,0)","v":0},0,0,0,0,0,0,0,0,0,0,0,0,0,0,0,0,0,0,0,0,0,0,0,0,0,0,0,0,0,0,0,0,0,0,0,0,0]
[6,{"$f":"OFFSET(Start,'Mellomlagring - antall besøk'!A7,0)","v":0},0,0,0,0,0,0,0,0,0,0,0,0,0,0,0,0,0,0,0,0,0,0,0,0,0,0,0,0,0,0,0,0,0,0,0,0,0]
[7,{"$f":"OFFSET(Start,'Mellomlagring - antall besøk'!A8,0)","v":0},0,0,0,0,0,0,0,0,0,0,0,0,0,0,0,0,0,0,0,0,0,0,0,0,0,0,0,0,0,0,0,0,0,0,0,0,0]
[8,{"$f":"OFFSET(Start,'Mellomlagring - antall besøk'!A9,0)","v":0},0,0,0,0,0,0,0,0,0,0,0,0,0,0,0,0,0,0,0,0,0,0,0,0,0,0,0,0,0,0,0,0,0,0,0,0,0]
[9,{"$f":"OFFSET(Start,'Mellomlagring - antall besøk'!A10,0)","v":0},0,0,0,0,0,0,0,0,0,0,0,0,0,0,0,0,0,0,0,0,0,0,0,0,0,0,0,0,0,0,0,0,0,0,0,0,0]
[10,{"$f":"OFFSET(Start,'Mellomlagring - antall besøk'!A11,0)","v":0},0,0,0,0,0,0,0,0,0,0,0,0,0,0,0,0,0,0,0,0,0,0,0,0,0,0,0,0,0,0,0,0,0,0,0,0,0]
[11,{"$f":"OFFSET(Start,'Mellomlagring - antall besøk'!A12,0)","v":0},0,0,0,0,0,0,0,0,0,0,0,0,0,0,0,0,0,0,0,0,0,0,0,0,0,0,0,0,0,0,0,0,0,0,0,0,0]
[12,{"$f":"OFFSET(Start,'Mellomlagring - antall besøk'!A13,0)","v":0},{"$f":"IF(AND((OFFSET(Start,$A13,1)-C$2)<DAY(EOMONTH(C$2,0)),(OFFSET(Start,$A13,1)-C$2)>=0),OFFSET(Start,$A13,3)+OFFSET(Start,$A13,4)+OFFSET(Start,$A13,17),0)","v":0},0,0,0,0,0,0,0,0,0,{"$f":"IF(AND((OFFSET(Start,$A13,1)-M$2)<DAY(EOMONTH(M$2,0)),(OFFSET(Start,$A13,1)-M$2)>=0),OFFSET(Start,$A13,3)+OFFSET(Start,$A13,4)+OFFSET(Start,$A13,17),0)","v":0},0,0,0,0,0,0,0,0,0,{"$f":"IF(AND((OFFSET(Start,$A13,1)-W$2)<DAY(EOMONTH(W$2,0)),(OFFSET(Start,$A13,1)-W$2)>=0),OFFSET(Start,$A13,3)+OFFSET(Start,$A13,4)+OFFSET(Start,$A13,17),0)","v":0},0,0,0,0,0,0,0,0,0,{"$f":"IF(AND((OFFSET(Start,$A13,1)-AG$2)<DAY(EOMONTH(AG$2,0)),(OFFSET(Start,$A13,1)-AG$2)>=0),OFFSET(Start,$A13,3)+OFFSET(Start,$A13,4)+OFFSET(Start,$A13,17),0)","v":0},0,0,0,0,0,0]
[13,{"$f":"OFFSET(Start,'Mellomlagring - antall besøk'!A14,0)","v":0},0,0,0,0,0,0,0,0,0,0,0,0,0,0,0,0,0,0,0,0,0,0,0,0,0,0,0,0,0,0,0,0,0,0,0,0,0]
[14,{"$f":"OFFSET(Start,'Mellomlagring - antall besøk'!A15,0)","v":0},0,0,0,0,0,0,0,0,0,0,0,0,0,0,0,0,0,0,0,0,0,0,0,0,0,0,0,0,0,0,0,0,0,0,0,0,0]
[15,{"$f":"OFFSET(Start,'Mellomlagring - antall besøk'!A16,0)","v":0},0,0,0,0,0,0,0,0,0,0,0,0,0,0,0,0,0,0,0,0,0,0,0,0,0,0,0,0,0,0,0,0,0,0,0,0,0]
[16,{"$f":"OFFSET(Start,'Mellomlagring - antall besøk'!A17,0)","v":0},0,0,0,0,0,0,0,0,0,0,0,0,0,0,0,0,0,0,0,0,0,0,0,0,0,0,0,0,0,0,0,0,0,0,0,0,0]
[17,{"$f":"OFFSET(Start,'Mellomlagring - antall besøk'!A18,0)","v":0},0,0,0,0,0,0,0,0,0,0,0,0,0,0,0,0,0,0,0,0,0,0,0,0,0,0,0,0,0,0,0,0,0,0,0,0,0]
[18,{"$f":"OFFSET(Start,'Mellomlagring - antall besøk'!A19,0)","v":0},0,0,0,0,0,0,0,0,0,0,0,0,0,0,0,0,0,0,0,0,0,0,0,0,0,0,0,0,0,0,0,0,0,0,0,0,0]
[19,{"$f":"OFFSET(Start,'Mellomlagring - antall besøk'!A20,0)","v":0},0,0,0,0,0,0,0,0,0,0,0,0,0,0,0,0,0,0,0,0,0,0,0,0,0,0,0,0,0,0,0,0,0,0,0,0,0]
[20,{"$f":"OFFSET(Start,'Mellomlagring - antall besøk'!A21,0)","v":0},0,0,0,0,0,0,0,0,0,0,0,0,0,0,0,0,0,0,0,0,0,0,0,0,0,0,0,0,0,0,0,0,0,0,0,0,0]
[21,{"$f":"OFFSET(Start,'Mellomlagring - antall besøk'!A22,0)","v":0},0,0,0,0,0,0,0,0,0,0,0,0,0,0,0,0,0,0,0,0,0,0,0,0,0,0,0,0,0,0,0,0,0,0,0,0,0]
[22,{"$f":"OFFSET(Start,'Mellomlagring - antall besøk'!A23,0)","v":0},{"$f":"IF(AND((OFFSET(Start,$A23,1)-C$2)<DAY(EOMONTH(C$2,0)),(OFFSET(Start,$A23,1)-C$2)>=0),OFFSET(Start,$A23,3)+OFFSET(Start,$A23,4)+OFFSET(Start,$A23,17),0)","v":0},0,0,0,0,0,0,0,0,0,{"$f":"IF(AND((OFFSET(Start,$A23,1)-M$2)<DAY(EOMONTH(M$2,0)),(OFFSET(Start,$A23,1)-M$2)>=0),OFFSET(Start,$A23,3)+OFFSET(Start,$A23,4)+OFFSET(Start,$A23,17),0)","v":0},0,0,0,0,0,0,0,0,0,{"$f":"IF(AND((OFFSET(Start,$A23,1)-W$2)<DAY(EOMONTH(W$2,0)),(OFFSET(Start,$A23,1)-W$2)>=0),OFFSET(Start,$A23,3)+OFFSET(Start,$A23,4)+OFFSET(Start,$A23,17),0)","v":0},0,0,0,0,0,0,0,0,0,{"$f":"IF(AND((OFFSET(Start,$A23,1)-AG$2)<DAY(EOMONTH(AG$2,0)),(OFFSET(Start,$A23,1)-AG$2)>=0),OFFSET(Start,$A23,3)+OFFSET(Start,$A23,4)+OFFSET(Start,$A23,17),0)","v":0},0,0,0,0,0,0]
[23,{"$f":"OFFSET(Start,'Mellomlagring - antall besøk'!A24,0)","v":0},0,0,0,0,0,0,0,0,0,0,0,0,0,0,0,0,0,0,0,0,0,0,0,0,0,0,0,0,0,0,0,0,0,0,0,0,0]
[24,{"$f":"OFFSET(Start,'Mellomlagring - antall besøk'!A25,0)","v":0},0,0,0,0,0,0,0,0,0,0,0,0,0,0,0,0,0,0,0,0,0,0,0,0,0,0,0,0,0,0,0,0,0,0,0,0,0]
[25,{"$f":"OFFSET(Start,'Mellomlagring - antall besøk'!A26,0)","v":0},0,0,0,0,0,0,0,0,0,0,0,0,0,0,0,0,0,0,0,0,0,0,0,0,0,0,0,0,0,0,0,0,0,0,0,0,0]
[26,{"$f":"OFFSET(Start,'Mellomlagring - antall besøk'!A27,0)","v":0},0,0,0,0,0,0,0,0,0,0,0,0,0,0,0,0,0,0,0,0,0,0,0,0,0,0,0,0,0,0,0,0,0,0,0,0,0]
[27,{"$f":"OFFSET(Start,'Mellomlagring - antall besøk'!A28,0)","v":0},0,0,0,0,0,0,0,0,0,0,0,0,0,0,0,0,0,0,0,0,0,0,0,0,0,0,0,0,0,0,0,0,0,0,0,0,0]
[28,{"$f":"OFFSET(Start,'Mellomlagring - antall besøk'!A29,0)","v":0},0,0,0,0,0,0,0,0,0,0,0,0,0,0,0,0,0,0,0,0,0,0,0,0,0,0,0,0,0,0,0,0,0,0,0,0,0]
[29,{"$f":"OFFSET(Start,'Mellomlagring - antall besøk'!A30,0)","v":0},0,0,0,0,0,0,0,0,0,0,0,0,0,0,0,0,0,0,0,0,0,0,0,0,0,0,0,0,0,0,0,0,0,0,0,0,0]
[30,{"$f":"OFFSET(Start,'Mellomlagring - antall besøk'!A31,0)","v":0},0,0,0,0,0,0,0,0,0,0,0,0,0,0,0,0,0,0,0,0,0,0,0,0,0,0,0,0,0,0,0,0,0,0,0,0,0]
[31,{"$f":"OFFSET(Start,'Mellomlagring - antall besøk'!A32,0)","v":0},0,0,0,0,0,0,0,0,0,0,0,0,0,0,0,0,0,0,0,0,0,0,0,0,0,0,0,0,0,0,0,0,0,0,0,0,0]
[32,{"$f":"OFFSET(Start,'Mellomlagring - antall besøk'!A33,0)","v":0},{"$f":"IF(AND((OFFSET(Start,$A33,1)-C$2)<DAY(EOMONTH(C$2,0)),(OFFSET(Start,$A33,1)-C$2)>=0),OFFSET(Start,$A33,3)+OFFSET(Start,$A33,4)+OFFSET(Start,$A33,17),0)","v":0},0,0,0,0,0,0,0,0,0,{"$f":"IF(AND((OFFSET(Start,$A33,1)-M$2)<DAY(EOMONTH(M$2,0)),(OFFSET(Start,$A33,1)-M$2)>=0),OFFSET(Start,$A33,3)+OFFSET(Start,$A33,4)+OFFSET(Start,$A33,17),0)","v":0},0,0,0,0,0,0,0,0,0,{"$f":"IF(AND((OFFSET(Start,$A33,1)-W$2)<DAY(EOMONTH(W$2,0)),(OFFSET(Start,$A33,1)-W$2)>=0),OFFSET(Start,$A33,3)+OFFSET(Start,$A33,4)+OFFSET(Start,$A33,17),0)","v":0},0,0,0,0,0,0,0,0,0,{"$f":"IF(AND((OFFSET(Start,$A33,1)-AG$2)<DAY(EOMONTH(AG$2,0)),(OFFSET(Start,$A33,1)-AG$2)>=0),OFFSET(Start,$A33,3)+OFFSET(Start,$A33,4)+OFFSET(Start,$A33,17),0)","v":0},0,0,0,0,0,0]
[33,{"$f":"OFFSET(Start,'Mellomlagring - antall besøk'!A34,0)","v":0},0,0,0,0,0,0,0,0,0,0,0,0,0,0,0,0,0,0,0,0,0,0,0,0,0,0,0,0,0,0,0,0,0,0,0,0,0]
[34,{"$f":"OFFSET(Start,'Mellomlagring - antall besøk'!A35,0)","v":0},0,0,0,0,0,0,0,0,0,0,0,0,0,0,0,0,0,0,0,0,0,0,0,0,0,0,0,0,0,0,0,0,0,0,0,0,0]
[35,{"$f":"OFFSET(Start,'Mellomlagring - antall besøk'!A36,0)","v":0},0,0,0,0,0,0,0,0,0,0,0,0,0,0,0,0,0,0,0,0,0,0,0,0,0,0,0,0,0,0,0,0,0,0,0,0,0]
[36,{"$f":"OFFSET(Start,'Mellomlagring - antall besøk'!A37,0)","v":0},0,0,0,0,0,0,0,0,0,0,0,0,0,0,0,0,0,0,0,0,0,0,0,0,0,0,0,0,0,0,0,0,0,0,0,0,0]
[37,{"$f":"OFFSET(Start,'Mellomlagring - antall besøk'!A38,0)","v":0},0,0,0,0,0,0,0,0,0,0,0,0,0,0,0,0,0,0,0,0,0,0,0,0,0,0,0,0,0,0,0,0,0,0,0,0,0]
[38,{"$f":"OFFSET(Start,'Mellomlagring - antall besøk'!A39,0)","v":0},0,0,0,0,0,0,0,0,0,0,0,0,0,0,0,0,0,0,0,0,0,0,0,0,0,0,0,0,0,0,0,0,0,0,0,0,0]
[39,{"$f":"OFFSET(Start,'Mellomlagring - antall besøk'!A40,0)","v":0},0,0,0,0,0,0,0,0,0,0,0,0,0,0,0,0,0,0,0,0,0,0,0,0,0,0,0,0,0,0,0,0,0,0,0,0,0]
[40,{"$f":"OFFSET(Start,'Mellomlagring - antall besøk'!A41,0)","v":0},0,0,0,0,0,0,0,0,0,0,0,0,0,0,0,0,0,0,0,0,0,0,0,0,0,0,0,0,0,0,0,0,0,0,0,0,0]
[41,{"$f":"OFFSET(Start,'Mellomlagring - antall besøk'!A42,0)","v":0},0,0,0,0,0,0,0,0,0,0,0,0,0,0,0,0,0,0,0,0,0,0,0,0,0,0,0,0,0,0,0,0,0,0,0,0,0]
[42,{"$f":"OFFSET(Start,'Mellomlagring - antall besøk'!A43,0)","v":0},{"$f":"IF(AND((OFFSET(Start,$A43,1)-C$2)<DAY(EOMONTH(C$2,0)),(OFFSET(Start,$A43,1)-C$2)>=0),OFFSET(Start,$A43,3)+OFFSET(Start,$A43,4)+OFFSET(Start,$A43,17),0)","v":0},0,0,0,0,0,0,0,0,0,{"$f":"IF(AND((OFFSET(Start,$A43,1)-M$2)<DAY(EOMONTH(M$2,0)),(OFFSET(Start,$A43,1)-M$2)>=0),OFFSET(Start,$A43,3)+OFFSET(Start,$A43,4)+OFFSET(Start,$A43,17),0)","v":0},0,0,0,0,0,0,0,0,0,{"$f":"IF(AND((OFFSET(Start,$A43,1)-W$2)<DAY(EOMONTH(W$2,0)),(OFFSET(Start,$A43,1)-W$2)>=0),OFFSET(Start,$A43,3)+OFFSET(Start,$A43,4)+OFFSET(Start,$A43,17),0)","v":0},0,0,0,0,0,0,0,0,0,{"$f":"IF(AND((OFFSET(Start,$A43,1)-AG$2)<DAY(EOMONTH(AG$2,0)),(OFFSET(Start,$A43,1)-AG$2)>=0),OFFSET(Start,$A43,3)+OFFSET(Start,$A43,4)+OFFSET(Start,$A43,17),0)","v":0},0,0,0,0,0,0]
[43,{"$f":"OFFSET(Start,'Mellomlagring - antall besøk'!A44,0)","v":0},0,0,0,0,0,0,0,0,0,0,0,0,0,0,0,0,0,0,0,0,0,0,0,0,0,0,0,0,0,0,0,0,0,0,0,0,0]
[44,{"$f":"OFFSET(Start,'Mellomlagring - antall besøk'!A45,0)","v":0},0,0,0,0,0,0,0,0,0,0,0,0,0,0,0,0,0,0,0,0,0,0,0,0,0,0,0,0,0,0,0,0,0,0,0,0,0]
[45,{"$f":"OFFSET(Start,'Mellomlagring - antall besøk'!A46,0)","v":0},0,0,0,0,0,0,0,0,0,0,0,0,0,0,0,0,0,0,0,0,0,0,0,0,0,0,0,0,0,0,0,0,0,0,0,0,0]
[46,{"$f":"OFFSET(Start,'Mellomlagring - antall besøk'!A47,0)","v":0},0,0,0,0,0,0,0,0,0,0,0,0,0,0,0,0,0,0,0,0,0,0,0,0,0,0,0,0,0,0,0,0,0,0,0,0,0]
[47,{"$f":"OFFSET(Start,'Mellomlagring - antall besøk'!A48,0)","v":0},0,0,0,0,0,0,0,0,0,0,0,0,0,0,0,0,0,0,0,0,0,0,0,0,0,0,0,0,0,0,0,0,0,0,0,0,0]
[48,{"$f":"OFFSET(Start,'Mellomlagring - antall besøk'!A49,0)","v":0},0,0,0,0,0,0,0,0,0,0,0,0,0,0,0,0,0,0,0,0,0,0,0,0,0,0,0,0,0,0,0,0,0,0,0,0,0]
[49,{"$f":"OFFSET(Start,'Mellomlagring - antall besøk'!A50,0)","v":0},0,0,0,0,0,0,0,0,0,0,0,0,0,0,0,0,0,0,0,0,0,0,0,0,0,0,0,0,0,0,0,0,0,0,0,0,0]
[50,{"$f":"OFFSET(Start,'Mellomlagring - antall besøk'!A51,0)","v":0},0,0,0,0,0,0,0,0,0,0,0,0,0,0,0,0,0,0,0,0,0,0,0,0,0,0,0,0,0,0,0,0,0,0,0,0,0]
[51,{"$f":"OFFSET(Start,'Mellomlagring - antall besøk'!A52,0)","v":0},0,0,0,0,0,0,0,0,0,0,0,0,0,0,0,0,0,0,0,0,0,0,0,0,0,0,0,0,0,0,0,0,0,0,0,0,0]
[52,{"$f":"OFFSET(Start,'Mellomlagring - antall besøk'!A53,0)","v":0},{"$f":"IF(AND((OFFSET(Start,$A53,1)-C$2)<DAY(EOMONTH(C$2,0)),(OFFSET(Start,$A53,1)-C$2)>=0),OFFSET(Start,$A53,3)+OFFSET(Start,$A53,4)+OFFSET(Start,$A53,17),0)","v":0},0,0,0,0,0,0,0,0,0,{"$f":"IF(AND((OFFSET(Start,$A53,1)-M$2)<DAY(EOMONTH(M$2,0)),(OFFSET(Start,$A53,1)-M$2)>=0),OFFSET(Start,$A53,3)+OFFSET(Start,$A53,4)+OFFSET(Start,$A53,17),0)","v":0},0,0,0,0,0,0,0,0,0,{"$f":"IF(AND((OFFSET(Start,$A53,1)-W$2)<DAY(EOMONTH(W$2,0)),(OFFSET(Start,$A53,1)-W$2)>=0),OFFSET(Start,$A53,3)+OFFSET(Start,$A53,4)+OFFSET(Start,$A53,17),0)","v":0},0,0,0,0,0,0,0,0,0,{"$f":"IF(AND((OFFSET(Start,$A53,1)-AG$2)<DAY(EOMONTH(AG$2,0)),(OFFSET(Start,$A53,1)-AG$2)>=0),OFFSET(Start,$A53,3)+OFFSET(Start,$A53,4)+OFFSET(Start,$A53,17),0)","v":0},0,0,0,0,0,0]
[53,{"$f":"OFFSET(Start,'Mellomlagring - antall besøk'!A54,0)","v":0},0,0,0,0,0,0,0,0,0,0,0,0,0,0,0,0,0,0,0,0,0,0,0,0,0,0,0,0,0,0,0,0,0,0,0,0,0]
[54,{"$f":"OFFSET(Start,'Mellomlagring - antall besøk'!A55,0)","v":0},0,0,0,0,0,0,0,0,0,0,0,0,0,0,0,0,0,0,0,0,0,0,0,0,0,0,0,0,0,0,0,0,0,0,0,0,0]
[55,{"$f":"OFFSET(Start,'Mellomlagring - antall besøk'!A56,0)","v":0},0,0,0,0,0,0,0,0,0,0,0,0,0,0,0,0,0,0,0,0,0,0,0,0,0,0,0,0,0,0,0,0,0,0,0,0,0]
[56,{"$f":"OFFSET(Start,'Mellomlagring - antall besøk'!A57,0)","v":0},0,0,0,0,0,0,0,0,0,0,0,0,0,0,0,0,0,0,0,0,0,0,0,0,0,0,0,0,0,0,0,0,0,0,0,0,0]
[57,{"$f":"OFFSET(Start,'Mellomlagring - antall besøk'!A58,0)","v":0},0,0,0,0,0,0,0,0,0,0,0,0,0,0,0,0,0,0,0,0,0,0,0,0,0,0,0,0,0,0,0,0,0,0,0,0,0]
[58,{"$f":"OFFSET(Start,'Mellomlagring - antall besøk'!A59,0)","v":0},0,0,0,0,0,0,0,0,0,0,0,0,0,0,0,0,0,0,0,0,0,0,0,0,0,0,0,0,0,0,0,0,0,0,0,0,0]
[59,{"$f":"OFFSET(Start,'Mellomlagring - antall besøk'!A60,0)","v":0},0,0,0,0,0,0,0,0,0,0,0,0,0,0,0,0,0,0,0,0,0,0,0,0,0,0,0,0,0,0,0,0,0,0,0,0,0]
[60,{"$f":"OFFSET(Start,'Mellomlagring - antall besøk'!A61,0)","v":0},0,0,0,0,0,0,0,0,0,0,0,0,0,0,0,0,0,0,0,0,0,0,0,0,0,0,0,0,0,0,0,0,0,0,0,0,0]
[61,{"$f":"OFFSET(Start,'Mellomlagring - antall besøk'!A62,0)","v":0},0,0,0,0,0,0,0,0,0,0,0,0,0,0,0,0,0,0,0,0,0,0,0,0,0,0,0,0,0,0,0,0,0,0,0,0,0]
[62,{"$f":"OFFSET(Start,'Mellomlagring - antall besøk'!A63,0)","v":0},{"$f":"IF(AND((OFFSET(Start,$A63,1)-C$2)<DAY(EOMONTH(C$2,0)),(OFFSET(Start,$A63,1)-C$2)>=0),OFFSET(Start,$A63,3)+OFFSET(Start,$A63,4)+OFFSET(Start,$A63,17),0)","v":0},0,0,0,0,0,0,0,0,0,{"$f":"IF(AND((OFFSET(Start,$A63,1)-M$2)<DAY(EOMONTH(M$2,0)),(OFFSET(Start,$A63,1)-M$2)>=0),OFFSET(Start,$A63,3)+OFFSET(Start,$A63,4)+OFFSET(Start,$A63,17),0)","v":0},0,0,0,0,0,0,0,0,0,{"$f":"IF(AND((OFFSET(Start,$A63,1)-W$2)<DAY(EOMONTH(W$2,0)),(OFFSET(Start,$A63,1)-W$2)>=0),OFFSET(Start,$A63,3)+OFFSET(Start,$A63,4)+OFFSET(Start,$A63,17),0)","v":0},0,0,0,0,0,0,0,0,0,{"$f":"IF(AND((OFFSET(Start,$A63,1)-AG$2)<DAY(EOMONTH(AG$2,0)),(OFFSET(Start,$A63,1)-AG$2)>=0),OFFSET(Start,$A63,3)+OFFSET(Start,$A63,4)+OFFSET(Start,$A63,17),0)","v":0},0,0,0,0,0,0]
[63,{"$f":"OFFSET(Start,'Mellomlagring - antall besøk'!A64,0)","v":0},0,0,0,0,0,0,0,0,0,0,0,0,0,0,0,0,0,0,0,0,0,0,0,0,0,0,0,0,0,0,0,0,0,0,0,0,0]
[64,{"$f":"OFFSET(Start,'Mellomlagring - antall besøk'!A65,0)","v":0},0,0,0,0,0,0,0,0,0,0,0,0,0,0,0,0,0,0,0,0,0,0,0,0,0,0,0,0,0,0,0,0,0,0,0,0,0]
[65,{"$f":"OFFSET(Start,'Mellomlagring - antall besøk'!A66,0)","v":0},0,0,0,0,0,0,0,0,0,0,0,0,0,0,0,0,0,0,0,0,0,0,0,0,0,0,0,0,0,0,0,0,0,0,0,0,0]
[66,{"$f":"OFFSET(Start,'Mellomlagring - antall besøk'!A67,0)","v":0},0,0,0,0,0,0,0,0,0,0,0,0,0,0,0,0,0,0,0,0,0,0,0,0,0,0,0,0,0,0,0,0,0,0,0,0,0]
[67,{"$f":"OFFSET(Start,'Mellomlagring - antall besøk'!A68,0)","v":0},0,0,0,0,0,0,0,0,0,0,0,0,0,0,0,0,0,0,0,0,0,0,0,0,0,0,0,0,0,0,0,0,0,0,0,0,{"$f":"SUM(C68:AL68)","v":0}]
[{"$f":"+A68+1","v":68},{"$f":"OFFSET(Start,'Mellomlagring - antall besøk'!A69,0)","v":0},0,0,0,0,0,0,0,0,0,0,0,0,0,0,0,0,0,0,0,0,0,0,0,0,0,0,0,0,0,0,0,0,0,0,0,0,0]
[69,{"$f":"OFFSET(Start,'Mellomlagring - antall besøk'!A70,0)","v":0},0,0,0,0,0,0,0,0,0,0,0,0,0,0,0,0,0,0,0,0,0,0,0,0,0,0,0,0,0,0,0,0,0,0,0,0,0]
[70,{"$f":"OFFSET(Start,'Mellomlagring - antall besøk'!A71,0)","v":0},0,0,0,0,0,0,0,0,0,0,0,0,0,0,0,0,0,0,0,0,0,0,0,0,0,0,0,0,0,0,0,0,0,0,0,0,0]
[71,{"$f":"OFFSET(Start,'Mellomlagring - antall besøk'!A72,0)","v":0},0,0,0,0,0,0,0,0,0,0,0,0,0,0,0,0,0,0,0,0,0,0,0,0,0,0,0,0,0,0,0,0,0,0,0,0,0]
[72,{"$f":"OFFSET(Start,'Mellomlagring - antall besøk'!A73,0)","v":0},{"$f":"IF(AND((OFFSET(Start,$A73,1)-C$2)<DAY(EOMONTH(C$2,0)),(OFFSET(Start,$A73,1)-C$2)>=0),OFFSET(Start,$A73,3)+OFFSET(Start,$A73,4)+OFFSET(Start,$A73,17),0)","v":0},0,0,0,0,0,0,0,0,0,{"$f":"IF(AND((OFFSET(Start,$A73,1)-M$2)<DAY(EOMONTH(M$2,0)),(OFFSET(Start,$A73,1)-M$2)>=0),OFFSET(Start,$A73,3)+OFFSET(Start,$A73,4)+OFFSET(Start,$A73,17),0)","v":0},0,0,0,0,0,0,0,0,0,{"$f":"IF(AND((OFFSET(Start,$A73,1)-W$2)<DAY(EOMONTH(W$2,0)),(OFFSET(Start,$A73,1)-W$2)>=0),OFFSET(Start,$A73,3)+OFFSET(Start,$A73,4)+OFFSET(Start,$A73,17),0)","v":0},0,0,0,0,0,0,0,0,0,{"$f":"IF(AND((OFFSET(Start,$A73,1)-AG$2)<DAY(EOMONTH(AG$2,0)),(OFFSET(Start,$A73,1)-AG$2)>=0),OFFSET(Start,$A73,3)+OFFSET(Start,$A73,4)+OFFSET(Start,$A73,17),0)","v":0},0,0,0,0,0,0]
[73,{"$f":"OFFSET(Start,'Mellomlagring - antall besøk'!A74,0)","v":0},0,0,0,0,0,0,0,0,0,0,0,0,0,0,0,0,0,0,0,0,0,0,0,0,0,0,0,0,0,0,0,0,0,0,0,0,0]
[74,{"$f":"OFFSET(Start,'Mellomlagring - antall besøk'!A75,0)","v":0},0,0,0,0,0,0,0,0,0,0,0,0,0,0,0,0,0,0,0,0,0,0,0,0,0,0,0,0,0,0,0,0,0,0,0,0,0]
[75,{"$f":"OFFSET(Start,'Mellomlagring - antall besøk'!A76,0)","v":0},0,0,0,0,0,0,0,0,0,0,0,0,0,0,0,0,0,0,0,0,0,0,0,0,0,0,0,0,0,0,0,0,0,0,0,0,0]
[76,{"$f":"OFFSET(Start,'Mellomlagring - antall besøk'!A77,0)","v":0},0,0,0,0,0,0,0,0,0,0,0,0,0,0,0,0,0,0,0,0,0,0,0,0,0,0,0,0,0,0,0,0,0,0,0,0,0]
[77,{"$f":"OFFSET(Start,'Mellomlagring - antall besøk'!A78,0)","v":0},0,0,0,0,0,0,0,0,0,0,0,0,0,0,0,0,0,0,0,0,0,0,0,0,0,0,0,0,0,0,0,0,0,0,0,0,0]
[78,{"$f":"OFFSET(Start,'Mellomlagring - antall besøk'!A79,0)","v":0},0,0,0,0,0,0,0,0,0,0,0,0,0,0,0,0,0,0,0,0,0,0,0,0,0,0,0,0,0,0,0,0,0,0,0,0,0]
[79,{"$f":"OFFSET(Start,'Mellomlagring - antall besøk'!A80,0)","v":0},0,0,0,0,0,0,0,0,0,0,0,0,0,0,0,0,0,0,0,0,0,0,0,0,0,0,0,0,0,0,0,0,0,0,0,0,0]
[80,{"$f":"OFFSET(Start,'Mellomlagring - antall besøk'!A81,0)","v":0},0,0,0,0,0,0,0,0,0,0,0,0,0,0,0,0,0,0,0,0,0,0,0,0,0,0,0,0,0,0,0,0,0,0,0,0,0]
[81,{"$f":"OFFSET(Start,'Mellomlagring - antall besøk'!A82,0)","v":0},0,0,0,0,0,0,0,0,0,0,0,0,0,0,0,0,0,0,0,0,0,0,0,0,0,0,0,0,0,0,0,0,0,0,0,0,0]
[82,{"$f":"OFFSET(Start,'Mellomlagring - antall besøk'!A83,0)","v":0},{"$f":"IF(AND((OFFSET(Start,$A83,1)-C$2)<DAY(EOMONTH(C$2,0)),(OFFSET(Start,$A83,1)-C$2)>=0),OFFSET(Start,$A83,3)+OFFSET(Start,$A83,4)+OFFSET(Start,$A83,17),0)","v":0},0,0,0,0,0,0,0,0,0,{"$f":"IF(AND((OFFSET(Start,$A83,1)-M$2)<DAY(EOMONTH(M$2,0)),(OFFSET(Start,$A83,1)-M$2)>=0),OFFSET(Start,$A83,3)+OFFSET(Start,$A83,4)+OFFSET(Start,$A83,17),0)","v":0},0,0,0,0,0,0,0,0,0,{"$f":"IF(AND((OFFSET(Start,$A83,1)-W$2)<DAY(EOMONTH(W$2,0)),(OFFSET(Start,$A83,1)-W$2)>=0),OFFSET(Start,$A83,3)+OFFSET(Start,$A83,4)+OFFSET(Start,$A83,17),0)","v":0},0,0,0,0,0,0,0,0,0,{"$f":"IF(AND((OFFSET(Start,$A83,1)-AG$2)<DAY(EOMONTH(AG$2,0)),(OFFSET(Start,$A83,1)-AG$2)>=0),OFFSET(Start,$A83,3)+OFFSET(Start,$A83,4)+OFFSET(Start,$A83,17),0)","v":0},0,0,0,0,0,0]
[83,{"$f":"OFFSET(Start,'Mellomlagring - antall besøk'!A84,0)","v":0},0,0,0,0,0,0,0,0,0,0,0,0,0,0,0,0,0,0,0,0,0,0,0,0,0,0,0,0,0,0,0,0,0,0,0,0,0]
[84,{"$f":"OFFSET(Start,'Mellomlagring - antall besøk'!A85,0)","v":0},0,0,0,0,0,0,0,0,0,0,0,0,0,0,0,0,0,0,0,0,0,0,0,0,0,0,0,0,0,0,0,0,0,0,0,0,0]
[85,{"$f":"OFFSET(Start,'Mellomlagring - antall besøk'!A86,0)","v":0},0,0,0,0,0,0,0,0,0,0,0,0,0,0,0,0,0,0,0,0,0,0,0,0,0,0,0,0,0,0,0,0,0,0,0,0,0]
[86,{"$f":"OFFSET(Start,'Mellomlagring - antall besøk'!A87,0)","v":0},0,0,0,0,0,0,0,0,0,0,0,0,0,0,0,0,0,0,0,0,0,0,0,0,0,0,0,0,0,0,0,0,0,0,0,0,0]
[87,{"$f":"OFFSET(Start,'Mellomlagring - antall besøk'!A88,0)","v":0},0,0,0,0,0,0,0,0,0,0,0,0,0,0,0,0,0,0,0,0,0,0,0,0,0,0,0,0,0,0,0,0,0,0,0,0,0]
[88,{"$f":"OFFSET(Start,'Mellomlagring - antall besøk'!A89,0)","v":0},0,0,0,0,0,0,0,0,0,0,0,0,0,0,0,0,0,0,0,0,0,0,0,0,0,0,0,0,0,0,0,0,0,0,0,0,0]
[89,{"$f":"OFFSET(Start,'Mellomlagring - antall besøk'!A90,0)","v":0},0,0,0,0,0,0,0,0,0,0,0,0,0,0,0,0,0,0,0,0,0,0,0,0,0,0,0,0,0,0,0,0,0,0,0,0,0]
[90,{"$f":"OFFSET(Start,'Mellomlagring - antall besøk'!A91,0)","v":0},0,0,0,0,0,0,0,0,0,0,0,0,0,0,0,0,0,0,0,0,0,0,0,0,0,0,0,0,0,0,0,0,0,0,0,0,0]
[91,{"$f":"OFFSET(Start,'Mellomlagring - antall besøk'!A92,0)","v":0},0,0,0,0,0,0,0,0,0,0,0,0,0,0,0,0,0,0,0,0,0,0,0,0,0,0,0,0,0,0,0,0,0,0,0,0,0]
[92,{"$f":"OFFSET(Start,'Mellomlagring - antall besøk'!A93,0)","v":0},{"$f":"IF(AND((OFFSET(Start,$A93,1)-C$2)<DAY(EOMONTH(C$2,0)),(OFFSET(Start,$A93,1)-C$2)>=0),OFFSET(Start,$A93,3)+OFFSET(Start,$A93,4)+OFFSET(Start,$A93,17),0)","v":0},0,0,0,0,0,0,0,0,0,{"$f":"IF(AND((OFFSET(Start,$A93,1)-M$2)<DAY(EOMONTH(M$2,0)),(OFFSET(Start,$A93,1)-M$2)>=0),OFFSET(Start,$A93,3)+OFFSET(Start,$A93,4)+OFFSET(Start,$A93,17),0)","v":0},0,0,0,0,0,0,0,0,0,{"$f":"IF(AND((OFFSET(Start,$A93,1)-W$2)<DAY(EOMONTH(W$2,0)),(OFFSET(Start,$A93,1)-W$2)>=0),OFFSET(Start,$A93,3)+OFFSET(Start,$A93,4)+OFFSET(Start,$A93,17),0)","v":0},0,0,0,0,0,0,0,0,0,{"$f":"IF(AND((OFFSET(Start,$A93,1)-AG$2)<DAY(EOMONTH(AG$2,0)),(OFFSET(Start,$A93,1)-AG$2)>=0),OFFSET(Start,$A93,3)+OFFSET(Start,$A93,4)+OFFSET(Start,$A93,17),0)","v":0},0,0,0,0,0,0]
[93,{"$f":"OFFSET(Start,'Mellomlagring - antall besøk'!A94,0)","v":0},0,0,0,0,0,0,0,0,0,0,0,0,0,0,0,0,0,0,0,0,0,0,0,0,0,0,0,0,0,0,0,0,0,0,0,0,0]
[94,{"$f":"OFFSET(Start,'Mellomlagring - antall besøk'!A95,0)","v":0},0,0,0,0,0,0,0,0,0,0,0,0,0,0,0,0,0,0,0,0,0,0,0,0,0,0,0,0,0,0,0,0,0,0,0,0,0]
[95,{"$f":"OFFSET(Start,'Mellomlagring - antall besøk'!A96,0)","v":0},0,0,0,0,0,0,0,0,0,0,0,0,0,0,0,0,0,0,0,0,0,0,0,0,0,0,0,0,0,0,0,0,0,0,0,0,0]
[96,{"$f":"OFFSET(Start,'Mellomlagring - antall besøk'!A97,0)","v":0},0,0,0,0,0,0,0,0,0,0,0,0,0,0,0,0,0,0,0,0,0,0,0,0,0,0,0,0,0,0,0,0,0,0,0,0,0]
[97,{"$f":"OFFSET(Start,'Mellomlagring - antall besøk'!A98,0)","v":0},0,0,0,0,0,0,0,0,0,0,0,0,0,0,0,0,0,0,0,0,0,0,0,0,0,0,0,0,0,0,0,0,0,0,0,0,0]
[98,{"$f":"OFFSET(Start,'Mellomlagring - antall besøk'!A99,0)","v":0},0,0,0,0,0,0,0,0,0,0,0,0,0,0,0,0,0,0,0,0,0,0,0,0,0,0,0,0,0,0,0,0,0,0,0,0,0]
[99,{"$f":"OFFSET(Start,'Mellomlagring - antall besøk'!A100,0)","v":0},0,0,0,0,0,0,0,0,0,0,0,0,0,0,0,0,0,0,0,0,0,0,0,0,0,0,0,0,0,0,0,0,0,0,0,0,0]
[100,{"$f":"OFFSET(Start,'Mellomlagring - antall besøk'!A101,0)","v":0},0,0,0,0,0,0,0,0,0,0,0,0,0,0,0,0,0,0,0,0,0,0,0,0,0,0,0,0,0,0,0,0,0,0,0,0,0]
[101,{"$f":"OFFSET(Start,'Mellomlagring - antall besøk'!A102,0)","v":0},0,0,0,0,0,0,0,0,0,0,0,0,0,0,0,0,0,0,0,0,0,0,0,0,0,0,0,0,0,0,0,0,0,0,0,0,0]
[null,"Sum oppstartskostnad",{"$f":"SUM(C3:C102)","v":4400},{"$f":"SUM(D3:D102)","v":0},3500,0,0,0,0,0,0,0,0,0,0,0,0,0,0,0,0,0,0,0,0,0,0,0,0,0,0,0,0,0,0,0,0,0]

{"sheet":"Mellomregning - teknologikostna","index":5,"n_rows":103,"n_cols":41,"rows_kept":103,"cut":false,"hidden":true,"merged":[]}
[null,null,39,{"$f":"C1+3","v":42},{"$f":"D1+3","v":45},48,51,54,57,60,63,66,69,72,75,78,81,84,87,90,93,96,99,102,105,108,111,114,117,120,123,126,129,132,135,138,141,144]
["Nummer","Bruker ID",{"$f":"OFFSET('Månedlig registrering'!$AN$6,0,COLUMN(C:C)*3-9)","v":"2018-01-01"},{"$f":"OFFSET('Månedlig registrering'!$AN$6,0,COLUMN(D:D)*3-9)","v":"2018-02-01"},{"$f":"OFFSET('Månedlig registrering'!$AN$6,0,COLUMN(E:E)*3-9)","v":"2018-03-01"},{"$f":"OFFSET('Månedlig registrering'!$AN$6,0,COLUMN(F:F)*3-9)","v":"2018-04-01"},{"$f":"OFFSET('Månedlig registrering'!$AN$6,0,COLUMN(G:G)*3-9)","v":"2018-05-01"},{"$f":"OFFSET('Månedlig registrering'!$AN$6,0,COLUMN(H:H)*3-9)","v":"2018-06-01"},{"$f":"OFFSET('Månedlig registrering'!$AN$6,0,COLUMN(I:I)*3-9)","v":"2018-07-01"},{"$f":"OFFSET('Månedlig registrering'!$AN$6,0,COLUMN(J:J)*3-9)","v":"2018-08-01"},{"$f":"OFFSET('Månedlig registrering'!$AN$6,0,COLUMN(K:K)*3-9)","v":"2018-09-01"},{"$f":"OFFSET('Månedlig registrering'!$AN$6,0,COLUMN(L:L)*3-9)","v":"2018-10-01"},{"$f":"OFFSET('Månedlig registrering'!$AN$6,0,COLUMN(M:M)*3-9)","v":"2018-11-01"},{"$f":"OFFSET('Månedlig registrering'!$AN$6,0,COLUMN(N:N)*3-9)","v":"2018-12-01"},{"$f":"OFFSET('Månedlig registrering'!$AN$6,0,COLUMN(O:O)*3-9)","v":"2019-01-01"},{"$f":"OFFSET('Månedlig registrering'!$AN$6,0,COLUMN(P:P)*3-9)","v":"2019-02-01"},{"$f":"OFFSET('Månedlig registrering'!$AN$6,0,COLUMN(Q:Q)*3-9)","v":"2019-03-01"},{"$f":"OFFSET('Månedlig registrering'!$AN$6,0,COLUMN(R:R)*3-9)","v":"2019-04-01"},{"$f":"OFFSET('Månedlig registrering'!$AN$6,0,COLUMN(S:S)*3-9)","v":"2019-05-01"},{"$f":"OFFSET('Månedlig registrering'!$AN$6,0,COLUMN(T:T)*3-9)","v":"2019-06-01"},{"$f":"OFFSET('Månedlig registrering'!$AN$6,0,COLUMN(U:U)*3-9)","v":"2019-07-01"},{"$f":"OFFSET('Månedlig registrering'!$AN$6,0,COLUMN(V:V)*3-9)","v":"2019-08-01"},{"$f":"OFFSET('Månedlig registrering'!$AN$6,0,COLUMN(W:W)*3-9)","v":"2019-09-01"},{"$f":"OFFSET('Månedlig registrering'!$AN$6,0,COLUMN(X:X)*3-9)","v":"2019-10-01"},{"$f":"OFFSET('Månedlig registrering'!$AN$6,0,COLUMN(Y:Y)*3-9)","v":"2019-11-01"},{"$f":"OFFSET('Månedlig registrering'!$AN$6,0,COLUMN(Z:Z)*3-9)","v":"2019-12-01"},{"$f":"OFFSET('Månedlig registrering'!$AN$6,0,COLUMN(AA:AA)*3-9)","v":"2020-01-01"},{"$f":"OFFSET('Månedlig registrering'!$AN$6,0,COLUMN(AB:AB)*3-9)","v":"2020-02-01"},{"$f":"OFFSET('Månedlig registrering'!$AN$6,0,COLUMN(AC:AC)*3-9)","v":"2020-03-01"},{"$f":"OFFSET('Månedlig registrering'!$AN$6,0,COLUMN(AD:AD)*3-9)","v":"2020-04-01"},{"$f":"OFFSET('Månedlig registrering'!$AN$6,0,COLUMN(AE:AE)*3-9)","v":"2020-05-01"},{"$f":"OFFSET('Månedlig registrering'!$AN$6,0,COLUMN(AF:AF)*3-9)","v":"2020-06-01"},{"$f":"OFFSET('Månedlig registrering'!$AN$6,0,COLUMN(AG:AG)*3-9)","v":"2020-07-01"},{"$f":"OFFSET('Månedlig registrering'!$AN$6,0,COLUMN(AH:AH)*3-9)","v":"2020-08-01"},{"$f":"OFFSET('Månedlig registrering'!$AN$6,0,COLUMN(AI:AI)*3-9)","v":"2020-09-01"},{"$f":"OFFSET('Månedlig registrering'!$AN$6,0,COLUMN(AJ:AJ)*3-9)","v":"2020-10-01"},{"$f":"OFFSET('Månedlig registrering'!$AN$6,0,COLUMN(AK:AK)*3-9)","v":"2020-11-01"},{"$f":"OFFSET('Månedlig registrering'!$AN$6,0,COLUMN(AL:AL)*3-9)","v":"2020-12-01"},"SUM MånedsKostnad","Oppstartskostnad","Total sum"]
[2,{"$f":"OFFSET(Start,'Mellomlagring - antall besøk'!A3,0)","v":1001},{"$f":"IF(TODAY()-C$2>0,SUM(OFFSET(Start,$A3,18):OFFSET(Start,$A3,37)),0)","v":298},{"$f":"IF(TODAY()-D$2>0,SUM(OFFSET(Start,$A3,18):OFFSET(Start,$A3,37)),0)","v":298},{"$f":"IF(TODAY()-E$2>0,SUM(OFFSET(Start,$A3,18):OFFSET(Start,$A3,37)),0)","v":298},{"$f":"IF(TODAY()-F$2>0,SUM(OFFSET(Start,$A3,18):OFFSET(Start,$A3,37)),0)","v":298},{"$f":"IF(TODAY()-G$2>0,SUM(OFFSET(Start,$A3,18):OFFSET(Start,$A3,37)),0)","v":298},{"$f":"IF(TODAY()-H$2>0,SUM(OFFSET(Start,$A3,18):OFFSET(Start,$A3,37)),0)","v":298},{"$f":"IF(TODAY()-I$2>0,SUM(OFFSET(Start,$A3,18):OFFSET(Start,$A3,37)),0)","v":0},{"$f":"IF(TODAY()-J$2>0,SUM(OFFSET(Start,$A3,18):OFFSET(Start,$A3,37)),0)","v":0},{"$f":"IF(TODAY()-K$2>0,SUM(OFFSET(Start,$A3,18):OFFSET(Start,$A3,37)),0)","v":0},{"$f":"IF(TODAY()-L$2>0,SUM(OFFSET(Start,$A3,18):OFFSET(Start,$A3,37)),0)","v":0},{"$f":"IF(TODAY()-M$2>0,SUM(OFFSET(Start,$A3,18):OFFSET(Start,$A3,37)),0)","v":0},{"$f":"IF(TODAY()-N$2>0,SUM(OFFSET(Start,$A3,18):OFFSET(Start,$A3,37)),0)","v":0},{"$f":"IF(TODAY()-O$2>0,SUM(OFFSET(Start,$A3,18):OFFSET(Start,$A3,37)),0)","v":0},{"$f":"IF(TODAY()-P$2>0,SUM(OFFSET(Start,$A3,18):OFFSET(Start,$A3,37)),0)","v":0},{"$f":"IF(TODAY()-Q$2>0,SUM(OFFSET(Start,$A3,18):OFFSET(Start,$A3,37)),0)","v":0},{"$f":"IF(TODAY()-R$2>0,SUM(OFFSET(Start,$A3,18):OFFSET(Start,$A3,37)),0)","v":0},{"$f":"IF(TODAY()-S$2>0,SUM(OFFSET(Start,$A3,18):OFFSET(Start,$A3,37)),0)","v":0},{"$f":"IF(TODAY()-T$2>0,SUM(OFFSET(Start,$A3,18):OFFSET(Start,$A3,37)),0)","v":0},{"$f":"IF(TODAY()-U$2>0,SUM(OFFSET(Start,$A3,18):OFFSET(Start,$A3,37)),0)","v":0},{"$f":"IF(TODAY()-V$2>0,SUM(OFFSET(Start,$A3,18):OFFSET(Start,$A3,37)),0)","v":0},{"$f":"IF(TODAY()-W$2>0,SUM(OFFSET(Start,$A3,18):OFFSET(Start,$A3,37)),0)","v":0},{"$f":"IF(TODAY()-X$2>0,SUM(OFFSET(Start,$A3,18):OFFSET(Start,$A3,37)),0)","v":0},{"$f":"IF(TODAY()-Y$2>0,SUM(OFFSET(Start,$A3,18):OFFSET(Start,$A3,37)),0)","v":0},{"$f":"IF(TODAY()-Z$2>0,SUM(OFFSET(Start,$A3,18):OFFSET(Start,$A3,37)),0)","v":0},{"$f":"IF(TODAY()-AA$2>0,SUM(OFFSET(Start,$A3,18):OFFSET(Start,$A3,37)),0)","v":0},{"$f":"IF(TODAY()-AB$2>0,SUM(OFFSET(Start,$A3,18):OFFSET(Start,$A3,37)),0)","v":0},{"$f":"IF(TODAY()-AC$2>0,SUM(OFFSET(Start,$A3,18):OFFSET(Start,$A3,37)),0)","v":0},{"$f":"IF(TODAY()-AD$2>0,SUM(OFFSET(Start,$A3,18):OFFSET(Start,$A3,37)),0)","v":0},{"$f":"IF(TODAY()-AE$2>0,SUM(OFFSET(Start,$A3,18):OFFSET(Start,$A3,37)),0)","v":0},{"$f":"IF(TODAY()-AF$2>0,SUM(OFFSET(Start,$A3,18):OFFSET(Start,$A3,37)),0)","v":0},{"$f":"IF(TODAY()-AG$2>0,SUM(OFFSET(Start,$A3,18):OFFSET(Start,$A3,37)),0)","v":0},{"$f":"IF(TODAY()-AH$2>0,SUM(OFFSET(Start,$A3,18):OFFSET(Start,$A3,37)),0)","v":0},{"$f":"IF(TODAY()-AI$2>0,SUM(OFFSET(Start,$A3,18):OFFSET(Start,$A3,37)),0)","v":0},{"$f":"IF(TODAY()-AJ$2>0,SUM(OFFSET(Start,$A3,18):OFFSET(Start,$A3,37)),0)","v":0},{"$f":"IF(TODAY()-AK$2>0,SUM(OFFSET(Start,$A3,18):OFFSET(Start,$A3,37)),0)","v":0},{"$f":"IF(TODAY()-AL$2>0,SUM(OFFSET(Start,$A3,18):OFFSET(Start,$A3,37)),0)","v":0},{"$f":"SUM(C3:AL3)","v":1788},{"$f":"OFFSET(Start,$A3,3)+OFFSET(Start,$A3,4)+OFFSET(Start,$A3,17)","v":3500},{"$f":"AM3+AN3","v":5288}]
[{"$f":"+A3+1","v":3},{"$f":"OFFSET(Start,'Mellomlagring - antall besøk'!A4,0)","v":1002},{"$f":"IF(TODAY()-C$2>0,SUM(OFFSET(Start,$A4,18):OFFSET(Start,$A4,37)),0)","v":66.67},{"$f":"IF(TODAY()-D$2>0,SUM(OFFSET(Start,$A4,18):OFFSET(Start,$A4,37)),0)","v":66.67},{"$f":"IF(TODAY()-E$2>0,SUM(OFFSET(Start,$A4,18):OFFSET(Start,$A4,37)),0)","v":66.67},{"$f":"IF(TODAY()-F$2>0,SUM(OFFSET(Start,$A4,18):OFFSET(Start,$A4,37)),0)","v":66.67},{"$f":"IF(TODAY()-G$2>0,SUM(OFFSET(Start,$A4,18):OFFSET(Start,$A4,37)),0)","v":66.67},{"$f":"IF(TODAY()-H$2>0,SUM(OFFSET(Start,$A4,18):OFFSET(Start,$A4,37)),0)","v":66.67},{"$f":"IF(TODAY()-I$2>0,SUM(OFFSET(Start,$A4,18):OFFSET(Start,$A4,37)),0)","v":0},{"$f":"IF(TODAY()-J$2>0,SUM(OFFSET(Start,$A4,18):OFFSET(Start,$A4,37)),0)","v":0},{"$f":"IF(TODAY()-K$2>0,SUM(OFFSET(Start,$A4,18):OFFSET(Start,$A4,37)),0)","v":0},{"$f":"IF(TODAY()-L$2>0,SUM(OFFSET(Start,$A4,18):OFFSET(Start,$A4,37)),0)","v":0},{"$f":"IF(TODAY()-M$2>0,SUM(OFFSET(Start,$A4,18):OFFSET(Start,$A4,37)),0)","v":0},{"$f":"IF(TODAY()-N$2>0,SUM(OFFSET(Start,$A4,18):OFFSET(Start,$A4,37)),0)","v":0},{"$f":"IF(TODAY()-O$2>0,SUM(OFFSET(Start,$A4,18):OFFSET(Start,$A4,37)),0)","v":0},{"$f":"IF(TODAY()-P$2>0,SUM(OFFSET(Start,$A4,18):OFFSET(Start,$A4,37)),0)","v":0},{"$f":"IF(TODAY()-Q$2>0,SUM(OFFSET(Start,$A4,18):OFFSET(Start,$A4,37)),0)","v":0},{"$f":"IF(TODAY()-R$2>0,SUM(OFFSET(Start,$A4,18):OFFSET(Start,$A4,37)),0)","v":0},{"$f":"IF(TODAY()-S$2>0,SUM(OFFSET(Start,$A4,18):OFFSET(Start,$A4,37)),0)","v":0},{"$f":"IF(TODAY()-T$2>0,SUM(OFFSET(Start,$A4,18):OFFSET(Start,$A4,37)),0)","v":0},{"$f":"IF(TODAY()-U$2>0,SUM(OFFSET(Start,$A4,18):OFFSET(Start,$A4,37)),0)","v":0},{"$f":"IF(TODAY()-V$2>0,SUM(OFFSET(Start,$A4,18):OFFSET(Start,$A4,37)),0)","v":0},{"$f":"IF(TODAY()-W$2>0,SUM(OFFSET(Start,$A4,18):OFFSET(Start,$A4,37)),0)","v":0},{"$f":"IF(TODAY()-X$2>0,SUM(OFFSET(Start,$A4,18):OFFSET(Start,$A4,37)),0)","v":0},{"$f":"IF(TODAY()-Y$2>0,SUM(OFFSET(Start,$A4,18):OFFSET(Start,$A4,37)),0)","v":0},{"$f":"IF(TODAY()-Z$2>0,SUM(OFFSET(Start,$A4,18):OFFSET(Start,$A4,37)),0)","v":0},{"$f":"IF(TODAY()-AA$2>0,SUM(OFFSET(Start,$A4,18):OFFSET(Start,$A4,37)),0)","v":0},{"$f":"IF(TODAY()-AB$2>0,SUM(OFFSET(Start,$A4,18):OFFSET(Start,$A4,37)),0)","v":0},{"$f":"IF(TODAY()-AC$2>0,SUM(OFFSET(Start,$A4,18):OFFSET(Start,$A4,37)),0)","v":0},{"$f":"IF(TODAY()-AD$2>0,SUM(OFFSET(Start,$A4,18):OFFSET(Start,$A4,37)),0)","v":0},{"$f":"IF(TODAY()-AE$2>0,SUM(OFFSET(Start,$A4,18):OFFSET(Start,$A4,37)),0)","v":0},{"$f":"IF(TODAY()-AF$2>0,SUM(OFFSET(Start,$A4,18):OFFSET(Start,$A4,37)),0)","v":0},{"$f":"IF(TODAY()-AG$2>0,SUM(OFFSET(Start,$A4,18):OFFSET(Start,$A4,37)),0)","v":0},{"$f":"IF(TODAY()-AH$2>0,SUM(OFFSET(Start,$A4,18):OFFSET(Start,$A4,37)),0)","v":0},{"$f":"IF(TODAY()-AI$2>0,SUM(OFFSET(Start,$A4,18):OFFSET(Start,$A4,37)),0)","v":0},{"$f":"IF(TODAY()-AJ$2>0,SUM(OFFSET(Start,$A4,18):OFFSET(Start,$A4,37)),0)","v":0},{"$f":"IF(TODAY()-AK$2>0,SUM(OFFSET(Start,$A4,18):OFFSET(Start,$A4,37)),0)","v":0},{"$f":"IF(TODAY()-AL$2>0,SUM(OFFSET(Start,$A4,18):OFFSET(Start,$A4,37)),0)","v":0},{"$f":"SUM(C4:AL4)","v":400.02000000000004},3500,{"$f":"AM4+AN4","v":3900.02}]
[{"$f":"+A4+1","v":4},{"$f":"OFFSET(Start,'Mellomlagring - antall besøk'!A5,0)","v":1003},{"$f":"IF(TODAY()-C$2>0,SUM(OFFSET(Start,$A5,18):OFFSET(Start,$A5,37)),0)","v":166.67000000000002},{"$f":"IF(TODAY()-D$2>0,SUM(OFFSET(Start,$A5,18):OFFSET(Start,$A5,37)),0)","v":166.67000000000002},{"$f":"IF(TODAY()-E$2>0,SUM(OFFSET(Start,$A5,18):OFFSET(Start,$A5,37)),0)","v":166.67000000000002},{"$f":"IF(TODAY()-F$2>0,SUM(OFFSET(Start,$A5,18):OFFSET(Start,$A5,37)),0)","v":166.67000000000002},{"$f":"IF(TODAY()-G$2>0,SUM(OFFSET(Start,$A5,18):OFFSET(Start,$A5,37)),0)","v":166.67000000000002},{"$f":"IF(TODAY()-H$2>0,SUM(OFFSET(Start,$A5,18):OFFSET(Start,$A5,37)),0)","v":166.67000000000002},{"$f":"IF(TODAY()-I$2>0,SUM(OFFSET(Start,$A5,18):OFFSET(Start,$A5,37)),0)","v":0},{"$f":"IF(TODAY()-J$2>0,SUM(OFFSET(Start,$A5,18):OFFSET(Start,$A5,37)),0)","v":0},{"$f":"IF(TODAY()-K$2>0,SUM(OFFSET(Start,$A5,18):OFFSET(Start,$A5,37)),0)","v":0},{"$f":"IF(TODAY()-L$2>0,SUM(OFFSET(Start,$A5,18):OFFSET(Start,$A5,37)),0)","v":0},{"$f":"IF(TODAY()-M$2>0,SUM(OFFSET(Start,$A5,18):OFFSET(Start,$A5,37)),0)","v":0},{"$f":"IF(TODAY()-N$2>0,SUM(OFFSET(Start,$A5,18):OFFSET(Start,$A5,37)),0)","v":0},{"$f":"IF(TODAY()-O$2>0,SUM(OFFSET(Start,$A5,18):OFFSET(Start,$A5,37)),0)","v":0},{"$f":"IF(TODAY()-P$2>0,SUM(OFFSET(Start,$A5,18):OFFSET(Start,$A5,37)),0)","v":0},{"$f":"IF(TODAY()-Q$2>0,SUM(OFFSET(Start,$A5,18):OFFSET(Start,$A5,37)),0)","v":0},{"$f":"IF(TODAY()-R$2>0,SUM(OFFSET(Start,$A5,18):OFFSET(Start,$A5,37)),0)","v":0},{"$f":"IF(TODAY()-S$2>0,SUM(OFFSET(Start,$A5,18):OFFSET(Start,$A5,37)),0)","v":0},{"$f":"IF(TODAY()-T$2>0,SUM(OFFSET(Start,$A5,18):OFFSET(Start,$A5,37)),0)","v":0},{"$f":"IF(TODAY()-U$2>0,SUM(OFFSET(Start,$A5,18):OFFSET(Start,$A5,37)),0)","v":0},{"$f":"IF(TODAY()-V$2>0,SUM(OFFSET(Start,$A5,18):OFFSET(Start,$A5,37)),0)","v":0},{"$f":"IF(TODAY()-W$2>0,SUM(OFFSET(Start,$A5,18):OFFSET(Start,$A5,37)),0)","v":0},{"$f":"IF(TODAY()-X$2>0,SUM(OFFSET(Start,$A5,18):OFFSET(Start,$A5,37)),0)","v":0},{"$f":"IF(TODAY()-Y$2>0,SUM(OFFSET(Start,$A5,18):OFFSET(Start,$A5,37)),0)","v":0},{"$f":"IF(TODAY()-Z$2>0,SUM(OFFSET(Start,$A5,18):OFFSET(Start,$A5,37)),0)","v":0},{"$f":"IF(TODAY()-AA$2>0,SUM(OFFSET(Start,$A5,18):OFFSET(Start,$A5,37)),0)","v":0},{"$f":"IF(TODAY()-AB$2>0,SUM(OFFSET(Start,$A5,18):OFFSET(Start,$A5,37)),0)","v":0},{"$f":"IF(TODAY()-AC$2>0,SUM(OFFSET(Start,$A5,18):OFFSET(Start,$A5,37)),0)","v":0},{"$f":"IF(TODAY()-AD$2>0,SUM(OFFSET(Start,$A5,18):OFFSET(Start,$A5,37)),0)","v":0},{"$f":"IF(TODAY()-AE$2>0,SUM(OFFSET(Start,$A5,18):OFFSET(Start,$A5,37)),0)","v":0},{"$f":"IF(TODAY()-AF$2>0,SUM(OFFSET(Start,$A5,18):OFFSET(Start,$A5,37)),0)","v":0},{"$f":"IF(TODAY()-AG$2>0,SUM(OFFSET(Start,$A5,18):OFFSET(Start,$A5,37)),0)","v":0},{"$f":"IF(TODAY()-AH$2>0,SUM(OFFSET(Start,$A5,18):OFFSET(Start,$A5,37)),0)","v":0},{"$f":"IF(TODAY()-AI$2>0,SUM(OFFSET(Start,$A5,18):OFFSET(Start,$A5,37)),0)","v":0},{"$f":"IF(TODAY()-AJ$2>0,SUM(OFFSET(Start,$A5,18):OFFSET(Start,$A5,37)),0)","v":0},{"$f":"IF(TODAY()-AK$2>0,SUM(OFFSET(Start,$A5,18):OFFSET(Start,$A5,37)),0)","v":0},{"$f":"IF(TODAY()-AL$2>0,SUM(OFFSET(Start,$A5,18):OFFSET(Start,$A5,37)),0)","v":0},1000.0200000000002,900,1900.0200000000002]
[5,{"$f":"OFFSET(Start,'Mellomlagring - antall besøk'!A6,0)","v":0},{"$f":"IF(TODAY()-C$2>0,SUM(OFFSET(Start,$A6,18):OFFSET(Start,$A6,37)),0)","v":0},{"$f":"IF(TODAY()-D$2>0,SUM(OFFSET(Start,$A6,18):OFFSET(Start,$A6,37)),0)","v":0},{"$f":"IF(TODAY()-E$2>0,SUM(OFFSET(Start,$A6,18):OFFSET(Start,$A6,37)),0)","v":0},{"$f":"IF(TODAY()-F$2>0,SUM(OFFSET(Start,$A6,18):OFFSET(Start,$A6,37)),0)","v":0},{"$f":"IF(TODAY()-G$2>0,SUM(OFFSET(Start,$A6,18):OFFSET(Start,$A6,37)),0)","v":0},{"$f":"IF(TODAY()-H$2>0,SUM(OFFSET(Start,$A6,18):OFFSET(Start,$A6,37)),0)","v":0},{"$f":"IF(TODAY()-I$2>0,SUM(OFFSET(Start,$A6,18):OFFSET(Start,$A6,37)),0)","v":0},{"$f":"IF(TODAY()-J$2>0,SUM(OFFSET(Start,$A6,18):OFFSET(Start,$A6,37)),0)","v":0},{"$f":"IF(TODAY()-K$2>0,SUM(OFFSET(Start,$A6,18):OFFSET(Start,$A6,37)),0)","v":0},{"$f":"IF(TODAY()-L$2>0,SUM(OFFSET(Start,$A6,18):OFFSET(Start,$A6,37)),0)","v":0},{"$f":"IF(TODAY()-M$2>0,SUM(OFFSET(Start,$A6,18):OFFSET(Start,$A6,37)),0)","v":0},{"$f":"IF(TODAY()-N$2>0,SUM(OFFSET(Start,$A6,18):OFFSET(Start,$A6,37)),0)","v":0},{"$f":"IF(TODAY()-O$2>0,SUM(OFFSET(Start,$A6,18):OFFSET(Start,$A6,37)),0)","v":0},{"$f":"IF(TODAY()-P$2>0,SUM(OFFSET(Start,$A6,18):OFFSET(Start,$A6,37)),0)","v":0},{"$f":"IF(TODAY()-Q$2>0,SUM(OFFSET(Start,$A6,18):OFFSET(Start,$A6,37)),0)","v":0},{"$f":"IF(TODAY()-R$2>0,SUM(OFFSET(Start,$A6,18):OFFSET(Start,$A6,37)),0)","v":0},{"$f":"IF(TODAY()-S$2>0,SUM(OFFSET(Start,$A6,18):OFFSET(Start,$A6,37)),0)","v":0},{"$f":"IF(TODAY()-T$2>0,SUM(OFFSET(Start,$A6,18):OFFSET(Start,$A6,37)),0)","v":0},{"$f":"IF(TODAY()-U$2>0,SUM(OFFSET(Start,$A6,18):OFFSET(Start,$A6,37)),0)","v":0},{"$f":"IF(TODAY()-V$2>0,SUM(OFFSET(Start,$A6,18):OFFSET(Start,$A6,37)),0)","v":0},{"$f":"IF(TODAY()-W$2>0,SUM(OFFSET(Start,$A6,18):OFFSET(Start,$A6,37)),0)","v":0},{"$f":"IF(TODAY()-X$2>0,SUM(OFFSET(Start,$A6,18):OFFSET(Start,$A6,37)),0)","v":0},{"$f":"IF(TODAY()-Y$2>0,SUM(OFFSET(Start,$A6,18):OFFSET(Start,$A6,37)),0)","v":0},{"$f":"IF(TODAY()-Z$2>0,SUM(OFFSET(Start,$A6,18):OFFSET(Start,$A6,37)),0)","v":0},{"$f":"IF(TODAY()-AA$2>0,SUM(OFFSET(Start,$A6,18):OFFSET(Start,$A6,37)),0)","v":0},{"$f":"IF(TODAY()-AB$2>0,SUM(OFFSET(Start,$A6,18):OFFSET(Start,$A6,37)),0)","v":0},{"$f":"IF(TODAY()-AC$2>0,SUM(OFFSET(Start,$A6,18):OFFSET(Start,$A6,37)),0)","v":0},{"$f":"IF(TODAY()-AD$2>0,SUM(OFFSET(Start,$A6,18):OFFSET(Start,$A6,37)),0)","v":0},{"$f":"IF(TODAY()-AE$2>0,SUM(OFFSET(Start,$A6,18):OFFSET(Start,$A6,37)),0)","v":0},{"$f":"IF(TODAY()-AF$2>0,SUM(OFFSET(Start,$A6,18):OFFSET(Start,$A6,37)),0)","v":0},{"$f":"IF(TODAY()-AG$2>0,SUM(OFFSET(Start,$A6,18):OFFSET(Start,$A6,37)),0)","v":0},{"$f":"IF(TODAY()-AH$2>0,SUM(OFFSET(Start,$A6,18):OFFSET(Start,$A6,37)),0)","v":0},{"$f":"IF(TODAY()-AI$2>0,SUM(OFFSET(Start,$A6,18):OFFSET(Start,$A6,37)),0)","v":0},{"$f":"IF(TODAY()-AJ$2>0,SUM(OFFSET(Start,$A6,18):OFFSET(Start,$A6,37)),0)","v":0},{"$f":"IF(TODAY()-AK$2>0,SUM(OFFSET(Start,$A6,18):OFFSET(Start,$A6,37)),0)","v":0},{"$f":"IF(TODAY()-AL$2>0,SUM(OFFSET(Start,$A6,18):OFFSET(Start,$A6,37)),0)","v":0},0,0,0]
[6,{"$f":"OFFSET(Start,'Mellomlagring - antall besøk'!A7,0)","v":0},{"$f":"IF(TODAY()-C$2>0,SUM(OFFSET(Start,$A7,18):OFFSET(Start,$A7,37)),0)","v":0},{"$f":"IF(TODAY()-D$2>0,SUM(OFFSET(Start,$A7,18):OFFSET(Start,$A7,37)),0)","v":0},{"$f":"IF(TODAY()-E$2>0,SUM(OFFSET(Start,$A7,18):OFFSET(Start,$A7,37)),0)","v":0},{"$f":"IF(TODAY()-F$2>0,SUM(OFFSET(Start,$A7,18):OFFSET(Start,$A7,37)),0)","v":0},{"$f":"IF(TODAY()-G$2>0,SUM(OFFSET(Start,$A7,18):OFFSET(Start,$A7,37)),0)","v":0},{"$f":"IF(TODAY()-H$2>0,SUM(OFFSET(Start,$A7,18):OFFSET(Start,$A7,37)),0)","v":0},{"$f":"IF(TODAY()-I$2>0,SUM(OFFSET(Start,$A7,18):OFFSET(Start,$A7,37)),0)","v":0},{"$f":"IF(TODAY()-J$2>0,SUM(OFFSET(Start,$A7,18):OFFSET(Start,$A7,37)),0)","v":0},{"$f":"IF(TODAY()-K$2>0,SUM(OFFSET(Start,$A7,18):OFFSET(Start,$A7,37)),0)","v":0},{"$f":"IF(TODAY()-L$2>0,SUM(OFFSET(Start,$A7,18):OFFSET(Start,$A7,37)),0)","v":0},{"$f":"IF(TODAY()-M$2>0,SUM(OFFSET(Start,$A7,18):OFFSET(Start,$A7,37)),0)","v":0},{"$f":"IF(TODAY()-N$2>0,SUM(OFFSET(Start,$A7,18):OFFSET(Start,$A7,37)),0)","v":0},{"$f":"IF(TODAY()-O$2>0,SUM(OFFSET(Start,$A7,18):OFFSET(Start,$A7,37)),0)","v":0},{"$f":"IF(TODAY()-P$2>0,SUM(OFFSET(Start,$A7,18):OFFSET(Start,$A7,37)),0)","v":0},{"$f":"IF(TODAY()-Q$2>0,SUM(OFFSET(Start,$A7,18):OFFSET(Start,$A7,37)),0)","v":0},{"$f":"IF(TODAY()-R$2>0,SUM(OFFSET(Start,$A7,18):OFFSET(Start,$A7,37)),0)","v":0},{"$f":"IF(TODAY()-S$2>0,SUM(OFFSET(Start,$A7,18):OFFSET(Start,$A7,37)),0)","v":0},{"$f":"IF(TODAY()-T$2>0,SUM(OFFSET(Start,$A7,18):OFFSET(Start,$A7,37)),0)","v":0},{"$f":"IF(TODAY()-U$2>0,SUM(OFFSET(Start,$A7,18):OFFSET(Start,$A7,37)),0)","v":0},{"$f":"IF(TODAY()-V$2>0,SUM(OFFSET(Start,$A7,18):OFFSET(Start,$A7,37)),0)","v":0},{"$f":"IF(TODAY()-W$2>0,SUM(OFFSET(Start,$A7,18):OFFSET(Start,$A7,37)),0)","v":0},{"$f":"IF(TODAY()-X$2>0,SUM(OFFSET(Start,$A7,18):OFFSET(Start,$A7,37)),0)","v":0},{"$f":"IF(TODAY()-Y$2>0,SUM(OFFSET(Start,$A7,18):OFFSET(Start,$A7,37)),0)","v":0},{"$f":"IF(TODAY()-Z$2>0,SUM(OFFSET(Start,$A7,18):OFFSET(Start,$A7,37)),0)","v":0},{"$f":"IF(TODAY()-AA$2>0,SUM(OFFSET(Start,$A7,18):OFFSET(Start,$A7,37)),0)","v":0},{"$f":"IF(TODAY()-AB$2>0,SUM(OFFSET(Start,$A7,18):OFFSET(Start,$A7,37)),0)","v":0},{"$f":"IF(TODAY()-AC$2>0,SUM(OFFSET(Start,$A7,18):OFFSET(Start,$A7,37)),0)","v":0},{"$f":"IF(TODAY()-AD$2>0,SUM(OFFSET(Start,$A7,18):OFFSET(Start,$A7,37)),0)","v":0},{"$f":"IF(TODAY()-AE$2>0,SUM(OFFSET(Start,$A7,18):OFFSET(Start,$A7,37)),0)","v":0},{"$f":"IF(TODAY()-AF$2>0,SUM(OFFSET(Start,$A7,18):OFFSET(Start,$A7,37)),0)","v":0},{"$f":"IF(TODAY()-AG$2>0,SUM(OFFSET(Start,$A7,18):OFFSET(Start,$A7,37)),0)","v":0},{"$f":"IF(TODAY()-AH$2>0,SUM(OFFSET(Start,$A7,18):OFFSET(Start,$A7,37)),0)","v":0},{"$f":"IF(TODAY()-AI$2>0,SUM(OFFSET(Start,$A7,18):OFFSET(Start,$A7,37)),0)","v":0},{"$f":"IF(TODAY()-AJ$2>0,SUM(OFFSET(Start,$A7,18):OFFSET(Start,$A7,37)),0)","v":0},{"$f":"IF(TODAY()-AK$2>0,SUM(OFFSET(Start,$A7,18):OFFSET(Start,$A7,37)),0)","v":0},{"$f":"IF(TODAY()-AL$2>0,SUM(OFFSET(Start,$A7,18):OFFSET(Start,$A7,37)),0)","v":0},0,0,0]
[7,{"$f":"OFFSET(Start,'Mellomlagring - antall besøk'!A8,0)","v":0},{"$f":"IF(TODAY()-C$2>0,SUM(OFFSET(Start,$A8,18):OFFSET(Start,$A8,37)),0)","v":0},{"$f":"IF(TODAY()-D$2>0,SUM(OFFSET(Start,$A8,18):OFFSET(Start,$A8,37)),0)","v":0},{"$f":"IF(TODAY()-E$2>0,SUM(OFFSET(Start,$A8,18):OFFSET(Start,$A8,37)),0)","v":0},{"$f":"IF(TODAY()-F$2>0,SUM(OFFSET(Start,$A8,18):OFFSET(Start,$A8,37)),0)","v":0},{"$f":"IF(TODAY()-G$2>0,SUM(OFFSET(Start,$A8,18):OFFSET(Start,$A8,37)),0)","v":0},{"$f":"IF(TODAY()-H$2>0,SUM(OFFSET(Start,$A8,18):OFFSET(Start,$A8,37)),0)","v":0},{"$f":"IF(TODAY()-I$2>0,SUM(OFFSET(Start,$A8,18):OFFSET(Start,$A8,37)),0)","v":0},{"$f":"IF(TODAY()-J$2>0,SUM(OFFSET(Start,$A8,18):OFFSET(Start,$A8,37)),0)","v":0},{"$f":"IF(TODAY()-K$2>0,SUM(OFFSET(Start,$A8,18):OFFSET(Start,$A8,37)),0)","v":0},{"$f":"IF(TODAY()-L$2>0,SUM(OFFSET(Start,$A8,18):OFFSET(Start,$A8,37)),0)","v":0},{"$f":"IF(TODAY()-M$2>0,SUM(OFFSET(Start,$A8,18):OFFSET(Start,$A8,37)),0)","v":0},{"$f":"IF(TODAY()-N$2>0,SUM(OFFSET(Start,$A8,18):OFFSET(Start,$A8,37)),0)","v":0},{"$f":"IF(TODAY()-O$2>0,SUM(OFFSET(Start,$A8,18):OFFSET(Start,$A8,37)),0)","v":0},{"$f":"IF(TODAY()-P$2>0,SUM(OFFSET(Start,$A8,18):OFFSET(Start,$A8,37)),0)","v":0},{"$f":"IF(TODAY()-Q$2>0,SUM(OFFSET(Start,$A8,18):OFFSET(Start,$A8,37)),0)","v":0},{"$f":"IF(TODAY()-R$2>0,SUM(OFFSET(Start,$A8,18):OFFSET(Start,$A8,37)),0)","v":0},{"$f":"IF(TODAY()-S$2>0,SUM(OFFSET(Start,$A8,18):OFFSET(Start,$A8,37)),0)","v":0},{"$f":"IF(TODAY()-T$2>0,SUM(OFFSET(Start,$A8,18):OFFSET(Start,$A8,37)),0)","v":0},{"$f":"IF(TODAY()-U$2>0,SUM(OFFSET(Start,$A8,18):OFFSET(Start,$A8,37)),0)","v":0},{"$f":"IF(TODAY()-V$2>0,SUM(OFFSET(Start,$A8,18):OFFSET(Start,$A8,37)),0)","v":0},{"$f":"IF(TODAY()-W$2>0,SUM(OFFSET(Start,$A8,18):OFFSET(Start,$A8,37)),0)","v":0},{"$f":"IF(TODAY()-X$2>0,SUM(OFFSET(Start,$A8,18):OFFSET(Start,$A8,37)),0)","v":0},{"$f":"IF(TODAY()-Y$2>0,SUM(OFFSET(Start,$A8,18):OFFSET(Start,$A8,37)),0)","v":0},{"$f":"IF(TODAY()-Z$2>0,SUM(OFFSET(Start,$A8,18):OFFSET(Start,$A8,37)),0)","v":0},{"$f":"IF(TODAY()-AA$2>0,SUM(OFFSET(Start,$A8,18):OFFSET(Start,$A8,37)),0)","v":0},{"$f":"IF(TODAY()-AB$2>0,SUM(OFFSET(Start,$A8,18):OFFSET(Start,$A8,37)),0)","v":0},{"$f":"IF(TODAY()-AC$2>0,SUM(OFFSET(Start,$A8,18):OFFSET(Start,$A8,37)),0)","v":0},{"$f":"IF(TODAY()-AD$2>0,SUM(OFFSET(Start,$A8,18):OFFSET(Start,$A8,37)),0)","v":0},{"$f":"IF(TODAY()-AE$2>0,SUM(OFFSET(Start,$A8,18):OFFSET(Start,$A8,37)),0)","v":0},{"$f":"IF(TODAY()-AF$2>0,SUM(OFFSET(Start,$A8,18):OFFSET(Start,$A8,37)),0)","v":0},{"$f":"IF(TODAY()-AG$2>0,SUM(OFFSET(Start,$A8,18):OFFSET(Start,$A8,37)),0)","v":0},{"$f":"IF(TODAY()-AH$2>0,SUM(OFFSET(Start,$A8,18):OFFSET(Start,$A8,37)),0)","v":0},{"$f":"IF(TODAY()-AI$2>0,SUM(OFFSET(Start,$A8,18):OFFSET(Start,$A8,37)),0)","v":0},{"$f":"IF(TODAY()-AJ$2>0,SUM(OFFSET(Start,$A8,18):OFFSET(Start,$A8,37)),0)","v":0},{"$f":"IF(TODAY()-AK$2>0,SUM(OFFSET(Start,$A8,18):OFFSET(Start,$A8,37)),0)","v":0},{"$f":"IF(TODAY()-AL$2>0,SUM(OFFSET(Start,$A8,18):OFFSET(Start,$A8,37)),0)","v":0},0,0,0]
[8,{"$f":"OFFSET(Start,'Mellomlagring - antall besøk'!A9,0)","v":0},{"$f":"IF(TODAY()-C$2>0,SUM(OFFSET(Start,$A9,18):OFFSET(Start,$A9,37)),0)","v":0},{"$f":"IF(TODAY()-D$2>0,SUM(OFFSET(Start,$A9,18):OFFSET(Start,$A9,37)),0)","v":0},{"$f":"IF(TODAY()-E$2>0,SUM(OFFSET(Start,$A9,18):OFFSET(Start,$A9,37)),0)","v":0},{"$f":"IF(TODAY()-F$2>0,SUM(OFFSET(Start,$A9,18):OFFSET(Start,$A9,37)),0)","v":0},{"$f":"IF(TODAY()-G$2>0,SUM(OFFSET(Start,$A9,18):OFFSET(Start,$A9,37)),0)","v":0},{"$f":"IF(TODAY()-H$2>0,SUM(OFFSET(Start,$A9,18):OFFSET(Start,$A9,37)),0)","v":0},{"$f":"IF(TODAY()-I$2>0,SUM(OFFSET(Start,$A9,18):OFFSET(Start,$A9,37)),0)","v":0},{"$f":"IF(TODAY()-J$2>0,SUM(OFFSET(Start,$A9,18):OFFSET(Start,$A9,37)),0)","v":0},{"$f":"IF(TODAY()-K$2>0,SUM(OFFSET(Start,$A9,18):OFFSET(Start,$A9,37)),0)","v":0},{"$f":"IF(TODAY()-L$2>0,SUM(OFFSET(Start,$A9,18):OFFSET(Start,$A9,37)),0)","v":0},{"$f":"IF(TODAY()-M$2>0,SUM(OFFSET(Start,$A9,18):OFFSET(Start,$A9,37)),0)","v":0},{"$f":"IF(TODAY()-N$2>0,SUM(OFFSET(Start,$A9,18):OFFSET(Start,$A9,37)),0)","v":0},{"$f":"IF(TODAY()-O$2>0,SUM(OFFSET(Start,$A9,18):OFFSET(Start,$A9,37)),0)","v":0},{"$f":"IF(TODAY()-P$2>0,SUM(OFFSET(Start,$A9,18):OFFSET(Start,$A9,37)),0)","v":0},{"$f":"IF(TODAY()-Q$2>0,SUM(OFFSET(Start,$A9,18):OFFSET(Start,$A9,37)),0)","v":0},{"$f":"IF(TODAY()-R$2>0,SUM(OFFSET(Start,$A9,18):OFFSET(Start,$A9,37)),0)","v":0},{"$f":"IF(TODAY()-S$2>0,SUM(OFFSET(Start,$A9,18):OFFSET(Start,$A9,37)),0)","v":0},{"$f":"IF(TODAY()-T$2>0,SUM(OFFSET(Start,$A9,18):OFFSET(Start,$A9,37)),0)","v":0},{"$f":"IF(TODAY()-U$2>0,SUM(OFFSET(Start,$A9,18):OFFSET(Start,$A9,37)),0)","v":0},{"$f":"IF(TODAY()-V$2>0,SUM(OFFSET(Start,$A9,18):OFFSET(Start,$A9,37)),0)","v":0},{"$f":"IF(TODAY()-W$2>0,SUM(OFFSET(Start,$A9,18):OFFSET(Start,$A9,37)),0)","v":0},{"$f":"IF(TODAY()-X$2>0,SUM(OFFSET(Start,$A9,18):OFFSET(Start,$A9,37)),0)","v":0},{"$f":"IF(TODAY()-Y$2>0,SUM(OFFSET(Start,$A9,18):OFFSET(Start,$A9,37)),0)","v":0},{"$f":"IF(TODAY()-Z$2>0,SUM(OFFSET(Start,$A9,18):OFFSET(Start,$A9,37)),0)","v":0},{"$f":"IF(TODAY()-AA$2>0,SUM(OFFSET(Start,$A9,18):OFFSET(Start,$A9,37)),0)","v":0},{"$f":"IF(TODAY()-AB$2>0,SUM(OFFSET(Start,$A9,18):OFFSET(Start,$A9,37)),0)","v":0},{"$f":"IF(TODAY()-AC$2>0,SUM(OFFSET(Start,$A9,18):OFFSET(Start,$A9,37)),0)","v":0},{"$f":"IF(TODAY()-AD$2>0,SUM(OFFSET(Start,$A9,18):OFFSET(Start,$A9,37)),0)","v":0},{"$f":"IF(TODAY()-AE$2>0,SUM(OFFSET(Start,$A9,18):OFFSET(Start,$A9,37)),0)","v":0},{"$f":"IF(TODAY()-AF$2>0,SUM(OFFSET(Start,$A9,18):OFFSET(Start,$A9,37)),0)","v":0},{"$f":"IF(TODAY()-AG$2>0,SUM(OFFSET(Start,$A9,18):OFFSET(Start,$A9,37)),0)","v":0},{"$f":"IF(TODAY()-AH$2>0,SUM(OFFSET(Start,$A9,18):OFFSET(Start,$A9,37)),0)","v":0},{"$f":"IF(TODAY()-AI$2>0,SUM(OFFSET(Start,$A9,18):OFFSET(Start,$A9,37)),0)","v":0},{"$f":"IF(TODAY()-AJ$2>0,SUM(OFFSET(Start,$A9,18):OFFSET(Start,$A9,37)),0)","v":0},{"$f":"IF(TODAY()-AK$2>0,SUM(OFFSET(Start,$A9,18):OFFSET(Start,$A9,37)),0)","v":0},{"$f":"IF(TODAY()-AL$2>0,SUM(OFFSET(Start,$A9,18):OFFSET(Start,$A9,37)),0)","v":0},0,0,0]
[9,{"$f":"OFFSET(Start,'Mellomlagring - antall besøk'!A10,0)","v":0},{"$f":"IF(TODAY()-C$2>0,SUM(OFFSET(Start,$A10,18):OFFSET(Start,$A10,37)),0)","v":0},{"$f":"IF(TODAY()-D$2>0,SUM(OFFSET(Start,$A10,18):OFFSET(Start,$A10,37)),0)","v":0},{"$f":"IF(TODAY()-E$2>0,SUM(OFFSET(Start,$A10,18):OFFSET(Start,$A10,37)),0)","v":0},{"$f":"IF(TODAY()-F$2>0,SUM(OFFSET(Start,$A10,18):OFFSET(Start,$A10,37)),0)","v":0},{"$f":"IF(TODAY()-G$2>0,SUM(OFFSET(Start,$A10,18):OFFSET(Start,$A10,37)),0)","v":0},{"$f":"IF(TODAY()-H$2>0,SUM(OFFSET(Start,$A10,18):OFFSET(Start,$A10,37)),0)","v":0},{"$f":"IF(TODAY()-I$2>0,SUM(OFFSET(Start,$A10,18):OFFSET(Start,$A10,37)),0)","v":0},{"$f":"IF(TODAY()-J$2>0,SUM(OFFSET(Start,$A10,18):OFFSET(Start,$A10,37)),0)","v":0},{"$f":"IF(TODAY()-K$2>0,SUM(OFFSET(Start,$A10,18):OFFSET(Start,$A10,37)),0)","v":0},{"$f":"IF(TODAY()-L$2>0,SUM(OFFSET(Start,$A10,18):OFFSET(Start,$A10,37)),0)","v":0},{"$f":"IF(TODAY()-M$2>0,SUM(OFFSET(Start,$A10,18):OFFSET(Start,$A10,37)),0)","v":0},{"$f":"IF(TODAY()-N$2>0,SUM(OFFSET(Start,$A10,18):OFFSET(Start,$A10,37)),0)","v":0},{"$f":"IF(TODAY()-O$2>0,SUM(OFFSET(Start,$A10,18):OFFSET(Start,$A10,37)),0)","v":0},{"$f":"IF(TODAY()-P$2>0,SUM(OFFSET(Start,$A10,18):OFFSET(Start,$A10,37)),0)","v":0},{"$f":"IF(TODAY()-Q$2>0,SUM(OFFSET(Start,$A10,18):OFFSET(Start,$A10,37)),0)","v":0},{"$f":"IF(TODAY()-R$2>0,SUM(OFFSET(Start,$A10,18):OFFSET(Start,$A10,37)),0)","v":0},{"$f":"IF(TODAY()-S$2>0,SUM(OFFSET(Start,$A10,18):OFFSET(Start,$A10,37)),0)","v":0},{"$f":"IF(TODAY()-T$2>0,SUM(OFFSET(Start,$A10,18):OFFSET(Start,$A10,37)),0)","v":0},{"$f":"IF(TODAY()-U$2>0,SUM(OFFSET(Start,$A10,18):OFFSET(Start,$A10,37)),0)","v":0},{"$f":"IF(TODAY()-V$2>0,SUM(OFFSET(Start,$A10,18):OFFSET(Start,$A10,37)),0)","v":0},{"$f":"IF(TODAY()-W$2>0,SUM(OFFSET(Start,$A10,18):OFFSET(Start,$A10,37)),0)","v":0},{"$f":"IF(TODAY()-X$2>0,SUM(OFFSET(Start,$A10,18):OFFSET(Start,$A10,37)),0)","v":0},{"$f":"IF(TODAY()-Y$2>0,SUM(OFFSET(Start,$A10,18):OFFSET(Start,$A10,37)),0)","v":0},{"$f":"IF(TODAY()-Z$2>0,SUM(OFFSET(Start,$A10,18):OFFSET(Start,$A10,37)),0)","v":0},{"$f":"IF(TODAY()-AA$2>0,SUM(OFFSET(Start,$A10,18):OFFSET(Start,$A10,37)),0)","v":0},{"$f":"IF(TODAY()-AB$2>0,SUM(OFFSET(Start,$A10,18):OFFSET(Start,$A10,37)),0)","v":0},{"$f":"IF(TODAY()-AC$2>0,SUM(OFFSET(Start,$A10,18):OFFSET(Start,$A10,37)),0)","v":0},{"$f":"IF(TODAY()-AD$2>0,SUM(OFFSET(Start,$A10,18):OFFSET(Start,$A10,37)),0)","v":0},{"$f":"IF(TODAY()-AE$2>0,SUM(OFFSET(Start,$A10,18):OFFSET(Start,$A10,37)),0)","v":0},{"$f":"IF(TODAY()-AF$2>0,SUM(OFFSET(Start,$A10,18):OFFSET(Start,$A10,37)),0)","v":0},{"$f":"IF(TODAY()-AG$2>0,SUM(OFFSET(Start,$A10,18):OFFSET(Start,$A10,37)),0)","v":0},{"$f":"IF(TODAY()-AH$2>0,SUM(OFFSET(Start,$A10,18):OFFSET(Start,$A10,37)),0)","v":0},{"$f":"IF(TODAY()-AI$2>0,SUM(OFFSET(Start,$A10,18):OFFSET(Start,$A10,37)),0)","v":0},{"$f":"IF(TODAY()-AJ$2>0,SUM(OFFSET(Start,$A10,18):OFFSET(Start,$A10,37)),0)","v":0},{"$f":"IF(TODAY()-AK$2>0,SUM(OFFSET(Start,$A10,18):OFFSET(Start,$A10,37)),0)","v":0},{"$f":"IF(TODAY()-AL$2>0,SUM(OFFSET(Start,$A10,18):OFFSET(Start,$A10,37)),0)","v":0},0,0,0]
[10,{"$f":"OFFSET(Start,'Mellomlagring - antall besøk'!A11,0)","v":0},{"$f":"IF(TODAY()-C$2>0,SUM(OFFSET(Start,$A11,18):OFFSET(Start,$A11,37)),0)","v":0},{"$f":"IF(TODAY()-D$2>0,SUM(OFFSET(Start,$A11,18):OFFSET(Start,$A11,37)),0)","v":0},{"$f":"IF(TODAY()-E$2>0,SUM(OFFSET(Start,$A11,18):OFFSET(Start,$A11,37)),0)","v":0},{"$f":"IF(TODAY()-F$2>0,SUM(OFFSET(Start,$A11,18):OFFSET(Start,$A11,37)),0)","v":0},{"$f":"IF(TODAY()-G$2>0,SUM(OFFSET(Start,$A11,18):OFFSET(Start,$A11,37)),0)","v":0},{"$f":"IF(TODAY()-H$2>0,SUM(OFFSET(Start,$A11,18):OFFSET(Start,$A11,37)),0)","v":0},{"$f":"IF(TODAY()-I$2>0,SUM(OFFSET(Start,$A11,18):OFFSET(Start,$A11,37)),0)","v":0},{"$f":"IF(TODAY()-J$2>0,SUM(OFFSET(Start,$A11,18):OFFSET(Start,$A11,37)),0)","v":0},{"$f":"IF(TODAY()-K$2>0,SUM(OFFSET(Start,$A11,18):OFFSET(Start,$A11,37)),0)","v":0},{"$f":"IF(TODAY()-L$2>0,SUM(OFFSET(Start,$A11,18):OFFSET(Start,$A11,37)),0)","v":0},{"$f":"IF(TODAY()-M$2>0,SUM(OFFSET(Start,$A11,18):OFFSET(Start,$A11,37)),0)","v":0},{"$f":"IF(TODAY()-N$2>0,SUM(OFFSET(Start,$A11,18):OFFSET(Start,$A11,37)),0)","v":0},{"$f":"IF(TODAY()-O$2>0,SUM(OFFSET(Start,$A11,18):OFFSET(Start,$A11,37)),0)","v":0},{"$f":"IF(TODAY()-P$2>0,SUM(OFFSET(Start,$A11,18):OFFSET(Start,$A11,37)),0)","v":0},{"$f":"IF(TODAY()-Q$2>0,SUM(OFFSET(Start,$A11,18):OFFSET(Start,$A11,37)),0)","v":0},{"$f":"IF(TODAY()-R$2>0,SUM(OFFSET(Start,$A11,18):OFFSET(Start,$A11,37)),0)","v":0},{"$f":"IF(TODAY()-S$2>0,SUM(OFFSET(Start,$A11,18):OFFSET(Start,$A11,37)),0)","v":0},{"$f":"IF(TODAY()-T$2>0,SUM(OFFSET(Start,$A11,18):OFFSET(Start,$A11,37)),0)","v":0},{"$f":"IF(TODAY()-U$2>0,SUM(OFFSET(Start,$A11,18):OFFSET(Start,$A11,37)),0)","v":0},{"$f":"IF(TODAY()-V$2>0,SUM(OFFSET(Start,$A11,18):OFFSET(Start,$A11,37)),0)","v":0},{"$f":"IF(TODAY()-W$2>0,SUM(OFFSET(Start,$A11,18):OFFSET(Start,$A11,37)),0)","v":0},{"$f":"IF(TODAY()-X$2>0,SUM(OFFSET(Start,$A11,18):OFFSET(Start,$A11,37)),0)","v":0},{"$f":"IF(TODAY()-Y$2>0,SUM(OFFSET(Start,$A11,18):OFFSET(Start,$A11,37)),0)","v":0},{"$f":"IF(TODAY()-Z$2>0,SUM(OFFSET(Start,$A11,18):OFFSET(Start,$A11,37)),0)","v":0},{"$f":"IF(TODAY()-AA$2>0,SUM(OFFSET(Start,$A11,18):OFFSET(Start,$A11,37)),0)","v":0},{"$f":"IF(TODAY()-AB$2>0,SUM(OFFSET(Start,$A11,18):OFFSET(Start,$A11,37)),0)","v":0},{"$f":"IF(TODAY()-AC$2>0,SUM(OFFSET(Start,$A11,18):OFFSET(Start,$A11,37)),0)","v":0},{"$f":"IF(TODAY()-AD$2>0,SUM(OFFSET(Start,$A11,18):OFFSET(Start,$A11,37)),0)","v":0},{"$f":"IF(TODAY()-AE$2>0,SUM(OFFSET(Start,$A11,18):OFFSET(Start,$A11,37)),0)","v":0},{"$f":"IF(TODAY()-AF$2>0,SUM(OFFSET(Start,$A11,18):OFFSET(Start,$A11,37)),0)","v":0},{"$f":"IF(TODAY()-AG$2>0,SUM(OFFSET(Start,$A11,18):OFFSET(Start,$A11,37)),0)","v":0},{"$f":"IF(TODAY()-AH$2>0,SUM(OFFSET(Start,$A11,18):OFFSET(Start,$A11,37)),0)","v":0},{"$f":"IF(TODAY()-AI$2>0,SUM(OFFSET(Start,$A11,18):OFFSET(Start,$A11,37)),0)","v":0},{"$f":"IF(TODAY()-AJ$2>0,SUM(OFFSET(Start,$A11,18):OFFSET(Start,$A11,37)),0)","v":0},{"$f":"IF(TODAY()-AK$2>0,SUM(OFFSET(Start,$A11,18):OFFSET(Start,$A11,37)),0)","v":0},{"$f":"IF(TODAY()-AL$2>0,SUM(OFFSET(Start,$A11,18):OFFSET(Start,$A11,37)),0)","v":0},0,0,0]
[11,{"$f":"OFFSET(Start,'Mellomlagring - antall besøk'!A12,0)","v":0},{"$f":"IF(TODAY()-C$2>0,SUM(OFFSET(Start,$A12,18):OFFSET(Start,$A12,37)),0)","v":0},{"$f":"IF(TODAY()-D$2>0,SUM(OFFSET(Start,$A12,18):OFFSET(Start,$A12,37)),0)","v":0},{"$f":"IF(TODAY()-E$2>0,SUM(OFFSET(Start,$A12,18):OFFSET(Start,$A12,37)),0)","v":0},{"$f":"IF(TODAY()-F$2>0,SUM(OFFSET(Start,$A12,18):OFFSET(Start,$A12,37)),0)","v":0},{"$f":"IF(TODAY()-G$2>0,SUM(OFFSET(Start,$A12,18):OFFSET(Start,$A12,37)),0)","v":0},{"$f":"IF(TODAY()-H$2>0,SUM(OFFSET(Start,$A12,18):OFFSET(Start,$A12,37)),0)","v":0},{"$f":"IF(TODAY()-I$2>0,SUM(OFFSET(Start,$A12,18):OFFSET(Start,$A12,37)),0)","v":0},{"$f":"IF(TODAY()-J$2>0,SUM(OFFSET(Start,$A12,18):OFFSET(Start,$A12,37)),0)","v":0},{"$f":"IF(TODAY()-K$2>0,SUM(OFFSET(Start,$A12,18):OFFSET(Start,$A12,37)),0)","v":0},{"$f":"IF(TODAY()-L$2>0,SUM(OFFSET(Start,$A12,18):OFFSET(Start,$A12,37)),0)","v":0},{"$f":"IF(TODAY()-M$2>0,SUM(OFFSET(Start,$A12,18):OFFSET(Start,$A12,37)),0)","v":0},{"$f":"IF(TODAY()-N$2>0,SUM(OFFSET(Start,$A12,18):OFFSET(Start,$A12,37)),0)","v":0},{"$f":"IF(TODAY()-O$2>0,SUM(OFFSET(Start,$A12,18):OFFSET(Start,$A12,37)),0)","v":0},{"$f":"IF(TODAY()-P$2>0,SUM(OFFSET(Start,$A12,18):OFFSET(Start,$A12,37)),0)","v":0},{"$f":"IF(TODAY()-Q$2>0,SUM(OFFSET(Start,$A12,18):OFFSET(Start,$A12,37)),0)","v":0},{"$f":"IF(TODAY()-R$2>0,SUM(OFFSET(Start,$A12,18):OFFSET(Start,$A12,37)),0)","v":0},{"$f":"IF(TODAY()-S$2>0,SUM(OFFSET(Start,$A12,18):OFFSET(Start,$A12,37)),0)","v":0},{"$f":"IF(TODAY()-T$2>0,SUM(OFFSET(Start,$A12,18):OFFSET(Start,$A12,37)),0)","v":0},{"$f":"IF(TODAY()-U$2>0,SUM(OFFSET(Start,$A12,18):OFFSET(Start,$A12,37)),0)","v":0},{"$f":"IF(TODAY()-V$2>0,SUM(OFFSET(Start,$A12,18):OFFSET(Start,$A12,37)),0)","v":0},{"$f":"IF(TODAY()-W$2>0,SUM(OFFSET(Start,$A12,18):OFFSET(Start,$A12,37)),0)","v":0},{"$f":"IF(TODAY()-X$2>0,SUM(OFFSET(Start,$A12,18):OFFSET(Start,$A12,37)),0)","v":0},{"$f":"IF(TODAY()-Y$2>0,SUM(OFFSET(Start,$A12,18):OFFSET(Start,$A12,37)),0)","v":0},{"$f":"IF(TODAY()-Z$2>0,SUM(OFFSET(Start,$A12,18):OFFSET(Start,$A12,37)),0)","v":0},{"$f":"IF(TODAY()-AA$2>0,SUM(OFFSET(Start,$A12,18):OFFSET(Start,$A12,37)),0)","v":0},{"$f":"IF(TODAY()-AB$2>0,SUM(OFFSET(Start,$A12,18):OFFSET(Start,$A12,37)),0)","v":0},{"$f":"IF(TODAY()-AC$2>0,SUM(OFFSET(Start,$A12,18):OFFSET(Start,$A12,37)),0)","v":0},{"$f":"IF(TODAY()-AD$2>0,SUM(OFFSET(Start,$A12,18):OFFSET(Start,$A12,37)),0)","v":0},{"$f":"IF(TODAY()-AE$2>0,SUM(OFFSET(Start,$A12,18):OFFSET(Start,$A12,37)),0)","v":0},{"$f":"IF(TODAY()-AF$2>0,SUM(OFFSET(Start,$A12,18):OFFSET(Start,$A12,37)),0)","v":0},{"$f":"IF(TODAY()-AG$2>0,SUM(OFFSET(Start,$A12,18):OFFSET(Start,$A12,37)),0)","v":0},{"$f":"IF(TODAY()-AH$2>0,SUM(OFFSET(Start,$A12,18):OFFSET(Start,$A12,37)),0)","v":0},{"$f":"IF(TODAY()-AI$2>0,SUM(OFFSET(Start,$A12,18):OFFSET(Start,$A12,37)),0)","v":0},{"$f":"IF(TODAY()-AJ$2>0,SUM(OFFSET(Start,$A12,18):OFFSET(Start,$A12,37)),0)","v":0},{"$f":"IF(TODAY()-AK$2>0,SUM(OFFSET(Start,$A12,18):OFFSET(Start,$A12,37)),0)","v":0},{"$f":"IF(TODAY()-AL$2>0,SUM(OFFSET(Start,$A12,18):OFFSET(Start,$A12,37)),0)","v":0},0,0,0]
[12,{"$f":"OFFSET(Start,'Mellomlagring - antall besøk'!A13,0)","v":0},{"$f":"IF(TODAY()-C$2>0,SUM(OFFSET(Start,$A13,18):OFFSET(Start,$A13,37)),0)","v":0},{"$f":"IF(TODAY()-D$2>0,SUM(OFFSET(Start,$A13,18):OFFSET(Start,$A13,37)),0)","v":0},{"$f":"IF(TODAY()-E$2>0,SUM(OFFSET(Start,$A13,18):OFFSET(Start,$A13,37)),0)","v":0},{"$f":"IF(TODAY()-F$2>0,SUM(OFFSET(Start,$A13,18):OFFSET(Start,$A13,37)),0)","v":0},{"$f":"IF(TODAY()-G$2>0,SUM(OFFSET(Start,$A13,18):OFFSET(Start,$A13,37)),0)","v":0},{"$f":"IF(TODAY()-H$2>0,SUM(OFFSET(Start,$A13,18):OFFSET(Start,$A13,37)),0)","v":0},{"$f":"IF(TODAY()-I$2>0,SUM(OFFSET(Start,$A13,18):OFFSET(Start,$A13,37)),0)","v":0},{"$f":"IF(TODAY()-J$2>0,SUM(OFFSET(Start,$A13,18):OFFSET(Start,$A13,37)),0)","v":0},{"$f":"IF(TODAY()-K$2>0,SUM(OFFSET(Start,$A13,18):OFFSET(Start,$A13,37)),0)","v":0},{"$f":"IF(TODAY()-L$2>0,SUM(OFFSET(Start,$A13,18):OFFSET(Start,$A13,37)),0)","v":0},{"$f":"IF(TODAY()-M$2>0,SUM(OFFSET(Start,$A13,18):OFFSET(Start,$A13,37)),0)","v":0},{"$f":"IF(TODAY()-N$2>0,SUM(OFFSET(Start,$A13,18):OFFSET(Start,$A13,37)),0)","v":0},{"$f":"IF(TODAY()-O$2>0,SUM(OFFSET(Start,$A13,18):OFFSET(Start,$A13,37)),0)","v":0},{"$f":"IF(TODAY()-P$2>0,SUM(OFFSET(Start,$A13,18):OFFSET(Start,$A13,37)),0)","v":0},{"$f":"IF(TODAY()-Q$2>0,SUM(OFFSET(Start,$A13,18):OFFSET(Start,$A13,37)),0)","v":0},{"$f":"IF(TODAY()-R$2>0,SUM(OFFSET(Start,$A13,18):OFFSET(Start,$A13,37)),0)","v":0},{"$f":"IF(TODAY()-S$2>0,SUM(OFFSET(Start,$A13,18):OFFSET(Start,$A13,37)),0)","v":0},{"$f":"IF(TODAY()-T$2>0,SUM(OFFSET(Start,$A13,18):OFFSET(Start,$A13,37)),0)","v":0},{"$f":"IF(TODAY()-U$2>0,SUM(OFFSET(Start,$A13,18):OFFSET(Start,$A13,37)),0)","v":0},{"$f":"IF(TODAY()-V$2>0,SUM(OFFSET(Start,$A13,18):OFFSET(Start,$A13,37)),0)","v":0},{"$f":"IF(TODAY()-W$2>0,SUM(OFFSET(Start,$A13,18):OFFSET(Start,$A13,37)),0)","v":0},{"$f":"IF(TODAY()-X$2>0,SUM(OFFSET(Start,$A13,18):OFFSET(Start,$A13,37)),0)","v":0},{"$f":"IF(TODAY()-Y$2>0,SUM(OFFSET(Start,$A13,18):OFFSET(Start,$A13,37)),0)","v":0},{"$f":"IF(TODAY()-Z$2>0,SUM(OFFSET(Start,$A13,18):OFFSET(Start,$A13,37)),0)","v":0},{"$f":"IF(TODAY()-AA$2>0,SUM(OFFSET(Start,$A13,18):OFFSET(Start,$A13,37)),0)","v":0},{"$f":"IF(TODAY()-AB$2>0,SUM(OFFSET(Start,$A13,18):OFFSET(Start,$A13,37)),0)","v":0},{"$f":"IF(TODAY()-AC$2>0,SUM(OFFSET(Start,$A13,18):OFFSET(Start,$A13,37)),0)","v":0},{"$f":"IF(TODAY()-AD$2>0,SUM(OFFSET(Start,$A13,18):OFFSET(Start,$A13,37)),0)","v":0},{"$f":"IF(TODAY()-AE$2>0,SUM(OFFSET(Start,$A13,18):OFFSET(Start,$A13,37)),0)","v":0},{"$f":"IF(TODAY()-AF$2>0,SUM(OFFSET(Start,$A13,18):OFFSET(Start,$A13,37)),0)","v":0},{"$f":"IF(TODAY()-AG$2>0,SUM(OFFSET(Start,$A13,18):OFFSET(Start,$A13,37)),0)","v":0},{"$f":"IF(TODAY()-AH$2>0,SUM(OFFSET(Start,$A13,18):OFFSET(Start,$A13,37)),0)","v":0},{"$f":"IF(TODAY()-AI$2>0,SUM(OFFSET(Start,$A13,18):OFFSET(Start,$A13,37)),0)","v":0},{"$f":"IF(TODAY()-AJ$2>0,SUM(OFFSET(Start,$A13,18):OFFSET(Start,$A13,37)),0)","v":0},{"$f":"IF(TODAY()-AK$2>0,SUM(OFFSET(Start,$A13,18):OFFSET(Start,$A13,37)),0)","v":0},{"$f":"IF(TODAY()-AL$2>0,SUM(OFFSET(Start,$A13,18):OFFSET(Start,$A13,37)),0)","v":0},0,0,0]
[13,{"$f":"OFFSET(Start,'Mellomlagring - antall besøk'!A14,0)","v":0},{"$f":"IF(TODAY()-C$2>0,SUM(OFFSET(Start,$A14,18):OFFSET(Start,$A14,37)),0)","v":0},{"$f":"IF(TODAY()-D$2>0,SUM(OFFSET(Start,$A14,18):OFFSET(Start,$A14,37)),0)","v":0},{"$f":"IF(TODAY()-E$2>0,SUM(OFFSET(Start,$A14,18):OFFSET(Start,$A14,37)),0)","v":0},{"$f":"IF(TODAY()-F$2>0,SUM(OFFSET(Start,$A14,18):OFFSET(Start,$A14,37)),0)","v":0},{"$f":"IF(TODAY()-G$2>0,SUM(OFFSET(Start,$A14,18):OFFSET(Start,$A14,37)),0)","v":0},{"$f":"IF(TODAY()-H$2>0,SUM(OFFSET(Start,$A14,18):OFFSET(Start,$A14,37)),0)","v":0},{"$f":"IF(TODAY()-I$2>0,SUM(OFFSET(Start,$A14,18):OFFSET(Start,$A14,37)),0)","v":0},{"$f":"IF(TODAY()-J$2>0,SUM(OFFSET(Start,$A14,18):OFFSET(Start,$A14,37)),0)","v":0},{"$f":"IF(TODAY()-K$2>0,SUM(OFFSET(Start,$A14,18):OFFSET(Start,$A14,37)),0)","v":0},{"$f":"IF(TODAY()-L$2>0,SUM(OFFSET(Start,$A14,18):OFFSET(Start,$A14,37)),0)","v":0},{"$f":"IF(TODAY()-M$2>0,SUM(OFFSET(Start,$A14,18):OFFSET(Start,$A14,37)),0)","v":0},{"$f":"IF(TODAY()-N$2>0,SUM(OFFSET(Start,$A14,18):OFFSET(Start,$A14,37)),0)","v":0},{"$f":"IF(TODAY()-O$2>0,SUM(OFFSET(Start,$A14,18):OFFSET(Start,$A14,37)),0)","v":0},{"$f":"IF(TODAY()-P$2>0,SUM(OFFSET(Start,$A14,18):OFFSET(Start,$A14,37)),0)","v":0},{"$f":"IF(TODAY()-Q$2>0,SUM(OFFSET(Start,$A14,18):OFFSET(Start,$A14,37)),0)","v":0},{"$f":"IF(TODAY()-R$2>0,SUM(OFFSET(Start,$A14,18):OFFSET(Start,$A14,37)),0)","v":0},{"$f":"IF(TODAY()-S$2>0,SUM(OFFSET(Start,$A14,18):OFFSET(Start,$A14,37)),0)","v":0},{"$f":"IF(TODAY()-T$2>0,SUM(OFFSET(Start,$A14,18):OFFSET(Start,$A14,37)),0)","v":0},{"$f":"IF(TODAY()-U$2>0,SUM(OFFSET(Start,$A14,18):OFFSET(Start,$A14,37)),0)","v":0},{"$f":"IF(TODAY()-V$2>0,SUM(OFFSET(Start,$A14,18):OFFSET(Start,$A14,37)),0)","v":0},{"$f":"IF(TODAY()-W$2>0,SUM(OFFSET(Start,$A14,18):OFFSET(Start,$A14,37)),0)","v":0},{"$f":"IF(TODAY()-X$2>0,SUM(OFFSET(Start,$A14,18):OFFSET(Start,$A14,37)),0)","v":0},{"$f":"IF(TODAY()-Y$2>0,SUM(OFFSET(Start,$A14,18):OFFSET(Start,$A14,37)),0)","v":0},{"$f":"IF(TODAY()-Z$2>0,SUM(OFFSET(Start,$A14,18):OFFSET(Start,$A14,37)),0)","v":0},{"$f":"IF(TODAY()-AA$2>0,SUM(OFFSET(Start,$A14,18):OFFSET(Start,$A14,37)),0)","v":0},{"$f":"IF(TODAY()-AB$2>0,SUM(OFFSET(Start,$A14,18):OFFSET(Start,$A14,37)),0)","v":0},{"$f":"IF(TODAY()-AC$2>0,SUM(OFFSET(Start,$A14,18):OFFSET(Start,$A14,37)),0)","v":0},{"$f":"IF(TODAY()-AD$2>0,SUM(OFFSET(Start,$A14,18):OFFSET(Start,$A14,37)),0)","v":0},{"$f":"IF(TODAY()-AE$2>0,SUM(OFFSET(Start,$A14,18):OFFSET(Start,$A14,37)),0)","v":0},{"$f":"IF(TODAY()-AF$2>0,SUM(OFFSET(Start,$A14,18):OFFSET(Start,$A14,37)),0)","v":0},{"$f":"IF(TODAY()-AG$2>0,SUM(OFFSET(Start,$A14,18):OFFSET(Start,$A14,37)),0)","v":0},{"$f":"IF(TODAY()-AH$2>0,SUM(OFFSET(Start,$A14,18):OFFSET(Start,$A14,37)),0)","v":0},{"$f":"IF(TODAY()-AI$2>0,SUM(OFFSET(Start,$A14,18):OFFSET(Start,$A14,37)),0)","v":0},{"$f":"IF(TODAY()-AJ$2>0,SUM(OFFSET(Start,$A14,18):OFFSET(Start,$A14,37)),0)","v":0},{"$f":"IF(TODAY()-AK$2>0,SUM(OFFSET(Start,$A14,18):OFFSET(Start,$A14,37)),0)","v":0},{"$f":"IF(TODAY()-AL$2>0,SUM(OFFSET(Start,$A14,18):OFFSET(Start,$A14,37)),0)","v":0},0,0,0]
[14,{"$f":"OFFSET(Start,'Mellomlagring - antall besøk'!A15,0)","v":0},{"$f":"IF(TODAY()-C$2>0,SUM(OFFSET(Start,$A15,18):OFFSET(Start,$A15,37)),0)","v":0},{"$f":"IF(TODAY()-D$2>0,SUM(OFFSET(Start,$A15,18):OFFSET(Start,$A15,37)),0)","v":0},{"$f":"IF(TODAY()-E$2>0,SUM(OFFSET(Start,$A15,18):OFFSET(Start,$A15,37)),0)","v":0},{"$f":"IF(TODAY()-F$2>0,SUM(OFFSET(Start,$A15,18):OFFSET(Start,$A15,37)),0)","v":0},{"$f":"IF(TODAY()-G$2>0,SUM(OFFSET(Start,$A15,18):OFFSET(Start,$A15,37)),0)","v":0},{"$f":"IF(TODAY()-H$2>0,SUM(OFFSET(Start,$A15,18):OFFSET(Start,$A15,37)),0)","v":0},{"$f":"IF(TODAY()-I$2>0,SUM(OFFSET(Start,$A15,18):OFFSET(Start,$A15,37)),0)","v":0},{"$f":"IF(TODAY()-J$2>0,SUM(OFFSET(Start,$A15,18):OFFSET(Start,$A15,37)),0)","v":0},{"$f":"IF(TODAY()-K$2>0,SUM(OFFSET(Start,$A15,18):OFFSET(Start,$A15,37)),0)","v":0},{"$f":"IF(TODAY()-L$2>0,SUM(OFFSET(Start,$A15,18):OFFSET(Start,$A15,37)),0)","v":0},{"$f":"IF(TODAY()-M$2>0,SUM(OFFSET(Start,$A15,18):OFFSET(Start,$A15,37)),0)","v":0},{"$f":"IF(TODAY()-N$2>0,SUM(OFFSET(Start,$A15,18):OFFSET(Start,$A15,37)),0)","v":0},{"$f":"IF(TODAY()-O$2>0,SUM(OFFSET(Start,$A15,18):OFFSET(Start,$A15,37)),0)","v":0},{"$f":"IF(TODAY()-P$2>0,SUM(OFFSET(Start,$A15,18):OFFSET(Start,$A15,37)),0)","v":0},{"$f":"IF(TODAY()-Q$2>0,SUM(OFFSET(Start,$A15,18):OFFSET(Start,$A15,37)),0)","v":0},{"$f":"IF(TODAY()-R$2>0,SUM(OFFSET(Start,$A15,18):OFFSET(Start,$A15,37)),0)","v":0},{"$f":"IF(TODAY()-S$2>0,SUM(OFFSET(Start,$A15,18):OFFSET(Start,$A15,37)),0)","v":0},{"$f":"IF(TODAY()-T$2>0,SUM(OFFSET(Start,$A15,18):OFFSET(Start,$A15,37)),0)","v":0},{"$f":"IF(TODAY()-U$2>0,SUM(OFFSET(Start,$A15,18):OFFSET(Start,$A15,37)),0)","v":0},{"$f":"IF(TODAY()-V$2>0,SUM(OFFSET(Start,$A15,18):OFFSET(Start,$A15,37)),0)","v":0},{"$f":"IF(TODAY()-W$2>0,SUM(OFFSET(Start,$A15,18):OFFSET(Start,$A15,37)),0)","v":0},{"$f":"IF(TODAY()-X$2>0,SUM(OFFSET(Start,$A15,18):OFFSET(Start,$A15,37)),0)","v":0},{"$f":"IF(TODAY()-Y$2>0,SUM(OFFSET(Start,$A15,18):OFFSET(Start,$A15,37)),0)","v":0},{"$f":"IF(TODAY()-Z$2>0,SUM(OFFSET(Start,$A15,18):OFFSET(Start,$A15,37)),0)","v":0},{"$f":"IF(TODAY()-AA$2>0,SUM(OFFSET(Start,$A15,18):OFFSET(Start,$A15,37)),0)","v":0},{"$f":"IF(TODAY()-AB$2>0,SUM(OFFSET(Start,$A15,18):OFFSET(Start,$A15,37)),0)","v":0},{"$f":"IF(TODAY()-AC$2>0,SUM(OFFSET(Start,$A15,18):OFFSET(Start,$A15,37)),0)","v":0},{"$f":"IF(TODAY()-AD$2>0,SUM(OFFSET(Start,$A15,18):OFFSET(Start,$A15,37)),0)","v":0},{"$f":"IF(TODAY()-AE$2>0,SUM(OFFSET(Start,$A15,18):OFFSET(Start,$A15,37)),0)","v":0},{"$f":"IF(TODAY()-AF$2>0,SUM(OFFSET(Start,$A15,18):OFFSET(Start,$A15,37)),0)","v":0},{"$f":"IF(TODAY()-AG$2>0,SUM(OFFSET(Start,$A15,18):OFFSET(Start,$A15,37)),0)","v":0},{"$f":"IF(TODAY()-AH$2>0,SUM(OFFSET(Start,$A15,18):OFFSET(Start,$A15,37)),0)","v":0},{"$f":"IF(TODAY()-AI$2>0,SUM(OFFSET(Start,$A15,18):OFFSET(Start,$A15,37)),0)","v":0},{"$f":"IF(TODAY()-AJ$2>0,SUM(OFFSET(Start,$A15,18):OFFSET(Start,$A15,37)),0)","v":0},{"$f":"IF(TODAY()-AK$2>0,SUM(OFFSET(Start,$A15,18):OFFSET(Start,$A15,37)),0)","v":0},{"$f":"IF(TODAY()-AL$2>0,SUM(OFFSET(Start,$A15,18):OFFSET(Start,$A15,37)),0)","v":0},0,0,0]
[15,{"$f":"OFFSET(Start,'Mellomlagring - antall besøk'!A16,0)","v":0},{"$f":"IF(TODAY()-C$2>0,SUM(OFFSET(Start,$A16,18):OFFSET(Start,$A16,37)),0)","v":0},{"$f":"IF(TODAY()-D$2>0,SUM(OFFSET(Start,$A16,18):OFFSET(Start,$A16,37)),0)","v":0},{"$f":"IF(TODAY()-E$2>0,SUM(OFFSET(Start,$A16,18):OFFSET(Start,$A16,37)),0)","v":0},{"$f":"IF(TODAY()-F$2>0,SUM(OFFSET(Start,$A16,18):OFFSET(Start,$A16,37)),0)","v":0},{"$f":"IF(TODAY()-G$2>0,SUM(OFFSET(Start,$A16,18):OFFSET(Start,$A16,37)),0)","v":0},{"$f":"IF(TODAY()-H$2>0,SUM(OFFSET(Start,$A16,18):OFFSET(Start,$A16,37)),0)","v":0},{"$f":"IF(TODAY()-I$2>0,SUM(OFFSET(Start,$A16,18):OFFSET(Start,$A16,37)),0)","v":0},{"$f":"IF(TODAY()-J$2>0,SUM(OFFSET(Start,$A16,18):OFFSET(Start,$A16,37)),0)","v":0},{"$f":"IF(TODAY()-K$2>0,SUM(OFFSET(Start,$A16,18):OFFSET(Start,$A16,37)),0)","v":0},{"$f":"IF(TODAY()-L$2>0,SUM(OFFSET(Start,$A16,18):OFFSET(Start,$A16,37)),0)","v":0},{"$f":"IF(TODAY()-M$2>0,SUM(OFFSET(Start,$A16,18):OFFSET(Start,$A16,37)),0)","v":0},{"$f":"IF(TODAY()-N$2>0,SUM(OFFSET(Start,$A16,18):OFFSET(Start,$A16,37)),0)","v":0},{"$f":"IF(TODAY()-O$2>0,SUM(OFFSET(Start,$A16,18):OFFSET(Start,$A16,37)),0)","v":0},{"$f":"IF(TODAY()-P$2>0,SUM(OFFSET(Start,$A16,18):OFFSET(Start,$A16,37)),0)","v":0},{"$f":"IF(TODAY()-Q$2>0,SUM(OFFSET(Start,$A16,18):OFFSET(Start,$A16,37)),0)","v":0},{"$f":"IF(TODAY()-R$2>0,SUM(OFFSET(Start,$A16,18):OFFSET(Start,$A16,37)),0)","v":0},{"$f":"IF(TODAY()-S$2>0,SUM(OFFSET(Start,$A16,18):OFFSET(Start,$A16,37)),0)","v":0},{"$f":"IF(TODAY()-T$2>0,SUM(OFFSET(Start,$A16,18):OFFSET(Start,$A16,37)),0)","v":0},{"$f":"IF(TODAY()-U$2>0,SUM(OFFSET(Start,$A16,18):OFFSET(Start,$A16,37)),0)","v":0},{"$f":"IF(TODAY()-V$2>0,SUM(OFFSET(Start,$A16,18):OFFSET(Start,$A16,37)),0)","v":0},{"$f":"IF(TODAY()-W$2>0,SUM(OFFSET(Start,$A16,18):OFFSET(Start,$A16,37)),0)","v":0},{"$f":"IF(TODAY()-X$2>0,SUM(OFFSET(Start,$A16,18):OFFSET(Start,$A16,37)),0)","v":0},{"$f":"IF(TODAY()-Y$2>0,SUM(OFFSET(Start,$A16,18):OFFSET(Start,$A16,37)),0)","v":0},{"$f":"IF(TODAY()-Z$2>0,SUM(OFFSET(Start,$A16,18):OFFSET(Start,$A16,37)),0)","v":0},{"$f":"IF(TODAY()-AA$2>0,SUM(OFFSET(Start,$A16,18):OFFSET(Start,$A16,37)),0)","v":0},{"$f":"IF(TODAY()-AB$2>0,SUM(OFFSET(Start,$A16,18):OFFSET(Start,$A16,37)),0)","v":0},{"$f":"IF(TODAY()-AC$2>0,SUM(OFFSET(Start,$A16,18):OFFSET(Start,$A16,37)),0)","v":0},{"$f":"IF(TODAY()-AD$2>0,SUM(OFFSET(Start,$A16,18):OFFSET(Start,$A16,37)),0)","v":0},{"$f":"IF(TODAY()-AE$2>0,SUM(OFFSET(Start,$A16,18):OFFSET(Start,$A16,37)),0)","v":0},{"$f":"IF(TODAY()-AF$2>0,SUM(OFFSET(Start,$A16,18):OFFSET(Start,$A16,37)),0)","v":0},{"$f":"IF(TODAY()-AG$2>0,SUM(OFFSET(Start,$A16,18):OFFSET(Start,$A16,37)),0)","v":0},{"$f":"IF(TODAY()-AH$2>0,SUM(OFFSET(Start,$A16,18):OFFSET(Start,$A16,37)),0)","v":0},{"$f":"IF(TODAY()-AI$2>0,SUM(OFFSET(Start,$A16,18):OFFSET(Start,$A16,37)),0)","v":0},{"$f":"IF(TODAY()-AJ$2>0,SUM(OFFSET(Start,$A16,18):OFFSET(Start,$A16,37)),0)","v":0},{"$f":"IF(TODAY()-AK$2>0,SUM(OFFSET(Start,$A16,18):OFFSET(Start,$A16,37)),0)","v":0},{"$f":"IF(TODAY()-AL$2>0,SUM(OFFSET(Start,$A16,18):OFFSET(Start,$A16,37)),0)","v":0},0,0,0]
[16,{"$f":"OFFSET(Start,'Mellomlagring - antall besøk'!A17,0)","v":0},{"$f":"IF(TODAY()-C$2>0,SUM(OFFSET(Start,$A17,18):OFFSET(Start,$A17,37)),0)","v":0},{"$f":"IF(TODAY()-D$2>0,SUM(OFFSET(Start,$A17,18):OFFSET(Start,$A17,37)),0)","v":0},{"$f":"IF(TODAY()-E$2>0,SUM(OFFSET(Start,$A17,18):OFFSET(Start,$A17,37)),0)","v":0},{"$f":"IF(TODAY()-F$2>0,SUM(OFFSET(Start,$A17,18):OFFSET(Start,$A17,37)),0)","v":0},{"$f":"IF(TODAY()-G$2>0,SUM(OFFSET(Start,$A17,18):OFFSET(Start,$A17,37)),0)","v":0},{"$f":"IF(TODAY()-H$2>0,SUM(OFFSET(Start,$A17,18):OFFSET(Start,$A17,37)),0)","v":0},{"$f":"IF(TODAY()-I$2>0,SUM(OFFSET(Start,$A17,18):OFFSET(Start,$A17,37)),0)","v":0},{"$f":"IF(TODAY()-J$2>0,SUM(OFFSET(Start,$A17,18):OFFSET(Start,$A17,37)),0)","v":0},{"$f":"IF(TODAY()-K$2>0,SUM(OFFSET(Start,$A17,18):OFFSET(Start,$A17,37)),0)","v":0},{"$f":"IF(TODAY()-L$2>0,SUM(OFFSET(Start,$A17,18):OFFSET(Start,$A17,37)),0)","v":0},{"$f":"IF(TODAY()-M$2>0,SUM(OFFSET(Start,$A17,18):OFFSET(Start,$A17,37)),0)","v":0},{"$f":"IF(TODAY()-N$2>0,SUM(OFFSET(Start,$A17,18):OFFSET(Start,$A17,37)),0)","v":0},{"$f":"IF(TODAY()-O$2>0,SUM(OFFSET(Start,$A17,18):OFFSET(Start,$A17,37)),0)","v":0},{"$f":"IF(TODAY()-P$2>0,SUM(OFFSET(Start,$A17,18):OFFSET(Start,$A17,37)),0)","v":0},{"$f":"IF(TODAY()-Q$2>0,SUM(OFFSET(Start,$A17,18):OFFSET(Start,$A17,37)),0)","v":0},{"$f":"IF(TODAY()-R$2>0,SUM(OFFSET(Start,$A17,18):OFFSET(Start,$A17,37)),0)","v":0},{"$f":"IF(TODAY()-S$2>0,SUM(OFFSET(Start,$A17,18):OFFSET(Start,$A17,37)),0)","v":0},{"$f":"IF(TODAY()-T$2>0,SUM(OFFSET(Start,$A17,18):OFFSET(Start,$A17,37)),0)","v":0},{"$f":"IF(TODAY()-U$2>0,SUM(OFFSET(Start,$A17,18):OFFSET(Start,$A17,37)),0)","v":0},{"$f":"IF(TODAY()-V$2>0,SUM(OFFSET(Start,$A17,18):OFFSET(Start,$A17,37)),0)","v":0},{"$f":"IF(TODAY()-W$2>0,SUM(OFFSET(Start,$A17,18):OFFSET(Start,$A17,37)),0)","v":0},{"$f":"IF(TODAY()-X$2>0,SUM(OFFSET(Start,$A17,18):OFFSET(Start,$A17,37)),0)","v":0},{"$f":"IF(TODAY()-Y$2>0,SUM(OFFSET(Start,$A17,18):OFFSET(Start,$A17,37)),0)","v":0},{"$f":"IF(TODAY()-Z$2>0,SUM(OFFSET(Start,$A17,18):OFFSET(Start,$A17,37)),0)","v":0},{"$f":"IF(TODAY()-AA$2>0,SUM(OFFSET(Start,$A17,18):OFFSET(Start,$A17,37)),0)","v":0},{"$f":"IF(TODAY()-AB$2>0,SUM(OFFSET(Start,$A17,18):OFFSET(Start,$A17,37)),0)","v":0},{"$f":"IF(TODAY()-AC$2>0,SUM(OFFSET(Start,$A17,18):OFFSET(Start,$A17,37)),0)","v":0},{"$f":"IF(TODAY()-AD$2>0,SUM(OFFSET(Start,$A17,18):OFFSET(Start,$A17,37)),0)","v":0},{"$f":"IF(TODAY()-AE$2>0,SUM(OFFSET(Start,$A17,18):OFFSET(Start,$A17,37)),0)","v":0},{"$f":"IF(TODAY()-AF$2>0,SUM(OFFSET(Start,$A17,18):OFFSET(Start,$A17,37)),0)","v":0},{"$f":"IF(TODAY()-AG$2>0,SUM(OFFSET(Start,$A17,18):OFFSET(Start,$A17,37)),0)","v":0},{"$f":"IF(TODAY()-AH$2>0,SUM(OFFSET(Start,$A17,18):OFFSET(Start,$A17,37)),0)","v":0},{"$f":"IF(TODAY()-AI$2>0,SUM(OFFSET(Start,$A17,18):OFFSET(Start,$A17,37)),0)","v":0},{"$f":"IF(TODAY()-AJ$2>0,SUM(OFFSET(Start,$A17,18):OFFSET(Start,$A17,37)),0)","v":0},{"$f":"IF(TODAY()-AK$2>0,SUM(OFFSET(Start,$A17,18):OFFSET(Start,$A17,37)),0)","v":0},{"$f":"IF(TODAY()-AL$2>0,SUM(OFFSET(Start,$A17,18):OFFSET(Start,$A17,37)),0)","v":0},0,0,0]
[17,{"$f":"OFFSET(Start,'Mellomlagring - antall besøk'!A18,0)","v":0},{"$f":"IF(TODAY()-C$2>0,SUM(OFFSET(Start,$A18,18):OFFSET(Start,$A18,37)),0)","v":0},{"$f":"IF(TODAY()-D$2>0,SUM(OFFSET(Start,$A18,18):OFFSET(Start,$A18,37)),0)","v":0},{"$f":"IF(TODAY()-E$2>0,SUM(OFFSET(Start,$A18,18):OFFSET(Start,$A18,37)),0)","v":0},{"$f":"IF(TODAY()-F$2>0,SUM(OFFSET(Start,$A18,18):OFFSET(Start,$A18,37)),0)","v":0},{"$f":"IF(TODAY()-G$2>0,SUM(OFFSET(Start,$A18,18):OFFSET(Start,$A18,37)),0)","v":0},{"$f":"IF(TODAY()-H$2>0,SUM(OFFSET(Start,$A18,18):OFFSET(Start,$A18,37)),0)","v":0},{"$f":"IF(TODAY()-I$2>0,SUM(OFFSET(Start,$A18,18):OFFSET(Start,$A18,37)),0)","v":0},{"$f":"IF(TODAY()-J$2>0,SUM(OFFSET(Start,$A18,18):OFFSET(Start,$A18,37)),0)","v":0},{"$f":"IF(TODAY()-K$2>0,SUM(OFFSET(Start,$A18,18):OFFSET(Start,$A18,37)),0)","v":0},{"$f":"IF(TODAY()-L$2>0,SUM(OFFSET(Start,$A18,18):OFFSET(Start,$A18,37)),0)","v":0},{"$f":"IF(TODAY()-M$2>0,SUM(OFFSET(Start,$A18,18):OFFSET(Start,$A18,37)),0)","v":0},{"$f":"IF(TODAY()-N$2>0,SUM(OFFSET(Start,$A18,18):OFFSET(Start,$A18,37)),0)","v":0},{"$f":"IF(TODAY()-O$2>0,SUM(OFFSET(Start,$A18,18):OFFSET(Start,$A18,37)),0)","v":0},{"$f":"IF(TODAY()-P$2>0,SUM(OFFSET(Start,$A18,18):OFFSET(Start,$A18,37)),0)","v":0},{"$f":"IF(TODAY()-Q$2>0,SUM(OFFSET(Start,$A18,18):OFFSET(Start,$A18,37)),0)","v":0},{"$f":"IF(TODAY()-R$2>0,SUM(OFFSET(Start,$A18,18):OFFSET(Start,$A18,37)),0)","v":0},{"$f":"IF(TODAY()-S$2>0,SUM(OFFSET(Start,$A18,18):OFFSET(Start,$A18,37)),0)","v":0},{"$f":"IF(TODAY()-T$2>0,SUM(OFFSET(Start,$A18,18):OFFSET(Start,$A18,37)),0)","v":0},{"$f":"IF(TODAY()-U$2>0,SUM(OFFSET(Start,$A18,18):OFFSET(Start,$A18,37)),0)","v":0},{"$f":"IF(TODAY()-V$2>0,SUM(OFFSET(Start,$A18,18):OFFSET(Start,$A18,37)),0)","v":0},{"$f":"IF(TODAY()-W$2>0,SUM(OFFSET(Start,$A18,18):OFFSET(Start,$A18,37)),0)","v":0},{"$f":"IF(TODAY()-X$2>0,SUM(OFFSET(Start,$A18,18):OFFSET(Start,$A18,37)),0)","v":0},{"$f":"IF(TODAY()-Y$2>0,SUM(OFFSET(Start,$A18,18):OFFSET(Start,$A18,37)),0)","v":0},{"$f":"IF(TODAY()-Z$2>0,SUM(OFFSET(Start,$A18,18):OFFSET(Start,$A18,37)),0)","v":0},{"$f":"IF(TODAY()-AA$2>0,SUM(OFFSET(Start,$A18,18):OFFSET(Start,$A18,37)),0)","v":0},{"$f":"IF(TODAY()-AB$2>0,SUM(OFFSET(Start,$A18,18):OFFSET(Start,$A18,37)),0)","v":0},{"$f":"IF(TODAY()-AC$2>0,SUM(OFFSET(Start,$A18,18):OFFSET(Start,$A18,37)),0)","v":0},{"$f":"IF(TODAY()-AD$2>0,SUM(OFFSET(Start,$A18,18):OFFSET(Start,$A18,37)),0)","v":0},{"$f":"IF(TODAY()-AE$2>0,SUM(OFFSET(Start,$A18,18):OFFSET(Start,$A18,37)),0)","v":0},{"$f":"IF(TODAY()-AF$2>0,SUM(OFFSET(Start,$A18,18):OFFSET(Start,$A18,37)),0)","v":0},{"$f":"IF(TODAY()-AG$2>0,SUM(OFFSET(Start,$A18,18):OFFSET(Start,$A18,37)),0)","v":0},{"$f":"IF(TODAY()-AH$2>0,SUM(OFFSET(Start,$A18,18):OFFSET(Start,$A18,37)),0)","v":0},{"$f":"IF(TODAY()-AI$2>0,SUM(OFFSET(Start,$A18,18):OFFSET(Start,$A18,37)),0)","v":0},{"$f":"IF(TODAY()-AJ$2>0,SUM(OFFSET(Start,$A18,18):OFFSET(Start,$A18,37)),0)","v":0},{"$f":"IF(TODAY()-AK$2>0,SUM(OFFSET(Start,$A18,18):OFFSET(Start,$A18,37)),0)","v":0},{"$f":"IF(TODAY()-AL$2>0,SUM(OFFSET(Start,$A18,18):OFFSET(Start,$A18,37)),0)","v":0},0,0,0]
[18,{"$f":"OFFSET(Start,'Mellomlagring - antall besøk'!A19,0)","v":0},{"$f":"IF(TODAY()-C$2>0,SUM(OFFSET(Start,$A19,18):OFFSET(Start,$A19,37)),0)","v":0},{"$f":"IF(TODAY()-D$2>0,SUM(OFFSET(Start,$A19,18):OFFSET(Start,$A19,37)),0)","v":0},{"$f":"IF(TODAY()-E$2>0,SUM(OFFSET(Start,$A19,18):OFFSET(Start,$A19,37)),0)","v":0},{"$f":"IF(TODAY()-F$2>0,SUM(OFFSET(Start,$A19,18):OFFSET(Start,$A19,37)),0)","v":0},{"$f":"IF(TODAY()-G$2>0,SUM(OFFSET(Start,$A19,18):OFFSET(Start,$A19,37)),0)","v":0},{"$f":"IF(TODAY()-H$2>0,SUM(OFFSET(Start,$A19,18):OFFSET(Start,$A19,37)),0)","v":0},{"$f":"IF(TODAY()-I$2>0,SUM(OFFSET(Start,$A19,18):OFFSET(Start,$A19,37)),0)","v":0},{"$f":"IF(TODAY()-J$2>0,SUM(OFFSET(Start,$A19,18):OFFSET(Start,$A19,37)),0)","v":0},{"$f":"IF(TODAY()-K$2>0,SUM(OFFSET(Start,$A19,18):OFFSET(Start,$A19,37)),0)","v":0},{"$f":"IF(TODAY()-L$2>0,SUM(OFFSET(Start,$A19,18):OFFSET(Start,$A19,37)),0)","v":0},{"$f":"IF(TODAY()-M$2>0,SUM(OFFSET(Start,$A19,18):OFFSET(Start,$A19,37)),0)","v":0},{"$f":"IF(TODAY()-N$2>0,SUM(OFFSET(Start,$A19,18):OFFSET(Start,$A19,37)),0)","v":0},{"$f":"IF(TODAY()-O$2>0,SUM(OFFSET(Start,$A19,18):OFFSET(Start,$A19,37)),0)","v":0},{"$f":"IF(TODAY()-P$2>0,SUM(OFFSET(Start,$A19,18):OFFSET(Start,$A19,37)),0)","v":0},{"$f":"IF(TODAY()-Q$2>0,SUM(OFFSET(Start,$A19,18):OFFSET(Start,$A19,37)),0)","v":0},{"$f":"IF(TODAY()-R$2>0,SUM(OFFSET(Start,$A19,18):OFFSET(Start,$A19,37)),0)","v":0},{"$f":"IF(TODAY()-S$2>0,SUM(OFFSET(Start,$A19,18):OFFSET(Start,$A19,37)),0)","v":0},{"$f":"IF(TODAY()-T$2>0,SUM(OFFSET(Start,$A19,18):OFFSET(Start,$A19,37)),0)","v":0},{"$f":"IF(TODAY()-U$2>0,SUM(OFFSET(Start,$A19,18):OFFSET(Start,$A19,37)),0)","v":0},{"$f":"IF(TODAY()-V$2>0,SUM(OFFSET(Start,$A19,18):OFFSET(Start,$A19,37)),0)","v":0},{"$f":"IF(TODAY()-W$2>0,SUM(OFFSET(Start,$A19,18):OFFSET(Start,$A19,37)),0)","v":0},{"$f":"IF(TODAY()-X$2>0,SUM(OFFSET(Start,$A19,18):OFFSET(Start,$A19,37)),0)","v":0},{"$f":"IF(TODAY()-Y$2>0,SUM(OFFSET(Start,$A19,18):OFFSET(Start,$A19,37)),0)","v":0},{"$f":"IF(TODAY()-Z$2>0,SUM(OFFSET(Start,$A19,18):OFFSET(Start,$A19,37)),0)","v":0},{"$f":"IF(TODAY()-AA$2>0,SUM(OFFSET(Start,$A19,18):OFFSET(Start,$A19,37)),0)","v":0},{"$f":"IF(TODAY()-AB$2>0,SUM(OFFSET(Start,$A19,18):OFFSET(Start,$A19,37)),0)","v":0},{"$f":"IF(TODAY()-AC$2>0,SUM(OFFSET(Start,$A19,18):OFFSET(Start,$A19,37)),0)","v":0},{"$f":"IF(TODAY()-AD$2>0,SUM(OFFSET(Start,$A19,18):OFFSET(Start,$A19,37)),0)","v":0},{"$f":"IF(TODAY()-AE$2>0,SUM(OFFSET(Start,$A19,18):OFFSET(Start,$A19,37)),0)","v":0},{"$f":"IF(TODAY()-AF$2>0,SUM(OFFSET(Start,$A19,18):OFFSET(Start,$A19,37)),0)","v":0},{"$f":"IF(TODAY()-AG$2>0,SUM(OFFSET(Start,$A19,18):OFFSET(Start,$A19,37)),0)","v":0},{"$f":"IF(TODAY()-AH$2>0,SUM(OFFSET(Start,$A19,18):OFFSET(Start,$A19,37)),0)","v":0},{"$f":"IF(TODAY()-AI$2>0,SUM(OFFSET(Start,$A19,18):OFFSET(Start,$A19,37)),0)","v":0},{"$f":"IF(TODAY()-AJ$2>0,SUM(OFFSET(Start,$A19,18):OFFSET(Start,$A19,37)),0)","v":0},{"$f":"IF(TODAY()-AK$2>0,SUM(OFFSET(Start,$A19,18):OFFSET(Start,$A19,37)),0)","v":0},{"$f":"IF(TODAY()-AL$2>0,SUM(OFFSET(Start,$A19,18):OFFSET(Start,$A19,37)),0)","v":0},0,0,0]
[19,{"$f":"OFFSET(Start,'Mellomlagring - antall besøk'!A20,0)","v":0},{"$f":"IF(TODAY()-C$2>0,SUM(OFFSET(Start,$A20,18):OFFSET(Start,$A20,37)),0)","v":0},{"$f":"IF(TODAY()-D$2>0,SUM(OFFSET(Start,$A20,18):OFFSET(Start,$A20,37)),0)","v":0},{"$f":"IF(TODAY()-E$2>0,SUM(OFFSET(Start,$A20,18):OFFSET(Start,$A20,37)),0)","v":0},{"$f":"IF(TODAY()-F$2>0,SUM(OFFSET(Start,$A20,18):OFFSET(Start,$A20,37)),0)","v":0},{"$f":"IF(TODAY()-G$2>0,SUM(OFFSET(Start,$A20,18):OFFSET(Start,$A20,37)),0)","v":0},{"$f":"IF(TODAY()-H$2>0,SUM(OFFSET(Start,$A20,18):OFFSET(Start,$A20,37)),0)","v":0},{"$f":"IF(TODAY()-I$2>0,SUM(OFFSET(Start,$A20,18):OFFSET(Start,$A20,37)),0)","v":0},{"$f":"IF(TODAY()-J$2>0,SUM(OFFSET(Start,$A20,18):OFFSET(Start,$A20,37)),0)","v":0},{"$f":"IF(TODAY()-K$2>0,SUM(OFFSET(Start,$A20,18):OFFSET(Start,$A20,37)),0)","v":0},{"$f":"IF(TODAY()-L$2>0,SUM(OFFSET(Start,$A20,18):OFFSET(Start,$A20,37)),0)","v":0},{"$f":"IF(TODAY()-M$2>0,SUM(OFFSET(Start,$A20,18):OFFSET(Start,$A20,37)),0)","v":0},{"$f":"IF(TODAY()-N$2>0,SUM(OFFSET(Start,$A20,18):OFFSET(Start,$A20,37)),0)","v":0},{"$f":"IF(TODAY()-O$2>0,SUM(OFFSET(Start,$A20,18):OFFSET(Start,$A20,37)),0)","v":0},{"$f":"IF(TODAY()-P$2>0,SUM(OFFSET(Start,$A20,18):OFFSET(Start,$A20,37)),0)","v":0},{"$f":"IF(TODAY()-Q$2>0,SUM(OFFSET(Start,$A20,18):OFFSET(Start,$A20,37)),0)","v":0},{"$f":"IF(TODAY()-R$2>0,SUM(OFFSET(Start,$A20,18):OFFSET(Start,$A20,37)),0)","v":0},{"$f":"IF(TODAY()-S$2>0,SUM(OFFSET(Start,$A20,18):OFFSET(Start,$A20,37)),0)","v":0},{"$f":"IF(TODAY()-T$2>0,SUM(OFFSET(Start,$A20,18):OFFSET(Start,$A20,37)),0)","v":0},{"$f":"IF(TODAY()-U$2>0,SUM(OFFSET(Start,$A20,18):OFFSET(Start,$A20,37)),0)","v":0},{"$f":"IF(TODAY()-V$2>0,SUM(OFFSET(Start,$A20,18):OFFSET(Start,$A20,37)),0)","v":0},{"$f":"IF(TODAY()-W$2>0,SUM(OFFSET(Start,$A20,18):OFFSET(Start,$A20,37)),0)","v":0},{"$f":"IF(TODAY()-X$2>0,SUM(OFFSET(Start,$A20,18):OFFSET(Start,$A20,37)),0)","v":0},{"$f":"IF(TODAY()-Y$2>0,SUM(OFFSET(Start,$A20,18):OFFSET(Start,$A20,37)),0)","v":0},{"$f":"IF(TODAY()-Z$2>0,SUM(OFFSET(Start,$A20,18):OFFSET(Start,$A20,37)),0)","v":0},{"$f":"IF(TODAY()-AA$2>0,SUM(OFFSET(Start,$A20,18):OFFSET(Start,$A20,37)),0)","v":0},{"$f":"IF(TODAY()-AB$2>0,SUM(OFFSET(Start,$A20,18):OFFSET(Start,$A20,37)),0)","v":0},{"$f":"IF(TODAY()-AC$2>0,SUM(OFFSET(Start,$A20,18):OFFSET(Start,$A20,37)),0)","v":0},{"$f":"IF(TODAY()-AD$2>0,SUM(OFFSET(Start,$A20,18):OFFSET(Start,$A20,37)),0)","v":0},{"$f":"IF(TODAY()-AE$2>0,SUM(OFFSET(Start,$A20,18):OFFSET(Start,$A20,37)),0)","v":0},{"$f":"IF(TODAY()-AF$2>0,SUM(OFFSET(Start,$A20,18):OFFSET(Start,$A20,37)),0)","v":0},{"$f":"IF(TODAY()-AG$2>0,SUM(OFFSET(Start,$A20,18):OFFSET(Start,$A20,37)),0)","v":0},{"$f":"IF(TODAY()-AH$2>0,SUM(OFFSET(Start,$A20,18):OFFSET(Start,$A20,37)),0)","v":0},{"$f":"IF(TODAY()-AI$2>0,SUM(OFFSET(Start,$A20,18):OFFSET(Start,$A20,37)),0)","v":0},{"$f":"IF(TODAY()-AJ$2>0,SUM(OFFSET(Start,$A20,18):OFFSET(Start,$A20,37)),0)","v":0},{"$f":"IF(TODAY()-AK$2>0,SUM(OFFSET(Start,$A20,18):OFFSET(Start,$A20,37)),0)","v":0},{"$f":"IF(TODAY()-AL$2>0,SUM(OFFSET(Start,$A20,18):OFFSET(Start,$A20,37)),0)","v":0},0,0,0]
[20,{"$f":"OFFSET(Start,'Mellomlagring - antall besøk'!A21,0)","v":0},{"$f":"IF(TODAY()-C$2>0,SUM(OFFSET(Start,$A21,18):OFFSET(Start,$A21,37)),0)","v":0},{"$f":"IF(TODAY()-D$2>0,SUM(OFFSET(Start,$A21,18):OFFSET(Start,$A21,37)),0)","v":0},{"$f":"IF(TODAY()-E$2>0,SUM(OFFSET(Start,$A21,18):OFFSET(Start,$A21,37)),0)","v":0},{"$f":"IF(TODAY()-F$2>0,SUM(OFFSET(Start,$A21,18):OFFSET(Start,$A21,37)),0)","v":0},{"$f":"IF(TODAY()-G$2>0,SUM(OFFSET(Start,$A21,18):OFFSET(Start,$A21,37)),0)","v":0},{"$f":"IF(TODAY()-H$2>0,SUM(OFFSET(Start,$A21,18):OFFSET(Start,$A21,37)),0)","v":0},{"$f":"IF(TODAY()-I$2>0,SUM(OFFSET(Start,$A21,18):OFFSET(Start,$A21,37)),0)","v":0},{"$f":"IF(TODAY()-J$2>0,SUM(OFFSET(Start,$A21,18):OFFSET(Start,$A21,37)),0)","v":0},{"$f":"IF(TODAY()-K$2>0,SUM(OFFSET(Start,$A21,18):OFFSET(Start,$A21,37)),0)","v":0},{"$f":"IF(TODAY()-L$2>0,SUM(OFFSET(Start,$A21,18):OFFSET(Start,$A21,37)),0)","v":0},{"$f":"IF(TODAY()-M$2>0,SUM(OFFSET(Start,$A21,18):OFFSET(Start,$A21,37)),0)","v":0},{"$f":"IF(TODAY()-N$2>0,SUM(OFFSET(Start,$A21,18):OFFSET(Start,$A21,37)),0)","v":0},{"$f":"IF(TODAY()-O$2>0,SUM(OFFSET(Start,$A21,18):OFFSET(Start,$A21,37)),0)","v":0},{"$f":"IF(TODAY()-P$2>0,SUM(OFFSET(Start,$A21,18):OFFSET(Start,$A21,37)),0)","v":0},{"$f":"IF(TODAY()-Q$2>0,SUM(OFFSET(Start,$A21,18):OFFSET(Start,$A21,37)),0)","v":0},{"$f":"IF(TODAY()-R$2>0,SUM(OFFSET(Start,$A21,18):OFFSET(Start,$A21,37)),0)","v":0},{"$f":"IF(TODAY()-S$2>0,SUM(OFFSET(Start,$A21,18):OFFSET(Start,$A21,37)),0)","v":0},{"$f":"IF(TODAY()-T$2>0,SUM(OFFSET(Start,$A21,18):OFFSET(Start,$A21,37)),0)","v":0},{"$f":"IF(TODAY()-U$2>0,SUM(OFFSET(Start,$A21,18):OFFSET(Start,$A21,37)),0)","v":0},{"$f":"IF(TODAY()-V$2>0,SUM(OFFSET(Start,$A21,18):OFFSET(Start,$A21,37)),0)","v":0},{"$f":"IF(TODAY()-W$2>0,SUM(OFFSET(Start,$A21,18):OFFSET(Start,$A21,37)),0)","v":0},{"$f":"IF(TODAY()-X$2>0,SUM(OFFSET(Start,$A21,18):OFFSET(Start,$A21,37)),0)","v":0},{"$f":"IF(TODAY()-Y$2>0,SUM(OFFSET(Start,$A21,18):OFFSET(Start,$A21,37)),0)","v":0},{"$f":"IF(TODAY()-Z$2>0,SUM(OFFSET(Start,$A21,18):OFFSET(Start,$A21,37)),0)","v":0},{"$f":"IF(TODAY()-AA$2>0,SUM(OFFSET(Start,$A21,18):OFFSET(Start,$A21,37)),0)","v":0},{"$f":"IF(TODAY()-AB$2>0,SUM(OFFSET(Start,$A21,18):OFFSET(Start,$A21,37)),0)","v":0},{"$f":"IF(TODAY()-AC$2>0,SUM(OFFSET(Start,$A21,18):OFFSET(Start,$A21,37)),0)","v":0},{"$f":"IF(TODAY()-AD$2>0,SUM(OFFSET(Start,$A21,18):OFFSET(Start,$A21,37)),0)","v":0},{"$f":"IF(TODAY()-AE$2>0,SUM(OFFSET(Start,$A21,18):OFFSET(Start,$A21,37)),0)","v":0},{"$f":"IF(TODAY()-AF$2>0,SUM(OFFSET(Start,$A21,18):OFFSET(Start,$A21,37)),0)","v":0},{"$f":"IF(TODAY()-AG$2>0,SUM(OFFSET(Start,$A21,18):OFFSET(Start,$A21,37)),0)","v":0},{"$f":"IF(TODAY()-AH$2>0,SUM(OFFSET(Start,$A21,18):OFFSET(Start,$A21,37)),0)","v":0},{"$f":"IF(TODAY()-AI$2>0,SUM(OFFSET(Start,$A21,18):OFFSET(Start,$A21,37)),0)","v":0},{"$f":"IF(TODAY()-AJ$2>0,SUM(OFFSET(Start,$A21,18):OFFSET(Start,$A21,37)),0)","v":0},{"$f":"IF(TODAY()-AK$2>0,SUM(OFFSET(Start,$A21,18):OFFSET(Start,$A21,37)),0)","v":0},{"$f":"IF(TODAY()-AL$2>0,SUM(OFFSET(Start,$A21,18):OFFSET(Start,$A21,37)),0)","v":0},0,0,0]
[21,{"$f":"OFFSET(Start,'Mellomlagring - antall besøk'!A22,0)","v":0},{"$f":"IF(TODAY()-C$2>0,SUM(OFFSET(Start,$A22,18):OFFSET(Start,$A22,37)),0)","v":0},{"$f":"IF(TODAY()-D$2>0,SUM(OFFSET(Start,$A22,18):OFFSET(Start,$A22,37)),0)","v":0},{"$f":"IF(TODAY()-E$2>0,SUM(OFFSET(Start,$A22,18):OFFSET(Start,$A22,37)),0)","v":0},{"$f":"IF(TODAY()-F$2>0,SUM(OFFSET(Start,$A22,18):OFFSET(Start,$A22,37)),0)","v":0},{"$f":"IF(TODAY()-G$2>0,SUM(OFFSET(Start,$A22,18):OFFSET(Start,$A22,37)),0)","v":0},{"$f":"IF(TODAY()-H$2>0,SUM(OFFSET(Start,$A22,18):OFFSET(Start,$A22,37)),0)","v":0},{"$f":"IF(TODAY()-I$2>0,SUM(OFFSET(Start,$A22,18):OFFSET(Start,$A22,37)),0)","v":0},{"$f":"IF(TODAY()-J$2>0,SUM(OFFSET(Start,$A22,18):OFFSET(Start,$A22,37)),0)","v":0},{"$f":"IF(TODAY()-K$2>0,SUM(OFFSET(Start,$A22,18):OFFSET(Start,$A22,37)),0)","v":0},{"$f":"IF(TODAY()-L$2>0,SUM(OFFSET(Start,$A22,18):OFFSET(Start,$A22,37)),0)","v":0},{"$f":"IF(TODAY()-M$2>0,SUM(OFFSET(Start,$A22,18):OFFSET(Start,$A22,37)),0)","v":0},{"$f":"IF(TODAY()-N$2>0,SUM(OFFSET(Start,$A22,18):OFFSET(Start,$A22,37)),0)","v":0},{"$f":"IF(TODAY()-O$2>0,SUM(OFFSET(Start,$A22,18):OFFSET(Start,$A22,37)),0)","v":0},{"$f":"IF(TODAY()-P$2>0,SUM(OFFSET(Start,$A22,18):OFFSET(Start,$A22,37)),0)","v":0},{"$f":"IF(TODAY()-Q$2>0,SUM(OFFSET(Start,$A22,18):OFFSET(Start,$A22,37)),0)","v":0},{"$f":"IF(TODAY()-R$2>0,SUM(OFFSET(Start,$A22,18):OFFSET(Start,$A22,37)),0)","v":0},{"$f":"IF(TODAY()-S$2>0,SUM(OFFSET(Start,$A22,18):OFFSET(Start,$A22,37)),0)","v":0},{"$f":"IF(TODAY()-T$2>0,SUM(OFFSET(Start,$A22,18):OFFSET(Start,$A22,37)),0)","v":0},{"$f":"IF(TODAY()-U$2>0,SUM(OFFSET(Start,$A22,18):OFFSET(Start,$A22,37)),0)","v":0},{"$f":"IF(TODAY()-V$2>0,SUM(OFFSET(Start,$A22,18):OFFSET(Start,$A22,37)),0)","v":0},{"$f":"IF(TODAY()-W$2>0,SUM(OFFSET(Start,$A22,18):OFFSET(Start,$A22,37)),0)","v":0},{"$f":"IF(TODAY()-X$2>0,SUM(OFFSET(Start,$A22,18):OFFSET(Start,$A22,37)),0)","v":0},{"$f":"IF(TODAY()-Y$2>0,SUM(OFFSET(Start,$A22,18):OFFSET(Start,$A22,37)),0)","v":0},{"$f":"IF(TODAY()-Z$2>0,SUM(OFFSET(Start,$A22,18):OFFSET(Start,$A22,37)),0)","v":0},{"$f":"IF(TODAY()-AA$2>0,SUM(OFFSET(Start,$A22,18):OFFSET(Start,$A22,37)),0)","v":0},{"$f":"IF(TODAY()-AB$2>0,SUM(OFFSET(Start,$A22,18):OFFSET(Start,$A22,37)),0)","v":0},{"$f":"IF(TODAY()-AC$2>0,SUM(OFFSET(Start,$A22,18):OFFSET(Start,$A22,37)),0)","v":0},{"$f":"IF(TODAY()-AD$2>0,SUM(OFFSET(Start,$A22,18):OFFSET(Start,$A22,37)),0)","v":0},{"$f":"IF(TODAY()-AE$2>0,SUM(OFFSET(Start,$A22,18):OFFSET(Start,$A22,37)),0)","v":0},{"$f":"IF(TODAY()-AF$2>0,SUM(OFFSET(Start,$A22,18):OFFSET(Start,$A22,37)),0)","v":0},{"$f":"IF(TODAY()-AG$2>0,SUM(OFFSET(Start,$A22,18):OFFSET(Start,$A22,37)),0)","v":0},{"$f":"IF(TODAY()-AH$2>0,SUM(OFFSET(Start,$A22,18):OFFSET(Start,$A22,37)),0)","v":0},{"$f":"IF(TODAY()-AI$2>0,SUM(OFFSET(Start,$A22,18):OFFSET(Start,$A22,37)),0)","v":0},{"$f":"IF(TODAY()-AJ$2>0,SUM(OFFSET(Start,$A22,18):OFFSET(Start,$A22,37)),0)","v":0},{"$f":"IF(TODAY()-AK$2>0,SUM(OFFSET(Start,$A22,18):OFFSET(Start,$A22,37)),0)","v":0},{"$f":"IF(TODAY()-AL$2>0,SUM(OFFSET(Start,$A22,18):OFFSET(Start,$A22,37)),0)","v":0},0,0,0]
[22,{"$f":"OFFSET(Start,'Mellomlagring - antall besøk'!A23,0)","v":0},{"$f":"IF(TODAY()-C$2>0,SUM(OFFSET(Start,$A23,18):OFFSET(Start,$A23,37)),0)","v":0},{"$f":"IF(TODAY()-D$2>0,SUM(OFFSET(Start,$A23,18):OFFSET(Start,$A23,37)),0)","v":0},{"$f":"IF(TODAY()-E$2>0,SUM(OFFSET(Start,$A23,18):OFFSET(Start,$A23,37)),0)","v":0},{"$f":"IF(TODAY()-F$2>0,SUM(OFFSET(Start,$A23,18):OFFSET(Start,$A23,37)),0)","v":0},{"$f":"IF(TODAY()-G$2>0,SUM(OFFSET(Start,$A23,18):OFFSET(Start,$A23,37)),0)","v":0},{"$f":"IF(TODAY()-H$2>0,SUM(OFFSET(Start,$A23,18):OFFSET(Start,$A23,37)),0)","v":0},{"$f":"IF(TODAY()-I$2>0,SUM(OFFSET(Start,$A23,18):OFFSET(Start,$A23,37)),0)","v":0},{"$f":"IF(TODAY()-J$2>0,SUM(OFFSET(Start,$A23,18):OFFSET(Start,$A23,37)),0)","v":0},{"$f":"IF(TODAY()-K$2>0,SUM(OFFSET(Start,$A23,18):OFFSET(Start,$A23,37)),0)","v":0},{"$f":"IF(TODAY()-L$2>0,SUM(OFFSET(Start,$A23,18):OFFSET(Start,$A23,37)),0)","v":0},{"$f":"IF(TODAY()-M$2>0,SUM(OFFSET(Start,$A23,18):OFFSET(Start,$A23,37)),0)","v":0},{"$f":"IF(TODAY()-N$2>0,SUM(OFFSET(Start,$A23,18):OFFSET(Start,$A23,37)),0)","v":0},{"$f":"IF(TODAY()-O$2>0,SUM(OFFSET(Start,$A23,18):OFFSET(Start,$A23,37)),0)","v":0},{"$f":"IF(TODAY()-P$2>0,SUM(OFFSET(Start,$A23,18):OFFSET(Start,$A23,37)),0)","v":0},{"$f":"IF(TODAY()-Q$2>0,SUM(OFFSET(Start,$A23,18):OFFSET(Start,$A23,37)),0)","v":0},{"$f":"IF(TODAY()-R$2>0,SUM(OFFSET(Start,$A23,18):OFFSET(Start,$A23,37)),0)","v":0},{"$f":"IF(TODAY()-S$2>0,SUM(OFFSET(Start,$A23,18):OFFSET(Start,$A23,37)),0)","v":0},{"$f":"IF(TODAY()-T$2>0,SUM(OFFSET(Start,$A23,18):OFFSET(Start,$A23,37)),0)","v":0},{"$f":"IF(TODAY()-U$2>0,SUM(OFFSET(Start,$A23,18):OFFSET(Start,$A23,37)),0)","v":0},{"$f":"IF(TODAY()-V$2>0,SUM(OFFSET(Start,$A23,18):OFFSET(Start,$A23,37)),0)","v":0},{"$f":"IF(TODAY()-W$2>0,SUM(OFFSET(Start,$A23,18):OFFSET(Start,$A23,37)),0)","v":0},{"$f":"IF(TODAY()-X$2>0,SUM(OFFSET(Start,$A23,18):OFFSET(Start,$A23,37)),0)","v":0},{"$f":"IF(TODAY()-Y$2>0,SUM(OFFSET(Start,$A23,18):OFFSET(Start,$A23,37)),0)","v":0},{"$f":"IF(TODAY()-Z$2>0,SUM(OFFSET(Start,$A23,18):OFFSET(Start,$A23,37)),0)","v":0},{"$f":"IF(TODAY()-AA$2>0,SUM(OFFSET(Start,$A23,18):OFFSET(Start,$A23,37)),0)","v":0},{"$f":"IF(TODAY()-AB$2>0,SUM(OFFSET(Start,$A23,18):OFFSET(Start,$A23,37)),0)","v":0},{"$f":"IF(TODAY()-AC$2>0,SUM(OFFSET(Start,$A23,18):OFFSET(Start,$A23,37)),0)","v":0},{"$f":"IF(TODAY()-AD$2>0,SUM(OFFSET(Start,$A23,18):OFFSET(Start,$A23,37)),0)","v":0},{"$f":"IF(TODAY()-AE$2>0,SUM(OFFSET(Start,$A23,18):OFFSET(Start,$A23,37)),0)","v":0},{"$f":"IF(TODAY()-AF$2>0,SUM(OFFSET(Start,$A23,18):OFFSET(Start,$A23,37)),0)","v":0},{"$f":"IF(TODAY()-AG$2>0,SUM(OFFSET(Start,$A23,18):OFFSET(Start,$A23,37)),0)","v":0},{"$f":"IF(TODAY()-AH$2>0,SUM(OFFSET(Start,$A23,18):OFFSET(Start,$A23,37)),0)","v":0},{"$f":"IF(TODAY()-AI$2>0,SUM(OFFSET(Start,$A23,18):OFFSET(Start,$A23,37)),0)","v":0},{"$f":"IF(TODAY()-AJ$2>0,SUM(OFFSET(Start,$A23,18):OFFSET(Start,$A23,37)),0)","v":0},{"$f":"IF(TODAY()-AK$2>0,SUM(OFFSET(Start,$A23,18):OFFSET(Start,$A23,37)),0)","v":0},{"$f":"IF(TODAY()-AL$2>0,SUM(OFFSET(Start,$A23,18):OFFSET(Start,$A23,37)),0)","v":0},0,0,0]
[23,{"$f":"OFFSET(Start,'Mellomlagring - antall besøk'!A24,0)","v":0},{"$f":"IF(TODAY()-C$2>0,SUM(OFFSET(Start,$A24,18):OFFSET(Start,$A24,37)),0)","v":0},{"$f":"IF(TODAY()-D$2>0,SUM(OFFSET(Start,$A24,18):OFFSET(Start,$A24,37)),0)","v":0},{"$f":"IF(TODAY()-E$2>0,SUM(OFFSET(Start,$A24,18):OFFSET(Start,$A24,37)),0)","v":0},{"$f":"IF(TODAY()-F$2>0,SUM(OFFSET(Start,$A24,18):OFFSET(Start,$A24,37)),0)","v":0},{"$f":"IF(TODAY()-G$2>0,SUM(OFFSET(Start,$A24,18):OFFSET(Start,$A24,37)),0)","v":0},{"$f":"IF(TODAY()-H$2>0,SUM(OFFSET(Start,$A24,18):OFFSET(Start,$A24,37)),0)","v":0},{"$f":"IF(TODAY()-I$2>0,SUM(OFFSET(Start,$A24,18):OFFSET(Start,$A24,37)),0)","v":0},{"$f":"IF(TODAY()-J$2>0,SUM(OFFSET(Start,$A24,18):OFFSET(Start,$A24,37)),0)","v":0},{"$f":"IF(TODAY()-K$2>0,SUM(OFFSET(Start,$A24,18):OFFSET(Start,$A24,37)),0)","v":0},{"$f":"IF(TODAY()-L$2>0,SUM(OFFSET(Start,$A24,18):OFFSET(Start,$A24,37)),0)","v":0},{"$f":"IF(TODAY()-M$2>0,SUM(OFFSET(Start,$A24,18):OFFSET(Start,$A24,37)),0)","v":0},{"$f":"IF(TODAY()-N$2>0,SUM(OFFSET(Start,$A24,18):OFFSET(Start,$A24,37)),0)","v":0},{"$f":"IF(TODAY()-O$2>0,SUM(OFFSET(Start,$A24,18):OFFSET(Start,$A24,37)),0)","v":0},{"$f":"IF(TODAY()-P$2>0,SUM(OFFSET(Start,$A24,18):OFFSET(Start,$A24,37)),0)","v":0},{"$f":"IF(TODAY()-Q$2>0,SUM(OFFSET(Start,$A24,18):OFFSET(Start,$A24,37)),0)","v":0},{"$f":"IF(TODAY()-R$2>0,SUM(OFFSET(Start,$A24,18):OFFSET(Start,$A24,37)),0)","v":0},{"$f":"IF(TODAY()-S$2>0,SUM(OFFSET(Start,$A24,18):OFFSET(Start,$A24,37)),0)","v":0},{"$f":"IF(TODAY()-T$2>0,SUM(OFFSET(Start,$A24,18):OFFSET(Start,$A24,37)),0)","v":0},{"$f":"IF(TODAY()-U$2>0,SUM(OFFSET(Start,$A24,18):OFFSET(Start,$A24,37)),0)","v":0},{"$f":"IF(TODAY()-V$2>0,SUM(OFFSET(Start,$A24,18):OFFSET(Start,$A24,37)),0)","v":0},{"$f":"IF(TODAY()-W$2>0,SUM(OFFSET(Start,$A24,18):OFFSET(Start,$A24,37)),0)","v":0},{"$f":"IF(TODAY()-X$2>0,SUM(OFFSET(Start,$A24,18):OFFSET(Start,$A24,37)),0)","v":0},{"$f":"IF(TODAY()-Y$2>0,SUM(OFFSET(Start,$A24,18):OFFSET(Start,$A24,37)),0)","v":0},{"$f":"IF(TODAY()-Z$2>0,SUM(OFFSET(Start,$A24,18):OFFSET(Start,$A24,37)),0)","v":0},{"$f":"IF(TODAY()-AA$2>0,SUM(OFFSET(Start,$A24,18):OFFSET(Start,$A24,37)),0)","v":0},{"$f":"IF(TODAY()-AB$2>0,SUM(OFFSET(Start,$A24,18):OFFSET(Start,$A24,37)),0)","v":0},{"$f":"IF(TODAY()-AC$2>0,SUM(OFFSET(Start,$A24,18):OFFSET(Start,$A24,37)),0)","v":0},{"$f":"IF(TODAY()-AD$2>0,SUM(OFFSET(Start,$A24,18):OFFSET(Start,$A24,37)),0)","v":0},{"$f":"IF(TODAY()-AE$2>0,SUM(OFFSET(Start,$A24,18):OFFSET(Start,$A24,37)),0)","v":0},{"$f":"IF(TODAY()-AF$2>0,SUM(OFFSET(Start,$A24,18):OFFSET(Start,$A24,37)),0)","v":0},{"$f":"IF(TODAY()-AG$2>0,SUM(OFFSET(Start,$A24,18):OFFSET(Start,$A24,37)),0)","v":0},{"$f":"IF(TODAY()-AH$2>0,SUM(OFFSET(Start,$A24,18):OFFSET(Start,$A24,37)),0)","v":0},{"$f":"IF(TODAY()-AI$2>0,SUM(OFFSET(Start,$A24,18):OFFSET(Start,$A24,37)),0)","v":0},{"$f":"IF(TODAY()-AJ$2>0,SUM(OFFSET(Start,$A24,18):OFFSET(Start,$A24,37)),0)","v":0},{"$f":"IF(TODAY()-AK$2>0,SUM(OFFSET(Start,$A24,18):OFFSET(Start,$A24,37)),0)","v":0},{"$f":"IF(TODAY()-AL$2>0,SUM(OFFSET(Start,$A24,18):OFFSET(Start,$A24,37)),0)","v":0},0,0,0]
[24,{"$f":"OFFSET(Start,'Mellomlagring - antall besøk'!A25,0)","v":0},{"$f":"IF(TODAY()-C$2>0,SUM(OFFSET(Start,$A25,18):OFFSET(Start,$A25,37)),0)","v":0},{"$f":"IF(TODAY()-D$2>0,SUM(OFFSET(Start,$A25,18):OFFSET(Start,$A25,37)),0)","v":0},{"$f":"IF(TODAY()-E$2>0,SUM(OFFSET(Start,$A25,18):OFFSET(Start,$A25,37)),0)","v":0},{"$f":"IF(TODAY()-F$2>0,SUM(OFFSET(Start,$A25,18):OFFSET(Start,$A25,37)),0)","v":0},{"$f":"IF(TODAY()-G$2>0,SUM(OFFSET(Start,$A25,18):OFFSET(Start,$A25,37)),0)","v":0},{"$f":"IF(TODAY()-H$2>0,SUM(OFFSET(Start,$A25,18):OFFSET(Start,$A25,37)),0)","v":0},{"$f":"IF(TODAY()-I$2>0,SUM(OFFSET(Start,$A25,18):OFFSET(Start,$A25,37)),0)","v":0},{"$f":"IF(TODAY()-J$2>0,SUM(OFFSET(Start,$A25,18):OFFSET(Start,$A25,37)),0)","v":0},{"$f":"IF(TODAY()-K$2>0,SUM(OFFSET(Start,$A25,18):OFFSET(Start,$A25,37)),0)","v":0},{"$f":"IF(TODAY()-L$2>0,SUM(OFFSET(Start,$A25,18):OFFSET(Start,$A25,37)),0)","v":0},{"$f":"IF(TODAY()-M$2>0,SUM(OFFSET(Start,$A25,18):OFFSET(Start,$A25,37)),0)","v":0},{"$f":"IF(TODAY()-N$2>0,SUM(OFFSET(Start,$A25,18):OFFSET(Start,$A25,37)),0)","v":0},{"$f":"IF(TODAY()-O$2>0,SUM(OFFSET(Start,$A25,18):OFFSET(Start,$A25,37)),0)","v":0},{"$f":"IF(TODAY()-P$2>0,SUM(OFFSET(Start,$A25,18):OFFSET(Start,$A25,37)),0)","v":0},{"$f":"IF(TODAY()-Q$2>0,SUM(OFFSET(Start,$A25,18):OFFSET(Start,$A25,37)),0)","v":0},{"$f":"IF(TODAY()-R$2>0,SUM(OFFSET(Start,$A25,18):OFFSET(Start,$A25,37)),0)","v":0},{"$f":"IF(TODAY()-S$2>0,SUM(OFFSET(Start,$A25,18):OFFSET(Start,$A25,37)),0)","v":0},{"$f":"IF(TODAY()-T$2>0,SUM(OFFSET(Start,$A25,18):OFFSET(Start,$A25,37)),0)","v":0},{"$f":"IF(TODAY()-U$2>0,SUM(OFFSET(Start,$A25,18):OFFSET(Start,$A25,37)),0)","v":0},{"$f":"IF(TODAY()-V$2>0,SUM(OFFSET(Start,$A25,18):OFFSET(Start,$A25,37)),0)","v":0},{"$f":"IF(TODAY()-W$2>0,SUM(OFFSET(Start,$A25,18):OFFSET(Start,$A25,37)),0)","v":0},{"$f":"IF(TODAY()-X$2>0,SUM(OFFSET(Start,$A25,18):OFFSET(Start,$A25,37)),0)","v":0},{"$f":"IF(TODAY()-Y$2>0,SUM(OFFSET(Start,$A25,18):OFFSET(Start,$A25,37)),0)","v":0},{"$f":"IF(TODAY()-Z$2>0,SUM(OFFSET(Start,$A25,18):OFFSET(Start,$A25,37)),0)","v":0},{"$f":"IF(TODAY()-AA$2>0,SUM(OFFSET(Start,$A25,18):OFFSET(Start,$A25,37)),0)","v":0},{"$f":"IF(TODAY()-AB$2>0,SUM(OFFSET(Start,$A25,18):OFFSET(Start,$A25,37)),0)","v":0},{"$f":"IF(TODAY()-AC$2>0,SUM(OFFSET(Start,$A25,18):OFFSET(Start,$A25,37)),0)","v":0},{"$f":"IF(TODAY()-AD$2>0,SUM(OFFSET(Start,$A25,18):OFFSET(Start,$A25,37)),0)","v":0},{"$f":"IF(TODAY()-AE$2>0,SUM(OFFSET(Start,$A25,18):OFFSET(Start,$A25,37)),0)","v":0},{"$f":"IF(TODAY()-AF$2>0,SUM(OFFSET(Start,$A25,18):OFFSET(Start,$A25,37)),0)","v":0},{"$f":"IF(TODAY()-AG$2>0,SUM(OFFSET(Start,$A25,18):OFFSET(Start,$A25,37)),0)","v":0},{"$f":"IF(TODAY()-AH$2>0,SUM(OFFSET(Start,$A25,18):OFFSET(Start,$A25,37)),0)","v":0},{"$f":"IF(TODAY()-AI$2>0,SUM(OFFSET(Start,$A25,18):OFFSET(Start,$A25,37)),0)","v":0},{"$f":"IF(TODAY()-AJ$2>0,SUM(OFFSET(Start,$A25,18):OFFSET(Start,$A25,37)),0)","v":0},{"$f":"IF(TODAY()-AK$2>0,SUM(OFFSET(Start,$A25,18):OFFSET(Start,$A25,37)),0)","v":0},{"$f":"IF(TODAY()-AL$2>0,SUM(OFFSET(Start,$A25,18):OFFSET(Start,$A25,37)),0)","v":0},0,0,0]
[25,{"$f":"OFFSET(Start,'Mellomlagring - antall besøk'!A26,0)","v":0},{"$f":"IF(TODAY()-C$2>0,SUM(OFFSET(Start,$A26,18):OFFSET(Start,$A26,37)),0)","v":0},{"$f":"IF(TODAY()-D$2>0,SUM(OFFSET(Start,$A26,18):OFFSET(Start,$A26,37)),0)","v":0},{"$f":"IF(TODAY()-E$2>0,SUM(OFFSET(Start,$A26,18):OFFSET(Start,$A26,37)),0)","v":0},{"$f":"IF(TODAY()-F$2>0,SUM(OFFSET(Start,$A26,18):OFFSET(Start,$A26,37)),0)","v":0},{"$f":"IF(TODAY()-G$2>0,SUM(OFFSET(Start,$A26,18):OFFSET(Start,$A26,37)),0)","v":0},{"$f":"IF(TODAY()-H$2>0,SUM(OFFSET(Start,$A26,18):OFFSET(Start,$A26,37)),0)","v":0},{"$f":"IF(TODAY()-I$2>0,SUM(OFFSET(Start,$A26,18):OFFSET(Start,$A26,37)),0)","v":0},{"$f":"IF(TODAY()-J$2>0,SUM(OFFSET(Start,$A26,18):OFFSET(Start,$A26,37)),0)","v":0},{"$f":"IF(TODAY()-K$2>0,SUM(OFFSET(Start,$A26,18):OFFSET(Start,$A26,37)),0)","v":0},{"$f":"IF(TODAY()-L$2>0,SUM(OFFSET(Start,$A26,18):OFFSET(Start,$A26,37)),0)","v":0},{"$f":"IF(TODAY()-M$2>0,SUM(OFFSET(Start,$A26,18):OFFSET(Start,$A26,37)),0)","v":0},{"$f":"IF(TODAY()-N$2>0,SUM(OFFSET(Start,$A26,18):OFFSET(Start,$A26,37)),0)","v":0},{"$f":"IF(TODAY()-O$2>0,SUM(OFFSET(Start,$A26,18):OFFSET(Start,$A26,37)),0)","v":0},{"$f":"IF(TODAY()-P$2>0,SUM(OFFSET(Start,$A26,18):OFFSET(Start,$A26,37)),0)","v":0},{"$f":"IF(TODAY()-Q$2>0,SUM(OFFSET(Start,$A26,18):OFFSET(Start,$A26,37)),0)","v":0},{"$f":"IF(TODAY()-R$2>0,SUM(OFFSET(Start,$A26,18):OFFSET(Start,$A26,37)),0)","v":0},{"$f":"IF(TODAY()-S$2>0,SUM(OFFSET(Start,$A26,18):OFFSET(Start,$A26,37)),0)","v":0},{"$f":"IF(TODAY()-T$2>0,SUM(OFFSET(Start,$A26,18):OFFSET(Start,$A26,37)),0)","v":0},{"$f":"IF(TODAY()-U$2>0,SUM(OFFSET(Start,$A26,18):OFFSET(Start,$A26,37)),0)","v":0},{"$f":"IF(TODAY()-V$2>0,SUM(OFFSET(Start,$A26,18):OFFSET(Start,$A26,37)),0)","v":0},{"$f":"IF(TODAY()-W$2>0,SUM(OFFSET(Start,$A26,18):OFFSET(Start,$A26,37)),0)","v":0},{"$f":"IF(TODAY()-X$2>0,SUM(OFFSET(Start,$A26,18):OFFSET(Start,$A26,37)),0)","v":0},{"$f":"IF(TODAY()-Y$2>0,SUM(OFFSET(Start,$A26,18):OFFSET(Start,$A26,37)),0)","v":0},{"$f":"IF(TODAY()-Z$2>0,SUM(OFFSET(Start,$A26,18):OFFSET(Start,$A26,37)),0)","v":0},{"$f":"IF(TODAY()-AA$2>0,SUM(OFFSET(Start,$A26,18):OFFSET(Start,$A26,37)),0)","v":0},{"$f":"IF(TODAY()-AB$2>0,SUM(OFFSET(Start,$A26,18):OFFSET(Start,$A26,37)),0)","v":0},{"$f":"IF(TODAY()-AC$2>0,SUM(OFFSET(Start,$A26,18):OFFSET(Start,$A26,37)),0)","v":0},{"$f":"IF(TODAY()-AD$2>0,SUM(OFFSET(Start,$A26,18):OFFSET(Start,$A26,37)),0)","v":0},{"$f":"IF(TODAY()-AE$2>0,SUM(OFFSET(Start,$A26,18):OFFSET(Start,$A26,37)),0)","v":0},{"$f":"IF(TODAY()-AF$2>0,SUM(OFFSET(Start,$A26,18):OFFSET(Start,$A26,37)),0)","v":0},{"$f":"IF(TODAY()-AG$2>0,SUM(OFFSET(Start,$A26,18):OFFSET(Start,$A26,37)),0)","v":0},{"$f":"IF(TODAY()-AH$2>0,SUM(OFFSET(Start,$A26,18):OFFSET(Start,$A26,37)),0)","v":0},{"$f":"IF(TODAY()-AI$2>0,SUM(OFFSET(Start,$A26,18):OFFSET(Start,$A26,37)),0)","v":0},{"$f":"IF(TODAY()-AJ$2>0,SUM(OFFSET(Start,$A26,18):OFFSET(Start,$A26,37)),0)","v":0},{"$f":"IF(TODAY()-AK$2>0,SUM(OFFSET(Start,$A26,18):OFFSET(Start,$A26,37)),0)","v":0},{"$f":"IF(TODAY()-AL$2>0,SUM(OFFSET(Start,$A26,18):OFFSET(Start,$A26,37)),0)","v":0},0,0,0]
[26,{"$f":"OFFSET(Start,'Mellomlagring - antall besøk'!A27,0)","v":0},{"$f":"IF(TODAY()-C$2>0,SUM(OFFSET(Start,$A27,18):OFFSET(Start,$A27,37)),0)","v":0},{"$f":"IF(TODAY()-D$2>0,SUM(OFFSET(Start,$A27,18):OFFSET(Start,$A27,37)),0)","v":0},{"$f":"IF(TODAY()-E$2>0,SUM(OFFSET(Start,$A27,18):OFFSET(Start,$A27,37)),0)","v":0},{"$f":"IF(TODAY()-F$2>0,SUM(OFFSET(Start,$A27,18):OFFSET(Start,$A27,37)),0)","v":0},{"$f":"IF(TODAY()-G$2>0,SUM(OFFSET(Start,$A27,18):OFFSET(Start,$A27,37)),0)","v":0},{"$f":"IF(TODAY()-H$2>0,SUM(OFFSET(Start,$A27,18):OFFSET(Start,$A27,37)),0)","v":0},{"$f":"IF(TODAY()-I$2>0,SUM(OFFSET(Start,$A27,18):OFFSET(Start,$A27,37)),0)","v":0},{"$f":"IF(TODAY()-J$2>0,SUM(OFFSET(Start,$A27,18):OFFSET(Start,$A27,37)),0)","v":0},{"$f":"IF(TODAY()-K$2>0,SUM(OFFSET(Start,$A27,18):OFFSET(Start,$A27,37)),0)","v":0},{"$f":"IF(TODAY()-L$2>0,SUM(OFFSET(Start,$A27,18):OFFSET(Start,$A27,37)),0)","v":0},{"$f":"IF(TODAY()-M$2>0,SUM(OFFSET(Start,$A27,18):OFFSET(Start,$A27,37)),0)","v":0},{"$f":"IF(TODAY()-N$2>0,SUM(OFFSET(Start,$A27,18):OFFSET(Start,$A27,37)),0)","v":0},{"$f":"IF(TODAY()-O$2>0,SUM(OFFSET(Start,$A27,18):OFFSET(Start,$A27,37)),0)","v":0},{"$f":"IF(TODAY()-P$2>0,SUM(OFFSET(Start,$A27,18):OFFSET(Start,$A27,37)),0)","v":0},{"$f":"IF(TODAY()-Q$2>0,SUM(OFFSET(Start,$A27,18):OFFSET(Start,$A27,37)),0)","v":0},{"$f":"IF(TODAY()-R$2>0,SUM(OFFSET(Start,$A27,18):OFFSET(Start,$A27,37)),0)","v":0},{"$f":"IF(TODAY()-S$2>0,SUM(OFFSET(Start,$A27,18):OFFSET(Start,$A27,37)),0)","v":0},{"$f":"IF(TODAY()-T$2>0,SUM(OFFSET(Start,$A27,18):OFFSET(Start,$A27,37)),0)","v":0},{"$f":"IF(TODAY()-U$2>0,SUM(OFFSET(Start,$A27,18):OFFSET(Start,$A27,37)),0)","v":0},{"$f":"IF(TODAY()-V$2>0,SUM(OFFSET(Start,$A27,18):OFFSET(Start,$A27,37)),0)","v":0},{"$f":"IF(TODAY()-W$2>0,SUM(OFFSET(Start,$A27,18):OFFSET(Start,$A27,37)),0)","v":0},{"$f":"IF(TODAY()-X$2>0,SUM(OFFSET(Start,$A27,18):OFFSET(Start,$A27,37)),0)","v":0},{"$f":"IF(TODAY()-Y$2>0,SUM(OFFSET(Start,$A27,18):OFFSET(Start,$A27,37)),0)","v":0},{"$f":"IF(TODAY()-Z$2>0,SUM(OFFSET(Start,$A27,18):OFFSET(Start,$A27,37)),0)","v":0},{"$f":"IF(TODAY()-AA$2>0,SUM(OFFSET(Start,$A27,18):OFFSET(Start,$A27,37)),0)","v":0},{"$f":"IF(TODAY()-AB$2>0,SUM(OFFSET(Start,$A27,18):OFFSET(Start,$A27,37)),0)","v":0},{"$f":"IF(TODAY()-AC$2>0,SUM(OFFSET(Start,$A27,18):OFFSET(Start,$A27,37)),0)","v":0},{"$f":"IF(TODAY()-AD$2>0,SUM(OFFSET(Start,$A27,18):OFFSET(Start,$A27,37)),0)","v":0},{"$f":"IF(TODAY()-AE$2>0,SUM(OFFSET(Start,$A27,18):OFFSET(Start,$A27,37)),0)","v":0},{"$f":"IF(TODAY()-AF$2>0,SUM(OFFSET(Start,$A27,18):OFFSET(Start,$A27,37)),0)","v":0},{"$f":"IF(TODAY()-AG$2>0,SUM(OFFSET(Start,$A27,18):OFFSET(Start,$A27,37)),0)","v":0},{"$f":"IF(TODAY()-AH$2>0,SUM(OFFSET(Start,$A27,18):OFFSET(Start,$A27,37)),0)","v":0},{"$f":"IF(TODAY()-AI$2>0,SUM(OFFSET(Start,$A27,18):OFFSET(Start,$A27,37)),0)","v":0},{"$f":"IF(TODAY()-AJ$2>0,SUM(OFFSET(Start,$A27,18):OFFSET(Start,$A27,37)),0)","v":0},{"$f":"IF(TODAY()-AK$2>0,SUM(OFFSET(Start,$A27,18):OFFSET(Start,$A27,37)),0)","v":0},{"$f":"IF(TODAY()-AL$2>0,SUM(OFFSET(Start,$A27,18):OFFSET(Start,$A27,37)),0)","v":0},0,0,0]
[27,{"$f":"OFFSET(Start,'Mellomlagring - antall besøk'!A28,0)","v":0},{"$f":"IF(TODAY()-C$2>0,SUM(OFFSET(Start,$A28,18):OFFSET(Start,$A28,37)),0)","v":0},{"$f":"IF(TODAY()-D$2>0,SUM(OFFSET(Start,$A28,18):OFFSET(Start,$A28,37)),0)","v":0},{"$f":"IF(TODAY()-E$2>0,SUM(OFFSET(Start,$A28,18):OFFSET(Start,$A28,37)),0)","v":0},{"$f":"IF(TODAY()-F$2>0,SUM(OFFSET(Start,$A28,18):OFFSET(Start,$A28,37)),0)","v":0},{"$f":"IF(TODAY()-G$2>0,SUM(OFFSET(Start,$A28,18):OFFSET(Start,$A28,37)),0)","v":0},{"$f":"IF(TODAY()-H$2>0,SUM(OFFSET(Start,$A28,18):OFFSET(Start,$A28,37)),0)","v":0},{"$f":"IF(TODAY()-I$2>0,SUM(OFFSET(Start,$A28,18):OFFSET(Start,$A28,37)),0)","v":0},{"$f":"IF(TODAY()-J$2>0,SUM(OFFSET(Start,$A28,18):OFFSET(Start,$A28,37)),0)","v":0},{"$f":"IF(TODAY()-K$2>0,SUM(OFFSET(Start,$A28,18):OFFSET(Start,$A28,37)),0)","v":0},{"$f":"IF(TODAY()-L$2>0,SUM(OFFSET(Start,$A28,18):OFFSET(Start,$A28,37)),0)","v":0},{"$f":"IF(TODAY()-M$2>0,SUM(OFFSET(Start,$A28,18):OFFSET(Start,$A28,37)),0)","v":0},{"$f":"IF(TODAY()-N$2>0,SUM(OFFSET(Start,$A28,18):OFFSET(Start,$A28,37)),0)","v":0},{"$f":"IF(TODAY()-O$2>0,SUM(OFFSET(Start,$A28,18):OFFSET(Start,$A28,37)),0)","v":0},{"$f":"IF(TODAY()-P$2>0,SUM(OFFSET(Start,$A28,18):OFFSET(Start,$A28,37)),0)","v":0},{"$f":"IF(TODAY()-Q$2>0,SUM(OFFSET(Start,$A28,18):OFFSET(Start,$A28,37)),0)","v":0},{"$f":"IF(TODAY()-R$2>0,SUM(OFFSET(Start,$A28,18):OFFSET(Start,$A28,37)),0)","v":0},{"$f":"IF(TODAY()-S$2>0,SUM(OFFSET(Start,$A28,18):OFFSET(Start,$A28,37)),0)","v":0},{"$f":"IF(TODAY()-T$2>0,SUM(OFFSET(Start,$A28,18):OFFSET(Start,$A28,37)),0)","v":0},{"$f":"IF(TODAY()-U$2>0,SUM(OFFSET(Start,$A28,18):OFFSET(Start,$A28,37)),0)","v":0},{"$f":"IF(TODAY()-V$2>0,SUM(OFFSET(Start,$A28,18):OFFSET(Start,$A28,37)),0)","v":0},{"$f":"IF(TODAY()-W$2>0,SUM(OFFSET(Start,$A28,18):OFFSET(Start,$A28,37)),0)","v":0},{"$f":"IF(TODAY()-X$2>0,SUM(OFFSET(Start,$A28,18):OFFSET(Start,$A28,37)),0)","v":0},{"$f":"IF(TODAY()-Y$2>0,SUM(OFFSET(Start,$A28,18):OFFSET(Start,$A28,37)),0)","v":0},{"$f":"IF(TODAY()-Z$2>0,SUM(OFFSET(Start,$A28,18):OFFSET(Start,$A28,37)),0)","v":0},{"$f":"IF(TODAY()-AA$2>0,SUM(OFFSET(Start,$A28,18):OFFSET(Start,$A28,37)),0)","v":0},{"$f":"IF(TODAY()-AB$2>0,SUM(OFFSET(Start,$A28,18):OFFSET(Start,$A28,37)),0)","v":0},{"$f":"IF(TODAY()-AC$2>0,SUM(OFFSET(Start,$A28,18):OFFSET(Start,$A28,37)),0)","v":0},{"$f":"IF(TODAY()-AD$2>0,SUM(OFFSET(Start,$A28,18):OFFSET(Start,$A28,37)),0)","v":0},{"$f":"IF(TODAY()-AE$2>0,SUM(OFFSET(Start,$A28,18):OFFSET(Start,$A28,37)),0)","v":0},{"$f":"IF(TODAY()-AF$2>0,SUM(OFFSET(Start,$A28,18):OFFSET(Start,$A28,37)),0)","v":0},{"$f":"IF(TODAY()-AG$2>0,SUM(OFFSET(Start,$A28,18):OFFSET(Start,$A28,37)),0)","v":0},{"$f":"IF(TODAY()-AH$2>0,SUM(OFFSET(Start,$A28,18):OFFSET(Start,$A28,37)),0)","v":0},{"$f":"IF(TODAY()-AI$2>0,SUM(OFFSET(Start,$A28,18):OFFSET(Start,$A28,37)),0)","v":0},{"$f":"IF(TODAY()-AJ$2>0,SUM(OFFSET(Start,$A28,18):OFFSET(Start,$A28,37)),0)","v":0},{"$f":"IF(TODAY()-AK$2>0,SUM(OFFSET(Start,$A28,18):OFFSET(Start,$A28,37)),0)","v":0},{"$f":"IF(TODAY()-AL$2>0,SUM(OFFSET(Start,$A28,18):OFFSET(Start,$A28,37)),0)","v":0},0,0,0]
[28,{"$f":"OFFSET(Start,'Mellomlagring - antall besøk'!A29,0)","v":0},{"$f":"IF(TODAY()-C$2>0,SUM(OFFSET(Start,$A29,18):OFFSET(Start,$A29,37)),0)","v":0},{"$f":"IF(TODAY()-D$2>0,SUM(OFFSET(Start,$A29,18):OFFSET(Start,$A29,37)),0)","v":0},{"$f":"IF(TODAY()-E$2>0,SUM(OFFSET(Start,$A29,18):OFFSET(Start,$A29,37)),0)","v":0},{"$f":"IF(TODAY()-F$2>0,SUM(OFFSET(Start,$A29,18):OFFSET(Start,$A29,37)),0)","v":0},{"$f":"IF(TODAY()-G$2>0,SUM(OFFSET(Start,$A29,18):OFFSET(Start,$A29,37)),0)","v":0},{"$f":"IF(TODAY()-H$2>0,SUM(OFFSET(Start,$A29,18):OFFSET(Start,$A29,37)),0)","v":0},{"$f":"IF(TODAY()-I$2>0,SUM(OFFSET(Start,$A29,18):OFFSET(Start,$A29,37)),0)","v":0},{"$f":"IF(TODAY()-J$2>0,SUM(OFFSET(Start,$A29,18):OFFSET(Start,$A29,37)),0)","v":0},{"$f":"IF(TODAY()-K$2>0,SUM(OFFSET(Start,$A29,18):OFFSET(Start,$A29,37)),0)","v":0},{"$f":"IF(TODAY()-L$2>0,SUM(OFFSET(Start,$A29,18):OFFSET(Start,$A29,37)),0)","v":0},{"$f":"IF(TODAY()-M$2>0,SUM(OFFSET(Start,$A29,18):OFFSET(Start,$A29,37)),0)","v":0},{"$f":"IF(TODAY()-N$2>0,SUM(OFFSET(Start,$A29,18):OFFSET(Start,$A29,37)),0)","v":0},{"$f":"IF(TODAY()-O$2>0,SUM(OFFSET(Start,$A29,18):OFFSET(Start,$A29,37)),0)","v":0},{"$f":"IF(TODAY()-P$2>0,SUM(OFFSET(Start,$A29,18):OFFSET(Start,$A29,37)),0)","v":0},{"$f":"IF(TODAY()-Q$2>0,SUM(OFFSET(Start,$A29,18):OFFSET(Start,$A29,37)),0)","v":0},{"$f":"IF(TODAY()-R$2>0,SUM(OFFSET(Start,$A29,18):OFFSET(Start,$A29,37)),0)","v":0},{"$f":"IF(TODAY()-S$2>0,SUM(OFFSET(Start,$A29,18):OFFSET(Start,$A29,37)),0)","v":0},{"$f":"IF(TODAY()-T$2>0,SUM(OFFSET(Start,$A29,18):OFFSET(Start,$A29,37)),0)","v":0},{"$f":"IF(TODAY()-U$2>0,SUM(OFFSET(Start,$A29,18):OFFSET(Start,$A29,37)),0)","v":0},{"$f":"IF(TODAY()-V$2>0,SUM(OFFSET(Start,$A29,18):OFFSET(Start,$A29,37)),0)","v":0},{"$f":"IF(TODAY()-W$2>0,SUM(OFFSET(Start,$A29,18):OFFSET(Start,$A29,37)),0)","v":0},{"$f":"IF(TODAY()-X$2>0,SUM(OFFSET(Start,$A29,18):OFFSET(Start,$A29,37)),0)","v":0},{"$f":"IF(TODAY()-Y$2>0,SUM(OFFSET(Start,$A29,18):OFFSET(Start,$A29,37)),0)","v":0},{"$f":"IF(TODAY()-Z$2>0,SUM(OFFSET(Start,$A29,18):OFFSET(Start,$A29,37)),0)","v":0},{"$f":"IF(TODAY()-AA$2>0,SUM(OFFSET(Start,$A29,18):OFFSET(Start,$A29,37)),0)","v":0},{"$f":"IF(TODAY()-AB$2>0,SUM(OFFSET(Start,$A29,18):OFFSET(Start,$A29,37)),0)","v":0},{"$f":"IF(TODAY()-AC$2>0,SUM(OFFSET(Start,$A29,18):OFFSET(Start,$A29,37)),0)","v":0},{"$f":"IF(TODAY()-AD$2>0,SUM(OFFSET(Start,$A29,18):OFFSET(Start,$A29,37)),0)","v":0},{"$f":"IF(TODAY()-AE$2>0,SUM(OFFSET(Start,$A29,18):OFFSET(Start,$A29,37)),0)","v":0},{"$f":"IF(TODAY()-AF$2>0,SUM(OFFSET(Start,$A29,18):OFFSET(Start,$A29,37)),0)","v":0},{"$f":"IF(TODAY()-AG$2>0,SUM(OFFSET(Start,$A29,18):OFFSET(Start,$A29,37)),0)","v":0},{"$f":"IF(TODAY()-AH$2>0,SUM(OFFSET(Start,$A29,18):OFFSET(Start,$A29,37)),0)","v":0},{"$f":"IF(TODAY()-AI$2>0,SUM(OFFSET(Start,$A29,18):OFFSET(Start,$A29,37)),0)","v":0},{"$f":"IF(TODAY()-AJ$2>0,SUM(OFFSET(Start,$A29,18):OFFSET(Start,$A29,37)),0)","v":0},{"$f":"IF(TODAY()-AK$2>0,SUM(OFFSET(Start,$A29,18):OFFSET(Start,$A29,37)),0)","v":0},{"$f":"IF(TODAY()-AL$2>0,SUM(OFFSET(Start,$A29,18):OFFSET(Start,$A29,37)),0)","v":0},0,0,0]
[29,{"$f":"OFFSET(Start,'Mellomlagring - antall besøk'!A30,0)","v":0},{"$f":"IF(TODAY()-C$2>0,SUM(OFFSET(Start,$A30,18):OFFSET(Start,$A30,37)),0)","v":0},{"$f":"IF(TODAY()-D$2>0,SUM(OFFSET(Start,$A30,18):OFFSET(Start,$A30,37)),0)","v":0},{"$f":"IF(TODAY()-E$2>0,SUM(OFFSET(Start,$A30,18):OFFSET(Start,$A30,37)),0)","v":0},{"$f":"IF(TODAY()-F$2>0,SUM(OFFSET(Start,$A30,18):OFFSET(Start,$A30,37)),0)","v":0},{"$f":"IF(TODAY()-G$2>0,SUM(OFFSET(Start,$A30,18):OFFSET(Start,$A30,37)),0)","v":0},{"$f":"IF(TODAY()-H$2>0,SUM(OFFSET(Start,$A30,18):OFFSET(Start,$A30,37)),0)","v":0},{"$f":"IF(TODAY()-I$2>0,SUM(OFFSET(Start,$A30,18):OFFSET(Start,$A30,37)),0)","v":0},{"$f":"IF(TODAY()-J$2>0,SUM(OFFSET(Start,$A30,18):OFFSET(Start,$A30,37)),0)","v":0},{"$f":"IF(TODAY()-K$2>0,SUM(OFFSET(Start,$A30,18):OFFSET(Start,$A30,37)),0)","v":0},{"$f":"IF(TODAY()-L$2>0,SUM(OFFSET(Start,$A30,18):OFFSET(Start,$A30,37)),0)","v":0},{"$f":"IF(TODAY()-M$2>0,SUM(OFFSET(Start,$A30,18):OFFSET(Start,$A30,37)),0)","v":0},{"$f":"IF(TODAY()-N$2>0,SUM(OFFSET(Start,$A30,18):OFFSET(Start,$A30,37)),0)","v":0},{"$f":"IF(TODAY()-O$2>0,SUM(OFFSET(Start,$A30,18):OFFSET(Start,$A30,37)),0)","v":0},{"$f":"IF(TODAY()-P$2>0,SUM(OFFSET(Start,$A30,18):OFFSET(Start,$A30,37)),0)","v":0},{"$f":"IF(TODAY()-Q$2>0,SUM(OFFSET(Start,$A30,18):OFFSET(Start,$A30,37)),0)","v":0},{"$f":"IF(TODAY()-R$2>0,SUM(OFFSET(Start,$A30,18):OFFSET(Start,$A30,37)),0)","v":0},{"$f":"IF(TODAY()-S$2>0,SUM(OFFSET(Start,$A30,18):OFFSET(Start,$A30,37)),0)","v":0},{"$f":"IF(TODAY()-T$2>0,SUM(OFFSET(Start,$A30,18):OFFSET(Start,$A30,37)),0)","v":0},{"$f":"IF(TODAY()-U$2>0,SUM(OFFSET(Start,$A30,18):OFFSET(Start,$A30,37)),0)","v":0},{"$f":"IF(TODAY()-V$2>0,SUM(OFFSET(Start,$A30,18):OFFSET(Start,$A30,37)),0)","v":0},{"$f":"IF(TODAY()-W$2>0,SUM(OFFSET(Start,$A30,18):OFFSET(Start,$A30,37)),0)","v":0},{"$f":"IF(TODAY()-X$2>0,SUM(OFFSET(Start,$A30,18):OFFSET(Start,$A30,37)),0)","v":0},{"$f":"IF(TODAY()-Y$2>0,SUM(OFFSET(Start,$A30,18):OFFSET(Start,$A30,37)),0)","v":0},{"$f":"IF(TODAY()-Z$2>0,SUM(OFFSET(Start,$A30,18):OFFSET(Start,$A30,37)),0)","v":0},{"$f":"IF(TODAY()-AA$2>0,SUM(OFFSET(Start,$A30,18):OFFSET(Start,$A30,37)),0)","v":0},{"$f":"IF(TODAY()-AB$2>0,SUM(OFFSET(Start,$A30,18):OFFSET(Start,$A30,37)),0)","v":0},{"$f":"IF(TODAY()-AC$2>0,SUM(OFFSET(Start,$A30,18):OFFSET(Start,$A30,37)),0)","v":0},{"$f":"IF(TODAY()-AD$2>0,SUM(OFFSET(Start,$A30,18):OFFSET(Start,$A30,37)),0)","v":0},{"$f":"IF(TODAY()-AE$2>0,SUM(OFFSET(Start,$A30,18):OFFSET(Start,$A30,37)),0)","v":0},{"$f":"IF(TODAY()-AF$2>0,SUM(OFFSET(Start,$A30,18):OFFSET(Start,$A30,37)),0)","v":0},{"$f":"IF(TODAY()-AG$2>0,SUM(OFFSET(Start,$A30,18):OFFSET(Start,$A30,37)),0)","v":0},{"$f":"IF(TODAY()-AH$2>0,SUM(OFFSET(Start,$A30,18):OFFSET(Start,$A30,37)),0)","v":0},{"$f":"IF(TODAY()-AI$2>0,SUM(OFFSET(Start,$A30,18):OFFSET(Start,$A30,37)),0)","v":0},{"$f":"IF(TODAY()-AJ$2>0,SUM(OFFSET(Start,$A30,18):OFFSET(Start,$A30,37)),0)","v":0},{"$f":"IF(TODAY()-AK$2>0,SUM(OFFSET(Start,$A30,18):OFFSET(Start,$A30,37)),0)","v":0},{"$f":"IF(TODAY()-AL$2>0,SUM(OFFSET(Start,$A30,18):OFFSET(Start,$A30,37)),0)","v":0},0,0,0]
[30,{"$f":"OFFSET(Start,'Mellomlagring - antall besøk'!A31,0)","v":0},{"$f":"IF(TODAY()-C$2>0,SUM(OFFSET(Start,$A31,18):OFFSET(Start,$A31,37)),0)","v":0},{"$f":"IF(TODAY()-D$2>0,SUM(OFFSET(Start,$A31,18):OFFSET(Start,$A31,37)),0)","v":0},{"$f":"IF(TODAY()-E$2>0,SUM(OFFSET(Start,$A31,18):OFFSET(Start,$A31,37)),0)","v":0},{"$f":"IF(TODAY()-F$2>0,SUM(OFFSET(Start,$A31,18):OFFSET(Start,$A31,37)),0)","v":0},{"$f":"IF(TODAY()-G$2>0,SUM(OFFSET(Start,$A31,18):OFFSET(Start,$A31,37)),0)","v":0},{"$f":"IF(TODAY()-H$2>0,SUM(OFFSET(Start,$A31,18):OFFSET(Start,$A31,37)),0)","v":0},{"$f":"IF(TODAY()-I$2>0,SUM(OFFSET(Start,$A31,18):OFFSET(Start,$A31,37)),0)","v":0},{"$f":"IF(TODAY()-J$2>0,SUM(OFFSET(Start,$A31,18):OFFSET(Start,$A31,37)),0)","v":0},{"$f":"IF(TODAY()-K$2>0,SUM(OFFSET(Start,$A31,18):OFFSET(Start,$A31,37)),0)","v":0},{"$f":"IF(TODAY()-L$2>0,SUM(OFFSET(Start,$A31,18):OFFSET(Start,$A31,37)),0)","v":0},{"$f":"IF(TODAY()-M$2>0,SUM(OFFSET(Start,$A31,18):OFFSET(Start,$A31,37)),0)","v":0},{"$f":"IF(TODAY()-N$2>0,SUM(OFFSET(Start,$A31,18):OFFSET(Start,$A31,37)),0)","v":0},{"$f":"IF(TODAY()-O$2>0,SUM(OFFSET(Start,$A31,18):OFFSET(Start,$A31,37)),0)","v":0},{"$f":"IF(TODAY()-P$2>0,SUM(OFFSET(Start,$A31,18):OFFSET(Start,$A31,37)),0)","v":0},{"$f":"IF(TODAY()-Q$2>0,SUM(OFFSET(Start,$A31,18):OFFSET(Start,$A31,37)),0)","v":0},{"$f":"IF(TODAY()-R$2>0,SUM(OFFSET(Start,$A31,18):OFFSET(Start,$A31,37)),0)","v":0},{"$f":"IF(TODAY()-S$2>0,SUM(OFFSET(Start,$A31,18):OFFSET(Start,$A31,37)),0)","v":0},{"$f":"IF(TODAY()-T$2>0,SUM(OFFSET(Start,$A31,18):OFFSET(Start,$A31,37)),0)","v":0},{"$f":"IF(TODAY()-U$2>0,SUM(OFFSET(Start,$A31,18):OFFSET(Start,$A31,37)),0)","v":0},{"$f":"IF(TODAY()-V$2>0,SUM(OFFSET(Start,$A31,18):OFFSET(Start,$A31,37)),0)","v":0},{"$f":"IF(TODAY()-W$2>0,SUM(OFFSET(Start,$A31,18):OFFSET(Start,$A31,37)),0)","v":0},{"$f":"IF(TODAY()-X$2>0,SUM(OFFSET(Start,$A31,18):OFFSET(Start,$A31,37)),0)","v":0},{"$f":"IF(TODAY()-Y$2>0,SUM(OFFSET(Start,$A31,18):OFFSET(Start,$A31,37)),0)","v":0},{"$f":"IF(TODAY()-Z$2>0,SUM(OFFSET(Start,$A31,18):OFFSET(Start,$A31,37)),0)","v":0},{"$f":"IF(TODAY()-AA$2>0,SUM(OFFSET(Start,$A31,18):OFFSET(Start,$A31,37)),0)","v":0},{"$f":"IF(TODAY()-AB$2>0,SUM(OFFSET(Start,$A31,18):OFFSET(Start,$A31,37)),0)","v":0},{"$f":"IF(TODAY()-AC$2>0,SUM(OFFSET(Start,$A31,18):OFFSET(Start,$A31,37)),0)","v":0},{"$f":"IF(TODAY()-AD$2>0,SUM(OFFSET(Start,$A31,18):OFFSET(Start,$A31,37)),0)","v":0},{"$f":"IF(TODAY()-AE$2>0,SUM(OFFSET(Start,$A31,18):OFFSET(Start,$A31,37)),0)","v":0},{"$f":"IF(TODAY()-AF$2>0,SUM(OFFSET(Start,$A31,18):OFFSET(Start,$A31,37)),0)","v":0},{"$f":"IF(TODAY()-AG$2>0,SUM(OFFSET(Start,$A31,18):OFFSET(Start,$A31,37)),0)","v":0},{"$f":"IF(TODAY()-AH$2>0,SUM(OFFSET(Start,$A31,18):OFFSET(Start,$A31,37)),0)","v":0},{"$f":"IF(TODAY()-AI$2>0,SUM(OFFSET(Start,$A31,18):OFFSET(Start,$A31,37)),0)","v":0},{"$f":"IF(TODAY()-AJ$2>0,SUM(OFFSET(Start,$A31,18):OFFSET(Start,$A31,37)),0)","v":0},{"$f":"IF(TODAY()-AK$2>0,SUM(OFFSET(Start,$A31,18):OFFSET(Start,$A31,37)),0)","v":0},{"$f":"IF(TODAY()-AL$2>0,SUM(OFFSET(Start,$A31,18):OFFSET(Start,$A31,37)),0)","v":0},0,0,0]
[31,{"$f":"OFFSET(Start,'Mellomlagring - antall besøk'!A32,0)","v":0},{"$f":"IF(TODAY()-C$2>0,SUM(OFFSET(Start,$A32,18):OFFSET(Start,$A32,37)),0)","v":0},{"$f":"IF(TODAY()-D$2>0,SUM(OFFSET(Start,$A32,18):OFFSET(Start,$A32,37)),0)","v":0},{"$f":"IF(TODAY()-E$2>0,SUM(OFFSET(Start,$A32,18):OFFSET(Start,$A32,37)),0)","v":0},{"$f":"IF(TODAY()-F$2>0,SUM(OFFSET(Start,$A32,18):OFFSET(Start,$A32,37)),0)","v":0},{"$f":"IF(TODAY()-G$2>0,SUM(OFFSET(Start,$A32,18):OFFSET(Start,$A32,37)),0)","v":0},{"$f":"IF(TODAY()-H$2>0,SUM(OFFSET(Start,$A32,18):OFFSET(Start,$A32,37)),0)","v":0},{"$f":"IF(TODAY()-I$2>0,SUM(OFFSET(Start,$A32,18):OFFSET(Start,$A32,37)),0)","v":0},{"$f":"IF(TODAY()-J$2>0,SUM(OFFSET(Start,$A32,18):OFFSET(Start,$A32,37)),0)","v":0},{"$f":"IF(TODAY()-K$2>0,SUM(OFFSET(Start,$A32,18):OFFSET(Start,$A32,37)),0)","v":0},{"$f":"IF(TODAY()-L$2>0,SUM(OFFSET(Start,$A32,18):OFFSET(Start,$A32,37)),0)","v":0},{"$f":"IF(TODAY()-M$2>0,SUM(OFFSET(Start,$A32,18):OFFSET(Start,$A32,37)),0)","v":0},{"$f":"IF(TODAY()-N$2>0,SUM(OFFSET(Start,$A32,18):OFFSET(Start,$A32,37)),0)","v":0},{"$f":"IF(TODAY()-O$2>0,SUM(OFFSET(Start,$A32,18):OFFSET(Start,$A32,37)),0)","v":0},{"$f":"IF(TODAY()-P$2>0,SUM(OFFSET(Start,$A32,18):OFFSET(Start,$A32,37)),0)","v":0},{"$f":"IF(TODAY()-Q$2>0,SUM(OFFSET(Start,$A32,18):OFFSET(Start,$A32,37)),0)","v":0},{"$f":"IF(TODAY()-R$2>0,SUM(OFFSET(Start,$A32,18):OFFSET(Start,$A32,37)),0)","v":0},{"$f":"IF(TODAY()-S$2>0,SUM(OFFSET(Start,$A32,18):OFFSET(Start,$A32,37)),0)","v":0},{"$f":"IF(TODAY()-T$2>0,SUM(OFFSET(Start,$A32,18):OFFSET(Start,$A32,37)),0)","v":0},{"$f":"IF(TODAY()-U$2>0,SUM(OFFSET(Start,$A32,18):OFFSET(Start,$A32,37)),0)","v":0},{"$f":"IF(TODAY()-V$2>0,SUM(OFFSET(Start,$A32,18):OFFSET(Start,$A32,37)),0)","v":0},{"$f":"IF(TODAY()-W$2>0,SUM(OFFSET(Start,$A32,18):OFFSET(Start,$A32,37)),0)","v":0},{"$f":"IF(TODAY()-X$2>0,SUM(OFFSET(Start,$A32,18):OFFSET(Start,$A32,37)),0)","v":0},{"$f":"IF(TODAY()-Y$2>0,SUM(OFFSET(Start,$A32,18):OFFSET(Start,$A32,37)),0)","v":0},{"$f":"IF(TODAY()-Z$2>0,SUM(OFFSET(Start,$A32,18):OFFSET(Start,$A32,37)),0)","v":0},{"$f":"IF(TODAY()-AA$2>0,SUM(OFFSET(Start,$A32,18):OFFSET(Start,$A32,37)),0)","v":0},{"$f":"IF(TODAY()-AB$2>0,SUM(OFFSET(Start,$A32,18):OFFSET(Start,$A32,37)),0)","v":0},{"$f":"IF(TODAY()-AC$2>0,SUM(OFFSET(Start,$A32,18):OFFSET(Start,$A32,37)),0)","v":0},{"$f":"IF(TODAY()-AD$2>0,SUM(OFFSET(Start,$A32,18):OFFSET(Start,$A32,37)),0)","v":0},{"$f":"IF(TODAY()-AE$2>0,SUM(OFFSET(Start,$A32,18):OFFSET(Start,$A32,37)),0)","v":0},{"$f":"IF(TODAY()-AF$2>0,SUM(OFFSET(Start,$A32,18):OFFSET(Start,$A32,37)),0)","v":0},{"$f":"IF(TODAY()-AG$2>0,SUM(OFFSET(Start,$A32,18):OFFSET(Start,$A32,37)),0)","v":0},{"$f":"IF(TODAY()-AH$2>0,SUM(OFFSET(Start,$A32,18):OFFSET(Start,$A32,37)),0)","v":0},{"$f":"IF(TODAY()-AI$2>0,SUM(OFFSET(Start,$A32,18):OFFSET(Start,$A32,37)),0)","v":0},{"$f":"IF(TODAY()-AJ$2>0,SUM(OFFSET(Start,$A32,18):OFFSET(Start,$A32,37)),0)","v":0},{"$f":"IF(TODAY()-AK$2>0,SUM(OFFSET(Start,$A32,18):OFFSET(Start,$A32,37)),0)","v":0},{"$f":"IF(TODAY()-AL$2>0,SUM(OFFSET(Start,$A32,18):OFFSET(Start,$A32,37)),0)","v":0},0,0,0]
[32,{"$f":"OFFSET(Start,'Mellomlagring - antall besøk'!A33,0)","v":0},{"$f":"IF(TODAY()-C$2>0,SUM(OFFSET(Start,$A33,18):OFFSET(Start,$A33,37)),0)","v":0},{"$f":"IF(TODAY()-D$2>0,SUM(OFFSET(Start,$A33,18):OFFSET(Start,$A33,37)),0)","v":0},{"$f":"IF(TODAY()-E$2>0,SUM(OFFSET(Start,$A33,18):OFFSET(Start,$A33,37)),0)","v":0},{"$f":"IF(TODAY()-F$2>0,SUM(OFFSET(Start,$A33,18):OFFSET(Start,$A33,37)),0)","v":0},{"$f":"IF(TODAY()-G$2>0,SUM(OFFSET(Start,$A33,18):OFFSET(Start,$A33,37)),0)","v":0},{"$f":"IF(TODAY()-H$2>0,SUM(OFFSET(Start,$A33,18):OFFSET(Start,$A33,37)),0)","v":0},{"$f":"IF(TODAY()-I$2>0,SUM(OFFSET(Start,$A33,18):OFFSET(Start,$A33,37)),0)","v":0},{"$f":"IF(TODAY()-J$2>0,SUM(OFFSET(Start,$A33,18):OFFSET(Start,$A33,37)),0)","v":0},{"$f":"IF(TODAY()-K$2>0,SUM(OFFSET(Start,$A33,18):OFFSET(Start,$A33,37)),0)","v":0},{"$f":"IF(TODAY()-L$2>0,SUM(OFFSET(Start,$A33,18):OFFSET(Start,$A33,37)),0)","v":0},{"$f":"IF(TODAY()-M$2>0,SUM(OFFSET(Start,$A33,18):OFFSET(Start,$A33,37)),0)","v":0},{"$f":"IF(TODAY()-N$2>0,SUM(OFFSET(Start,$A33,18):OFFSET(Start,$A33,37)),0)","v":0},{"$f":"IF(TODAY()-O$2>0,SUM(OFFSET(Start,$A33,18):OFFSET(Start,$A33,37)),0)","v":0},{"$f":"IF(TODAY()-P$2>0,SUM(OFFSET(Start,$A33,18):OFFSET(Start,$A33,37)),0)","v":0},{"$f":"IF(TODAY()-Q$2>0,SUM(OFFSET(Start,$A33,18):OFFSET(Start,$A33,37)),0)","v":0},{"$f":"IF(TODAY()-R$2>0,SUM(OFFSET(Start,$A33,18):OFFSET(Start,$A33,37)),0)","v":0},{"$f":"IF(TODAY()-S$2>0,SUM(OFFSET(Start,$A33,18):OFFSET(Start,$A33,37)),0)","v":0},{"$f":"IF(TODAY()-T$2>0,SUM(OFFSET(Start,$A33,18):OFFSET(Start,$A33,37)),0)","v":0},{"$f":"IF(TODAY()-U$2>0,SUM(OFFSET(Start,$A33,18):OFFSET(Start,$A33,37)),0)","v":0},{"$f":"IF(TODAY()-V$2>0,SUM(OFFSET(Start,$A33,18):OFFSET(Start,$A33,37)),0)","v":0},{"$f":"IF(TODAY()-W$2>0,SUM(OFFSET(Start,$A33,18):OFFSET(Start,$A33,37)),0)","v":0},{"$f":"IF(TODAY()-X$2>0,SUM(OFFSET(Start,$A33,18):OFFSET(Start,$A33,37)),0)","v":0},{"$f":"IF(TODAY()-Y$2>0,SUM(OFFSET(Start,$A33,18):OFFSET(Start,$A33,37)),0)","v":0},{"$f":"IF(TODAY()-Z$2>0,SUM(OFFSET(Start,$A33,18):OFFSET(Start,$A33,37)),0)","v":0},{"$f":"IF(TODAY()-AA$2>0,SUM(OFFSET(Start,$A33,18):OFFSET(Start,$A33,37)),0)","v":0},{"$f":"IF(TODAY()-AB$2>0,SUM(OFFSET(Start,$A33,18):OFFSET(Start,$A33,37)),0)","v":0},{"$f":"IF(TODAY()-AC$2>0,SUM(OFFSET(Start,$A33,18):OFFSET(Start,$A33,37)),0)","v":0},{"$f":"IF(TODAY()-AD$2>0,SUM(OFFSET(Start,$A33,18):OFFSET(Start,$A33,37)),0)","v":0},{"$f":"IF(TODAY()-AE$2>0,SUM(OFFSET(Start,$A33,18):OFFSET(Start,$A33,37)),0)","v":0},{"$f":"IF(TODAY()-AF$2>0,SUM(OFFSET(Start,$A33,18):OFFSET(Start,$A33,37)),0)","v":0},{"$f":"IF(TODAY()-AG$2>0,SUM(OFFSET(Start,$A33,18):OFFSET(Start,$A33,37)),0)","v":0},{"$f":"IF(TODAY()-AH$2>0,SUM(OFFSET(Start,$A33,18):OFFSET(Start,$A33,37)),0)","v":0},{"$f":"IF(TODAY()-AI$2>0,SUM(OFFSET(Start,$A33,18):OFFSET(Start,$A33,37)),0)","v":0},{"$f":"IF(TODAY()-AJ$2>0,SUM(OFFSET(Start,$A33,18):OFFSET(Start,$A33,37)),0)","v":0},{"$f":"IF(TODAY()-AK$2>0,SUM(OFFSET(Start,$A33,18):OFFSET(Start,$A33,37)),0)","v":0},{"$f":"IF(TODAY()-AL$2>0,SUM(OFFSET(Start,$A33,18):OFFSET(Start,$A33,37)),0)","v":0},0,0,0]
[33,{"$f":"OFFSET(Start,'Mellomlagring - antall besøk'!A34,0)","v":0},{"$f":"IF(TODAY()-C$2>0,SUM(OFFSET(Start,$A34,18):OFFSET(Start,$A34,37)),0)","v":0},{"$f":"IF(TODAY()-D$2>0,SUM(OFFSET(Start,$A34,18):OFFSET(Start,$A34,37)),0)","v":0},{"$f":"IF(TODAY()-E$2>0,SUM(OFFSET(Start,$A34,18):OFFSET(Start,$A34,37)),0)","v":0},{"$f":"IF(TODAY()-F$2>0,SUM(OFFSET(Start,$A34,18):OFFSET(Start,$A34,37)),0)","v":0},{"$f":"IF(TODAY()-G$2>0,SUM(OFFSET(Start,$A34,18):OFFSET(Start,$A34,37)),0)","v":0},{"$f":"IF(TODAY()-H$2>0,SUM(OFFSET(Start,$A34,18):OFFSET(Start,$A34,37)),0)","v":0},{"$f":"IF(TODAY()-I$2>0,SUM(OFFSET(Start,$A34,18):OFFSET(Start,$A34,37)),0)","v":0},{"$f":"IF(TODAY()-J$2>0,SUM(OFFSET(Start,$A34,18):OFFSET(Start,$A34,37)),0)","v":0},{"$f":"IF(TODAY()-K$2>0,SUM(OFFSET(Start,$A34,18):OFFSET(Start,$A34,37)),0)","v":0},{"$f":"IF(TODAY()-L$2>0,SUM(OFFSET(Start,$A34,18):OFFSET(Start,$A34,37)),0)","v":0},{"$f":"IF(TODAY()-M$2>0,SUM(OFFSET(Start,$A34,18):OFFSET(Start,$A34,37)),0)","v":0},{"$f":"IF(TODAY()-N$2>0,SUM(OFFSET(Start,$A34,18):OFFSET(Start,$A34,37)),0)","v":0},{"$f":"IF(TODAY()-O$2>0,SUM(OFFSET(Start,$A34,18):OFFSET(Start,$A34,37)),0)","v":0},{"$f":"IF(TODAY()-P$2>0,SUM(OFFSET(Start,$A34,18):OFFSET(Start,$A34,37)),0)","v":0},{"$f":"IF(TODAY()-Q$2>0,SUM(OFFSET(Start,$A34,18):OFFSET(Start,$A34,37)),0)","v":0},{"$f":"IF(TODAY()-R$2>0,SUM(OFFSET(Start,$A34,18):OFFSET(Start,$A34,37)),0)","v":0},{"$f":"IF(TODAY()-S$2>0,SUM(OFFSET(Start,$A34,18):OFFSET(Start,$A34,37)),0)","v":0},{"$f":"IF(TODAY()-T$2>0,SUM(OFFSET(Start,$A34,18):OFFSET(Start,$A34,37)),0)","v":0},{"$f":"IF(TODAY()-U$2>0,SUM(OFFSET(Start,$A34,18):OFFSET(Start,$A34,37)),0)","v":0},{"$f":"IF(TODAY()-V$2>0,SUM(OFFSET(Start,$A34,18):OFFSET(Start,$A34,37)),0)","v":0},{"$f":"IF(TODAY()-W$2>0,SUM(OFFSET(Start,$A34,18):OFFSET(Start,$A34,37)),0)","v":0},{"$f":"IF(TODAY()-X$2>0,SUM(OFFSET(Start,$A34,18):OFFSET(Start,$A34,37)),0)","v":0},{"$f":"IF(TODAY()-Y$2>0,SUM(OFFSET(Start,$A34,18):OFFSET(Start,$A34,37)),0)","v":0},{"$f":"IF(TODAY()-Z$2>0,SUM(OFFSET(Start,$A34,18):OFFSET(Start,$A34,37)),0)","v":0},{"$f":"IF(TODAY()-AA$2>0,SUM(OFFSET(Start,$A34,18):OFFSET(Start,$A34,37)),0)","v":0},{"$f":"IF(TODAY()-AB$2>0,SUM(OFFSET(Start,$A34,18):OFFSET(Start,$A34,37)),0)","v":0},{"$f":"IF(TODAY()-AC$2>0,SUM(OFFSET(Start,$A34,18):OFFSET(Start,$A34,37)),0)","v":0},{"$f":"IF(TODAY()-AD$2>0,SUM(OFFSET(Start,$A34,18):OFFSET(Start,$A34,37)),0)","v":0},{"$f":"IF(TODAY()-AE$2>0,SUM(OFFSET(Start,$A34,18):OFFSET(Start,$A34,37)),0)","v":0},{"$f":"IF(TODAY()-AF$2>0,SUM(OFFSET(Start,$A34,18):OFFSET(Start,$A34,37)),0)","v":0},{"$f":"IF(TODAY()-AG$2>0,SUM(OFFSET(Start,$A34,18):OFFSET(Start,$A34,37)),0)","v":0},{"$f":"IF(TODAY()-AH$2>0,SUM(OFFSET(Start,$A34,18):OFFSET(Start,$A34,37)),0)","v":0},{"$f":"IF(TODAY()-AI$2>0,SUM(OFFSET(Start,$A34,18):OFFSET(Start,$A34,37)),0)","v":0},{"$f":"IF(TODAY()-AJ$2>0,SUM(OFFSET(Start,$A34,18):OFFSET(Start,$A34,37)),0)","v":0},{"$f":"IF(TODAY()-AK$2>0,SUM(OFFSET(Start,$A34,18):OFFSET(Start,$A34,37)),0)","v":0},{"$f":"IF(TODAY()-AL$2>0,SUM(OFFSET(Start,$A34,18):OFFSET(Start,$A34,37)),0)","v":0},0,0,0]
[34,{"$f":"OFFSET(Start,'Mellomlagring - antall besøk'!A35,0)","v":0},{"$f":"IF(TODAY()-C$2>0,SUM(OFFSET(Start,$A35,18):OFFSET(Start,$A35,37)),0)","v":0},{"$f":"IF(TODAY()-D$2>0,SUM(OFFSET(Start,$A35,18):OFFSET(Start,$A35,37)),0)","v":0},{"$f":"IF(TODAY()-E$2>0,SUM(OFFSET(Start,$A35,18):OFFSET(Start,$A35,37)),0)","v":0},{"$f":"IF(TODAY()-F$2>0,SUM(OFFSET(Start,$A35,18):OFFSET(Start,$A35,37)),0)","v":0},{"$f":"IF(TODAY()-G$2>0,SUM(OFFSET(Start,$A35,18):OFFSET(Start,$A35,37)),0)","v":0},{"$f":"IF(TODAY()-H$2>0,SUM(OFFSET(Start,$A35,18):OFFSET(Start,$A35,37)),0)","v":0},{"$f":"IF(TODAY()-I$2>0,SUM(OFFSET(Start,$A35,18):OFFSET(Start,$A35,37)),0)","v":0},{"$f":"IF(TODAY()-J$2>0,SUM(OFFSET(Start,$A35,18):OFFSET(Start,$A35,37)),0)","v":0},{"$f":"IF(TODAY()-K$2>0,SUM(OFFSET(Start,$A35,18):OFFSET(Start,$A35,37)),0)","v":0},{"$f":"IF(TODAY()-L$2>0,SUM(OFFSET(Start,$A35,18):OFFSET(Start,$A35,37)),0)","v":0},{"$f":"IF(TODAY()-M$2>0,SUM(OFFSET(Start,$A35,18):OFFSET(Start,$A35,37)),0)","v":0},{"$f":"IF(TODAY()-N$2>0,SUM(OFFSET(Start,$A35,18):OFFSET(Start,$A35,37)),0)","v":0},{"$f":"IF(TODAY()-O$2>0,SUM(OFFSET(Start,$A35,18):OFFSET(Start,$A35,37)),0)","v":0},{"$f":"IF(TODAY()-P$2>0,SUM(OFFSET(Start,$A35,18):OFFSET(Start,$A35,37)),0)","v":0},{"$f":"IF(TODAY()-Q$2>0,SUM(OFFSET(Start,$A35,18):OFFSET(Start,$A35,37)),0)","v":0},{"$f":"IF(TODAY()-R$2>0,SUM(OFFSET(Start,$A35,18):OFFSET(Start,$A35,37)),0)","v":0},{"$f":"IF(TODAY()-S$2>0,SUM(OFFSET(Start,$A35,18):OFFSET(Start,$A35,37)),0)","v":0},{"$f":"IF(TODAY()-T$2>0,SUM(OFFSET(Start,$A35,18):OFFSET(Start,$A35,37)),0)","v":0},{"$f":"IF(TODAY()-U$2>0,SUM(OFFSET(Start,$A35,18):OFFSET(Start,$A35,37)),0)","v":0},{"$f":"IF(TODAY()-V$2>0,SUM(OFFSET(Start,$A35,18):OFFSET(Start,$A35,37)),0)","v":0},{"$f":"IF(TODAY()-W$2>0,SUM(OFFSET(Start,$A35,18):OFFSET(Start,$A35,37)),0)","v":0},{"$f":"IF(TODAY()-X$2>0,SUM(OFFSET(Start,$A35,18):OFFSET(Start,$A35,37)),0)","v":0},{"$f":"IF(TODAY()-Y$2>0,SUM(OFFSET(Start,$A35,18):OFFSET(Start,$A35,37)),0)","v":0},{"$f":"IF(TODAY()-Z$2>0,SUM(OFFSET(Start,$A35,18):OFFSET(Start,$A35,37)),0)","v":0},{"$f":"IF(TODAY()-AA$2>0,SUM(OFFSET(Start,$A35,18):OFFSET(Start,$A35,37)),0)","v":0},{"$f":"IF(TODAY()-AB$2>0,SUM(OFFSET(Start,$A35,18):OFFSET(Start,$A35,37)),0)","v":0},{"$f":"IF(TODAY()-AC$2>0,SUM(OFFSET(Start,$A35,18):OFFSET(Start,$A35,37)),0)","v":0},{"$f":"IF(TODAY()-AD$2>0,SUM(OFFSET(Start,$A35,18):OFFSET(Start,$A35,37)),0)","v":0},{"$f":"IF(TODAY()-AE$2>0,SUM(OFFSET(Start,$A35,18):OFFSET(Start,$A35,37)),0)","v":0},{"$f":"IF(TODAY()-AF$2>0,SUM(OFFSET(Start,$A35,18):OFFSET(Start,$A35,37)),0)","v":0},{"$f":"IF(TODAY()-AG$2>0,SUM(OFFSET(Start,$A35,18):OFFSET(Start,$A35,37)),0)","v":0},{"$f":"IF(TODAY()-AH$2>0,SUM(OFFSET(Start,$A35,18):OFFSET(Start,$A35,37)),0)","v":0},{"$f":"IF(TODAY()-AI$2>0,SUM(OFFSET(Start,$A35,18):OFFSET(Start,$A35,37)),0)","v":0},{"$f":"IF(TODAY()-AJ$2>0,SUM(OFFSET(Start,$A35,18):OFFSET(Start,$A35,37)),0)","v":0},{"$f":"IF(TODAY()-AK$2>0,SUM(OFFSET(Start,$A35,18):OFFSET(Start,$A35,37)),0)","v":0},{"$f":"IF(TODAY()-AL$2>0,SUM(OFFSET(Start,$A35,18):OFFSET(Start,$A35,37)),0)","v":0},0,{"$f":"OFFSET(Start,$A35,3)+OFFSET(Start,$A35,4)+OFFSET(Start,$A35,17)","v":0},0]
[35,{"$f":"OFFSET(Start,'Mellomlagring - antall besøk'!A36,0)","v":0},{"$f":"IF(TODAY()-C$2>0,SUM(OFFSET(Start,$A36,18):OFFSET(Start,$A36,37)),0)","v":0},{"$f":"IF(TODAY()-D$2>0,SUM(OFFSET(Start,$A36,18):OFFSET(Start,$A36,37)),0)","v":0},{"$f":"IF(TODAY()-E$2>0,SUM(OFFSET(Start,$A36,18):OFFSET(Start,$A36,37)),0)","v":0},{"$f":"IF(TODAY()-F$2>0,SUM(OFFSET(Start,$A36,18):OFFSET(Start,$A36,37)),0)","v":0},{"$f":"IF(TODAY()-G$2>0,SUM(OFFSET(Start,$A36,18):OFFSET(Start,$A36,37)),0)","v":0},{"$f":"IF(TODAY()-H$2>0,SUM(OFFSET(Start,$A36,18):OFFSET(Start,$A36,37)),0)","v":0},{"$f":"IF(TODAY()-I$2>0,SUM(OFFSET(Start,$A36,18):OFFSET(Start,$A36,37)),0)","v":0},{"$f":"IF(TODAY()-J$2>0,SUM(OFFSET(Start,$A36,18):OFFSET(Start,$A36,37)),0)","v":0},{"$f":"IF(TODAY()-K$2>0,SUM(OFFSET(Start,$A36,18):OFFSET(Start,$A36,37)),0)","v":0},{"$f":"IF(TODAY()-L$2>0,SUM(OFFSET(Start,$A36,18):OFFSET(Start,$A36,37)),0)","v":0},{"$f":"IF(TODAY()-M$2>0,SUM(OFFSET(Start,$A36,18):OFFSET(Start,$A36,37)),0)","v":0},{"$f":"IF(TODAY()-N$2>0,SUM(OFFSET(Start,$A36,18):OFFSET(Start,$A36,37)),0)","v":0},{"$f":"IF(TODAY()-O$2>0,SUM(OFFSET(Start,$A36,18):OFFSET(Start,$A36,37)),0)","v":0},{"$f":"IF(TODAY()-P$2>0,SUM(OFFSET(Start,$A36,18):OFFSET(Start,$A36,37)),0)","v":0},{"$f":"IF(TODAY()-Q$2>0,SUM(OFFSET(Start,$A36,18):OFFSET(Start,$A36,37)),0)","v":0},{"$f":"IF(TODAY()-R$2>0,SUM(OFFSET(Start,$A36,18):OFFSET(Start,$A36,37)),0)","v":0},{"$f":"IF(TODAY()-S$2>0,SUM(OFFSET(Start,$A36,18):OFFSET(Start,$A36,37)),0)","v":0},{"$f":"IF(TODAY()-T$2>0,SUM(OFFSET(Start,$A36,18):OFFSET(Start,$A36,37)),0)","v":0},{"$f":"IF(TODAY()-U$2>0,SUM(OFFSET(Start,$A36,18):OFFSET(Start,$A36,37)),0)","v":0},{"$f":"IF(TODAY()-V$2>0,SUM(OFFSET(Start,$A36,18):OFFSET(Start,$A36,37)),0)","v":0},{"$f":"IF(TODAY()-W$2>0,SUM(OFFSET(Start,$A36,18):OFFSET(Start,$A36,37)),0)","v":0},{"$f":"IF(TODAY()-X$2>0,SUM(OFFSET(Start,$A36,18):OFFSET(Start,$A36,37)),0)","v":0},{"$f":"IF(TODAY()-Y$2>0,SUM(OFFSET(Start,$A36,18):OFFSET(Start,$A36,37)),0)","v":0},{"$f":"IF(TODAY()-Z$2>0,SUM(OFFSET(Start,$A36,18):OFFSET(Start,$A36,37)),0)","v":0},{"$f":"IF(TODAY()-AA$2>0,SUM(OFFSET(Start,$A36,18):OFFSET(Start,$A36,37)),0)","v":0},{"$f":"IF(TODAY()-AB$2>0,SUM(OFFSET(Start,$A36,18):OFFSET(Start,$A36,37)),0)","v":0},{"$f":"IF(TODAY()-AC$2>0,SUM(OFFSET(Start,$A36,18):OFFSET(Start,$A36,37)),0)","v":0},{"$f":"IF(TODAY()-AD$2>0,SUM(OFFSET(Start,$A36,18):OFFSET(Start,$A36,37)),0)","v":0},{"$f":"IF(TODAY()-AE$2>0,SUM(OFFSET(Start,$A36,18):OFFSET(Start,$A36,37)),0)","v":0},{"$f":"IF(TODAY()-AF$2>0,SUM(OFFSET(Start,$A36,18):OFFSET(Start,$A36,37)),0)","v":0},{"$f":"IF(TODAY()-AG$2>0,SUM(OFFSET(Start,$A36,18):OFFSET(Start,$A36,37)),0)","v":0},{"$f":"IF(TODAY()-AH$2>0,SUM(OFFSET(Start,$A36,18):OFFSET(Start,$A36,37)),0)","v":0},{"$f":"IF(TODAY()-AI$2>0,SUM(OFFSET(Start,$A36,18):OFFSET(Start,$A36,37)),0)","v":0},{"$f":"IF(TODAY()-AJ$2>0,SUM(OFFSET(Start,$A36,18):OFFSET(Start,$A36,37)),0)","v":0},{"$f":"IF(TODAY()-AK$2>0,SUM(OFFSET(Start,$A36,18):OFFSET(Start,$A36,37)),0)","v":0},{"$f":"IF(TODAY()-AL$2>0,SUM(OFFSET(Start,$A36,18):OFFSET(Start,$A36,37)),0)","v":0},0,0,0]
[36,{"$f":"OFFSET(Start,'Mellomlagring - antall besøk'!A37,0)","v":0},{"$f":"IF(TODAY()-C$2>0,SUM(OFFSET(Start,$A37,18):OFFSET(Start,$A37,37)),0)","v":0},{"$f":"IF(TODAY()-D$2>0,SUM(OFFSET(Start,$A37,18):OFFSET(Start,$A37,37)),0)","v":0},{"$f":"IF(TODAY()-E$2>0,SUM(OFFSET(Start,$A37,18):OFFSET(Start,$A37,37)),0)","v":0},{"$f":"IF(TODAY()-F$2>0,SUM(OFFSET(Start,$A37,18):OFFSET(Start,$A37,37)),0)","v":0},{"$f":"IF(TODAY()-G$2>0,SUM(OFFSET(Start,$A37,18):OFFSET(Start,$A37,37)),0)","v":0},{"$f":"IF(TODAY()-H$2>0,SUM(OFFSET(Start,$A37,18):OFFSET(Start,$A37,37)),0)","v":0},{"$f":"IF(TODAY()-I$2>0,SUM(OFFSET(Start,$A37,18):OFFSET(Start,$A37,37)),0)","v":0},{"$f":"IF(TODAY()-J$2>0,SUM(OFFSET(Start,$A37,18):OFFSET(Start,$A37,37)),0)","v":0},{"$f":"IF(TODAY()-K$2>0,SUM(OFFSET(Start,$A37,18):OFFSET(Start,$A37,37)),0)","v":0},{"$f":"IF(TODAY()-L$2>0,SUM(OFFSET(Start,$A37,18):OFFSET(Start,$A37,37)),0)","v":0},{"$f":"IF(TODAY()-M$2>0,SUM(OFFSET(Start,$A37,18):OFFSET(Start,$A37,37)),0)","v":0},{"$f":"IF(TODAY()-N$2>0,SUM(OFFSET(Start,$A37,18):OFFSET(Start,$A37,37)),0)","v":0},{"$f":"IF(TODAY()-O$2>0,SUM(OFFSET(Start,$A37,18):OFFSET(Start,$A37,37)),0)","v":0},{"$f":"IF(TODAY()-P$2>0,SUM(OFFSET(Start,$A37,18):OFFSET(Start,$A37,37)),0)","v":0},{"$f":"IF(TODAY()-Q$2>0,SUM(OFFSET(Start,$A37,18):OFFSET(Start,$A37,37)),0)","v":0},{"$f":"IF(TODAY()-R$2>0,SUM(OFFSET(Start,$A37,18):OFFSET(Start,$A37,37)),0)","v":0},{"$f":"IF(TODAY()-S$2>0,SUM(OFFSET(Start,$A37,18):OFFSET(Start,$A37,37)),0)","v":0},{"$f":"IF(TODAY()-T$2>0,SUM(OFFSET(Start,$A37,18):OFFSET(Start,$A37,37)),0)","v":0},{"$f":"IF(TODAY()-U$2>0,SUM(OFFSET(Start,$A37,18):OFFSET(Start,$A37,37)),0)","v":0},{"$f":"IF(TODAY()-V$2>0,SUM(OFFSET(Start,$A37,18):OFFSET(Start,$A37,37)),0)","v":0},{"$f":"IF(TODAY()-W$2>0,SUM(OFFSET(Start,$A37,18):OFFSET(Start,$A37,37)),0)","v":0},{"$f":"IF(TODAY()-X$2>0,SUM(OFFSET(Start,$A37,18):OFFSET(Start,$A37,37)),0)","v":0},{"$f":"IF(TODAY()-Y$2>0,SUM(OFFSET(Start,$A37,18):OFFSET(Start,$A37,37)),0)","v":0},{"$f":"IF(TODAY()-Z$2>0,SUM(OFFSET(Start,$A37,18):OFFSET(Start,$A37,37)),0)","v":0},{"$f":"IF(TODAY()-AA$2>0,SUM(OFFSET(Start,$A37,18):OFFSET(Start,$A37,37)),0)","v":0},{"$f":"IF(TODAY()-AB$2>0,SUM(OFFSET(Start,$A37,18):OFFSET(Start,$A37,37)),0)","v":0},{"$f":"IF(TODAY()-AC$2>0,SUM(OFFSET(Start,$A37,18):OFFSET(Start,$A37,37)),0)","v":0},{"$f":"IF(TODAY()-AD$2>0,SUM(OFFSET(Start,$A37,18):OFFSET(Start,$A37,37)),0)","v":0},{"$f":"IF(TODAY()-AE$2>0,SUM(OFFSET(Start,$A37,18):OFFSET(Start,$A37,37)),0)","v":0},{"$f":"IF(TODAY()-AF$2>0,SUM(OFFSET(Start,$A37,18):OFFSET(Start,$A37,37)),0)","v":0},{"$f":"IF(TODAY()-AG$2>0,SUM(OFFSET(Start,$A37,18):OFFSET(Start,$A37,37)),0)","v":0},{"$f":"IF(TODAY()-AH$2>0,SUM(OFFSET(Start,$A37,18):OFFSET(Start,$A37,37)),0)","v":0},{"$f":"IF(TODAY()-AI$2>0,SUM(OFFSET(Start,$A37,18):OFFSET(Start,$A37,37)),0)","v":0},{"$f":"IF(TODAY()-AJ$2>0,SUM(OFFSET(Start,$A37,18):OFFSET(Start,$A37,37)),0)","v":0},{"$f":"IF(TODAY()-AK$2>0,SUM(OFFSET(Start,$A37,18):OFFSET(Start,$A37,37)),0)","v":0},{"$f":"IF(TODAY()-AL$2>0,SUM(OFFSET(Start,$A37,18):OFFSET(Start,$A37,37)),0)","v":0},0,0,0]
[37,{"$f":"OFFSET(Start,'Mellomlagring - antall besøk'!A38,0)","v":0},{"$f":"IF(TODAY()-C$2>0,SUM(OFFSET(Start,$A38,18):OFFSET(Start,$A38,37)),0)","v":0},{"$f":"IF(TODAY()-D$2>0,SUM(OFFSET(Start,$A38,18):OFFSET(Start,$A38,37)),0)","v":0},{"$f":"IF(TODAY()-E$2>0,SUM(OFFSET(Start,$A38,18):OFFSET(Start,$A38,37)),0)","v":0},{"$f":"IF(TODAY()-F$2>0,SUM(OFFSET(Start,$A38,18):OFFSET(Start,$A38,37)),0)","v":0},{"$f":"IF(TODAY()-G$2>0,SUM(OFFSET(Start,$A38,18):OFFSET(Start,$A38,37)),0)","v":0},{"$f":"IF(TODAY()-H$2>0,SUM(OFFSET(Start,$A38,18):OFFSET(Start,$A38,37)),0)","v":0},{"$f":"IF(TODAY()-I$2>0,SUM(OFFSET(Start,$A38,18):OFFSET(Start,$A38,37)),0)","v":0},{"$f":"IF(TODAY()-J$2>0,SUM(OFFSET(Start,$A38,18):OFFSET(Start,$A38,37)),0)","v":0},{"$f":"IF(TODAY()-K$2>0,SUM(OFFSET(Start,$A38,18):OFFSET(Start,$A38,37)),0)","v":0},{"$f":"IF(TODAY()-L$2>0,SUM(OFFSET(Start,$A38,18):OFFSET(Start,$A38,37)),0)","v":0},{"$f":"IF(TODAY()-M$2>0,SUM(OFFSET(Start,$A38,18):OFFSET(Start,$A38,37)),0)","v":0},{"$f":"IF(TODAY()-N$2>0,SUM(OFFSET(Start,$A38,18):OFFSET(Start,$A38,37)),0)","v":0},{"$f":"IF(TODAY()-O$2>0,SUM(OFFSET(Start,$A38,18):OFFSET(Start,$A38,37)),0)","v":0},{"$f":"IF(TODAY()-P$2>0,SUM(OFFSET(Start,$A38,18):OFFSET(Start,$A38,37)),0)","v":0},{"$f":"IF(TODAY()-Q$2>0,SUM(OFFSET(Start,$A38,18):OFFSET(Start,$A38,37)),0)","v":0},{"$f":"IF(TODAY()-R$2>0,SUM(OFFSET(Start,$A38,18):OFFSET(Start,$A38,37)),0)","v":0},{"$f":"IF(TODAY()-S$2>0,SUM(OFFSET(Start,$A38,18):OFFSET(Start,$A38,37)),0)","v":0},{"$f":"IF(TODAY()-T$2>0,SUM(OFFSET(Start,$A38,18):OFFSET(Start,$A38,37)),0)","v":0},{"$f":"IF(TODAY()-U$2>0,SUM(OFFSET(Start,$A38,18):OFFSET(Start,$A38,37)),0)","v":0},{"$f":"IF(TODAY()-V$2>0,SUM(OFFSET(Start,$A38,18):OFFSET(Start,$A38,37)),0)","v":0},{"$f":"IF(TODAY()-W$2>0,SUM(OFFSET(Start,$A38,18):OFFSET(Start,$A38,37)),0)","v":0},{"$f":"IF(TODAY()-X$2>0,SUM(OFFSET(Start,$A38,18):OFFSET(Start,$A38,37)),0)","v":0},{"$f":"IF(TODAY()-Y$2>0,SUM(OFFSET(Start,$A38,18):OFFSET(Start,$A38,37)),0)","v":0},{"$f":"IF(TODAY()-Z$2>0,SUM(OFFSET(Start,$A38,18):OFFSET(Start,$A38,37)),0)","v":0},{"$f":"IF(TODAY()-AA$2>0,SUM(OFFSET(Start,$A38,18):OFFSET(Start,$A38,37)),0)","v":0},{"$f":"IF(TODAY()-AB$2>0,SUM(OFFSET(Start,$A38,18):OFFSET(Start,$A38,37)),0)","v":0},{"$f":"IF(TODAY()-AC$2>0,SUM(OFFSET(Start,$A38,18):OFFSET(Start,$A38,37)),0)","v":0},{"$f":"IF(TODAY()-AD$2>0,SUM(OFFSET(Start,$A38,18):OFFSET(Start,$A38,37)),0)","v":0},{"$f":"IF(TODAY()-AE$2>0,SUM(OFFSET(Start,$A38,18):OFFSET(Start,$A38,37)),0)","v":0},{"$f":"IF(TODAY()-AF$2>0,SUM(OFFSET(Start,$A38,18):OFFSET(Start,$A38,37)),0)","v":0},{"$f":"IF(TODAY()-AG$2>0,SUM(OFFSET(Start,$A38,18):OFFSET(Start,$A38,37)),0)","v":0},{"$f":"IF(TODAY()-AH$2>0,SUM(OFFSET(Start,$A38,18):OFFSET(Start,$A38,37)),0)","v":0},{"$f":"IF(TODAY()-AI$2>0,SUM(OFFSET(Start,$A38,18):OFFSET(Start,$A38,37)),0)","v":0},{"$f":"IF(TODAY()-AJ$2>0,SUM(OFFSET(Start,$A38,18):OFFSET(Start,$A38,37)),0)","v":0},{"$f":"IF(TODAY()-AK$2>0,SUM(OFFSET(Start,$A38,18):OFFSET(Start,$A38,37)),0)","v":0},{"$f":"IF(TODAY()-AL$2>0,SUM(OFFSET(Start,$A38,18):OFFSET(Start,$A38,37)),0)","v":0},0,0,0]
[38,{"$f":"OFFSET(Start,'Mellomlagring - antall besøk'!A39,0)","v":0},{"$f":"IF(TODAY()-C$2>0,SUM(OFFSET(Start,$A39,18):OFFSET(Start,$A39,37)),0)","v":0},{"$f":"IF(TODAY()-D$2>0,SUM(OFFSET(Start,$A39,18):OFFSET(Start,$A39,37)),0)","v":0},{"$f":"IF(TODAY()-E$2>0,SUM(OFFSET(Start,$A39,18):OFFSET(Start,$A39,37)),0)","v":0},{"$f":"IF(TODAY()-F$2>0,SUM(OFFSET(Start,$A39,18):OFFSET(Start,$A39,37)),0)","v":0},{"$f":"IF(TODAY()-G$2>0,SUM(OFFSET(Start,$A39,18):OFFSET(Start,$A39,37)),0)","v":0},{"$f":"IF(TODAY()-H$2>0,SUM(OFFSET(Start,$A39,18):OFFSET(Start,$A39,37)),0)","v":0},{"$f":"IF(TODAY()-I$2>0,SUM(OFFSET(Start,$A39,18):OFFSET(Start,$A39,37)),0)","v":0},{"$f":"IF(TODAY()-J$2>0,SUM(OFFSET(Start,$A39,18):OFFSET(Start,$A39,37)),0)","v":0},{"$f":"IF(TODAY()-K$2>0,SUM(OFFSET(Start,$A39,18):OFFSET(Start,$A39,37)),0)","v":0},{"$f":"IF(TODAY()-L$2>0,SUM(OFFSET(Start,$A39,18):OFFSET(Start,$A39,37)),0)","v":0},{"$f":"IF(TODAY()-M$2>0,SUM(OFFSET(Start,$A39,18):OFFSET(Start,$A39,37)),0)","v":0},{"$f":"IF(TODAY()-N$2>0,SUM(OFFSET(Start,$A39,18):OFFSET(Start,$A39,37)),0)","v":0},{"$f":"IF(TODAY()-O$2>0,SUM(OFFSET(Start,$A39,18):OFFSET(Start,$A39,37)),0)","v":0},{"$f":"IF(TODAY()-P$2>0,SUM(OFFSET(Start,$A39,18):OFFSET(Start,$A39,37)),0)","v":0},{"$f":"IF(TODAY()-Q$2>0,SUM(OFFSET(Start,$A39,18):OFFSET(Start,$A39,37)),0)","v":0},{"$f":"IF(TODAY()-R$2>0,SUM(OFFSET(Start,$A39,18):OFFSET(Start,$A39,37)),0)","v":0},{"$f":"IF(TODAY()-S$2>0,SUM(OFFSET(Start,$A39,18):OFFSET(Start,$A39,37)),0)","v":0},{"$f":"IF(TODAY()-T$2>0,SUM(OFFSET(Start,$A39,18):OFFSET(Start,$A39,37)),0)","v":0},{"$f":"IF(TODAY()-U$2>0,SUM(OFFSET(Start,$A39,18):OFFSET(Start,$A39,37)),0)","v":0},{"$f":"IF(TODAY()-V$2>0,SUM(OFFSET(Start,$A39,18):OFFSET(Start,$A39,37)),0)","v":0},{"$f":"IF(TODAY()-W$2>0,SUM(OFFSET(Start,$A39,18):OFFSET(Start,$A39,37)),0)","v":0},{"$f":"IF(TODAY()-X$2>0,SUM(OFFSET(Start,$A39,18):OFFSET(Start,$A39,37)),0)","v":0},{"$f":"IF(TODAY()-Y$2>0,SUM(OFFSET(Start,$A39,18):OFFSET(Start,$A39,37)),0)","v":0},{"$f":"IF(TODAY()-Z$2>0,SUM(OFFSET(Start,$A39,18):OFFSET(Start,$A39,37)),0)","v":0},{"$f":"IF(TODAY()-AA$2>0,SUM(OFFSET(Start,$A39,18):OFFSET(Start,$A39,37)),0)","v":0},{"$f":"IF(TODAY()-AB$2>0,SUM(OFFSET(Start,$A39,18):OFFSET(Start,$A39,37)),0)","v":0},{"$f":"IF(TODAY()-AC$2>0,SUM(OFFSET(Start,$A39,18):OFFSET(Start,$A39,37)),0)","v":0},{"$f":"IF(TODAY()-AD$2>0,SUM(OFFSET(Start,$A39,18):OFFSET(Start,$A39,37)),0)","v":0},{"$f":"IF(TODAY()-AE$2>0,SUM(OFFSET(Start,$A39,18):OFFSET(Start,$A39,37)),0)","v":0},{"$f":"IF(TODAY()-AF$2>0,SUM(OFFSET(Start,$A39,18):OFFSET(Start,$A39,37)),0)","v":0},{"$f":"IF(TODAY()-AG$2>0,SUM(OFFSET(Start,$A39,18):OFFSET(Start,$A39,37)),0)","v":0},{"$f":"IF(TODAY()-AH$2>0,SUM(OFFSET(Start,$A39,18):OFFSET(Start,$A39,37)),0)","v":0},{"$f":"IF(TODAY()-AI$2>0,SUM(OFFSET(Start,$A39,18):OFFSET(Start,$A39,37)),0)","v":0},{"$f":"IF(TODAY()-AJ$2>0,SUM(OFFSET(Start,$A39,18):OFFSET(Start,$A39,37)),0)","v":0},{"$f":"IF(TODAY()-AK$2>0,SUM(OFFSET(Start,$A39,18):OFFSET(Start,$A39,37)),0)","v":0},{"$f":"IF(TODAY()-AL$2>0,SUM(OFFSET(Start,$A39,18):OFFSET(Start,$A39,37)),0)","v":0},0,0,0]
[39,{"$f":"OFFSET(Start,'Mellomlagring - antall besøk'!A40,0)","v":0},{"$f":"IF(TODAY()-C$2>0,SUM(OFFSET(Start,$A40,18):OFFSET(Start,$A40,37)),0)","v":0},{"$f":"IF(TODAY()-D$2>0,SUM(OFFSET(Start,$A40,18):OFFSET(Start,$A40,37)),0)","v":0},{"$f":"IF(TODAY()-E$2>0,SUM(OFFSET(Start,$A40,18):OFFSET(Start,$A40,37)),0)","v":0},{"$f":"IF(TODAY()-F$2>0,SUM(OFFSET(Start,$A40,18):OFFSET(Start,$A40,37)),0)","v":0},{"$f":"IF(TODAY()-G$2>0,SUM(OFFSET(Start,$A40,18):OFFSET(Start,$A40,37)),0)","v":0},{"$f":"IF(TODAY()-H$2>0,SUM(OFFSET(Start,$A40,18):OFFSET(Start,$A40,37)),0)","v":0},{"$f":"IF(TODAY()-I$2>0,SUM(OFFSET(Start,$A40,18):OFFSET(Start,$A40,37)),0)","v":0},{"$f":"IF(TODAY()-J$2>0,SUM(OFFSET(Start,$A40,18):OFFSET(Start,$A40,37)),0)","v":0},{"$f":"IF(TODAY()-K$2>0,SUM(OFFSET(Start,$A40,18):OFFSET(Start,$A40,37)),0)","v":0},{"$f":"IF(TODAY()-L$2>0,SUM(OFFSET(Start,$A40,18):OFFSET(Start,$A40,37)),0)","v":0},{"$f":"IF(TODAY()-M$2>0,SUM(OFFSET(Start,$A40,18):OFFSET(Start,$A40,37)),0)","v":0},{"$f":"IF(TODAY()-N$2>0,SUM(OFFSET(Start,$A40,18):OFFSET(Start,$A40,37)),0)","v":0},{"$f":"IF(TODAY()-O$2>0,SUM(OFFSET(Start,$A40,18):OFFSET(Start,$A40,37)),0)","v":0},{"$f":"IF(TODAY()-P$2>0,SUM(OFFSET(Start,$A40,18):OFFSET(Start,$A40,37)),0)","v":0},{"$f":"IF(TODAY()-Q$2>0,SUM(OFFSET(Start,$A40,18):OFFSET(Start,$A40,37)),0)","v":0},{"$f":"IF(TODAY()-R$2>0,SUM(OFFSET(Start,$A40,18):OFFSET(Start,$A40,37)),0)","v":0},{"$f":"IF(TODAY()-S$2>0,SUM(OFFSET(Start,$A40,18):OFFSET(Start,$A40,37)),0)","v":0},{"$f":"IF(TODAY()-T$2>0,SUM(OFFSET(Start,$A40,18):OFFSET(Start,$A40,37)),0)","v":0},{"$f":"IF(TODAY()-U$2>0,SUM(OFFSET(Start,$A40,18):OFFSET(Start,$A40,37)),0)","v":0},{"$f":"IF(TODAY()-V$2>0,SUM(OFFSET(Start,$A40,18):OFFSET(Start,$A40,37)),0)","v":0},{"$f":"IF(TODAY()-W$2>0,SUM(OFFSET(Start,$A40,18):OFFSET(Start,$A40,37)),0)","v":0},{"$f":"IF(TODAY()-X$2>0,SUM(OFFSET(Start,$A40,18):OFFSET(Start,$A40,37)),0)","v":0},{"$f":"IF(TODAY()-Y$2>0,SUM(OFFSET(Start,$A40,18):OFFSET(Start,$A40,37)),0)","v":0},{"$f":"IF(TODAY()-Z$2>0,SUM(OFFSET(Start,$A40,18):OFFSET(Start,$A40,37)),0)","v":0},{"$f":"IF(TODAY()-AA$2>0,SUM(OFFSET(Start,$A40,18):OFFSET(Start,$A40,37)),0)","v":0},{"$f":"IF(TODAY()-AB$2>0,SUM(OFFSET(Start,$A40,18):OFFSET(Start,$A40,37)),0)","v":0},{"$f":"IF(TODAY()-AC$2>0,SUM(OFFSET(Start,$A40,18):OFFSET(Start,$A40,37)),0)","v":0},{"$f":"IF(TODAY()-AD$2>0,SUM(OFFSET(Start,$A40,18):OFFSET(Start,$A40,37)),0)","v":0},{"$f":"IF(TODAY()-AE$2>0,SUM(OFFSET(Start,$A40,18):OFFSET(Start,$A40,37)),0)","v":0},{"$f":"IF(TODAY()-AF$2>0,SUM(OFFSET(Start,$A40,18):OFFSET(Start,$A40,37)),0)","v":0},{"$f":"IF(TODAY()-AG$2>0,SUM(OFFSET(Start,$A40,18):OFFSET(Start,$A40,37)),0)","v":0},{"$f":"IF(TODAY()-AH$2>0,SUM(OFFSET(Start,$A40,18):OFFSET(Start,$A40,37)),0)","v":0},{"$f":"IF(TODAY()-AI$2>0,SUM(OFFSET(Start,$A40,18):OFFSET(Start,$A40,37)),0)","v":0},{"$f":"IF(TODAY()-AJ$2>0,SUM(OFFSET(Start,$A40,18):OFFSET(Start,$A40,37)),0)","v":0},{"$f":"IF(TODAY()-AK$2>0,SUM(OFFSET(Start,$A40,18):OFFSET(Start,$A40,37)),0)","v":0},{"$f":"IF(TODAY()-AL$2>0,SUM(OFFSET(Start,$A40,18):OFFSET(Start,$A40,37)),0)","v":0},0,0,0]
[40,{"$f":"OFFSET(Start,'Mellomlagring - antall besøk'!A41,0)","v":0},{"$f":"IF(TODAY()-C$2>0,SUM(OFFSET(Start,$A41,18):OFFSET(Start,$A41,37)),0)","v":0},{"$f":"IF(TODAY()-D$2>0,SUM(OFFSET(Start,$A41,18):OFFSET(Start,$A41,37)),0)","v":0},{"$f":"IF(TODAY()-E$2>0,SUM(OFFSET(Start,$A41,18):OFFSET(Start,$A41,37)),0)","v":0},{"$f":"IF(TODAY()-F$2>0,SUM(OFFSET(Start,$A41,18):OFFSET(Start,$A41,37)),0)","v":0},{"$f":"IF(TODAY()-G$2>0,SUM(OFFSET(Start,$A41,18):OFFSET(Start,$A41,37)),0)","v":0},{"$f":"IF(TODAY()-H$2>0,SUM(OFFSET(Start,$A41,18):OFFSET(Start,$A41,37)),0)","v":0},{"$f":"IF(TODAY()-I$2>0,SUM(OFFSET(Start,$A41,18):OFFSET(Start,$A41,37)),0)","v":0},{"$f":"IF(TODAY()-J$2>0,SUM(OFFSET(Start,$A41,18):OFFSET(Start,$A41,37)),0)","v":0},{"$f":"IF(TODAY()-K$2>0,SUM(OFFSET(Start,$A41,18):OFFSET(Start,$A41,37)),0)","v":0},{"$f":"IF(TODAY()-L$2>0,SUM(OFFSET(Start,$A41,18):OFFSET(Start,$A41,37)),0)","v":0},{"$f":"IF(TODAY()-M$2>0,SUM(OFFSET(Start,$A41,18):OFFSET(Start,$A41,37)),0)","v":0},{"$f":"IF(TODAY()-N$2>0,SUM(OFFSET(Start,$A41,18):OFFSET(Start,$A41,37)),0)","v":0},{"$f":"IF(TODAY()-O$2>0,SUM(OFFSET(Start,$A41,18):OFFSET(Start,$A41,37)),0)","v":0},{"$f":"IF(TODAY()-P$2>0,SUM(OFFSET(Start,$A41,18):OFFSET(Start,$A41,37)),0)","v":0},{"$f":"IF(TODAY()-Q$2>0,SUM(OFFSET(Start,$A41,18):OFFSET(Start,$A41,37)),0)","v":0},{"$f":"IF(TODAY()-R$2>0,SUM(OFFSET(Start,$A41,18):OFFSET(Start,$A41,37)),0)","v":0},{"$f":"IF(TODAY()-S$2>0,SUM(OFFSET(Start,$A41,18):OFFSET(Start,$A41,37)),0)","v":0},{"$f":"IF(TODAY()-T$2>0,SUM(OFFSET(Start,$A41,18):OFFSET(Start,$A41,37)),0)","v":0},{"$f":"IF(TODAY()-U$2>0,SUM(OFFSET(Start,$A41,18):OFFSET(Start,$A41,37)),0)","v":0},{"$f":"IF(TODAY()-V$2>0,SUM(OFFSET(Start,$A41,18):OFFSET(Start,$A41,37)),0)","v":0},{"$f":"IF(TODAY()-W$2>0,SUM(OFFSET(Start,$A41,18):OFFSET(Start,$A41,37)),0)","v":0},{"$f":"IF(TODAY()-X$2>0,SUM(OFFSET(Start,$A41,18):OFFSET(Start,$A41,37)),0)","v":0},{"$f":"IF(TODAY()-Y$2>0,SUM(OFFSET(Start,$A41,18):OFFSET(Start,$A41,37)),0)","v":0},{"$f":"IF(TODAY()-Z$2>0,SUM(OFFSET(Start,$A41,18):OFFSET(Start,$A41,37)),0)","v":0},{"$f":"IF(TODAY()-AA$2>0,SUM(OFFSET(Start,$A41,18):OFFSET(Start,$A41,37)),0)","v":0},{"$f":"IF(TODAY()-AB$2>0,SUM(OFFSET(Start,$A41,18):OFFSET(Start,$A41,37)),0)","v":0},{"$f":"IF(TODAY()-AC$2>0,SUM(OFFSET(Start,$A41,18):OFFSET(Start,$A41,37)),0)","v":0},{"$f":"IF(TODAY()-AD$2>0,SUM(OFFSET(Start,$A41,18):OFFSET(Start,$A41,37)),0)","v":0},{"$f":"IF(TODAY()-AE$2>0,SUM(OFFSET(Start,$A41,18):OFFSET(Start,$A41,37)),0)","v":0},{"$f":"IF(TODAY()-AF$2>0,SUM(OFFSET(Start,$A41,18):OFFSET(Start,$A41,37)),0)","v":0},{"$f":"IF(TODAY()-AG$2>0,SUM(OFFSET(Start,$A41,18):OFFSET(Start,$A41,37)),0)","v":0},{"$f":"IF(TODAY()-AH$2>0,SUM(OFFSET(Start,$A41,18):OFFSET(Start,$A41,37)),0)","v":0},{"$f":"IF(TODAY()-AI$2>0,SUM(OFFSET(Start,$A41,18):OFFSET(Start,$A41,37)),0)","v":0},{"$f":"IF(TODAY()-AJ$2>0,SUM(OFFSET(Start,$A41,18):OFFSET(Start,$A41,37)),0)","v":0},{"$f":"IF(TODAY()-AK$2>0,SUM(OFFSET(Start,$A41,18):OFFSET(Start,$A41,37)),0)","v":0},{"$f":"IF(TODAY()-AL$2>0,SUM(OFFSET(Start,$A41,18):OFFSET(Start,$A41,37)),0)","v":0},0,0,0]
[41,{"$f":"OFFSET(Start,'Mellomlagring - antall besøk'!A42,0)","v":0},{"$f":"IF(TODAY()-C$2>0,SUM(OFFSET(Start,$A42,18):OFFSET(Start,$A42,37)),0)","v":0},{"$f":"IF(TODAY()-D$2>0,SUM(OFFSET(Start,$A42,18):OFFSET(Start,$A42,37)),0)","v":0},{"$f":"IF(TODAY()-E$2>0,SUM(OFFSET(Start,$A42,18):OFFSET(Start,$A42,37)),0)","v":0},{"$f":"IF(TODAY()-F$2>0,SUM(OFFSET(Start,$A42,18):OFFSET(Start,$A42,37)),0)","v":0},{"$f":"IF(TODAY()-G$2>0,SUM(OFFSET(Start,$A42,18):OFFSET(Start,$A42,37)),0)","v":0},{"$f":"IF(TODAY()-H$2>0,SUM(OFFSET(Start,$A42,18):OFFSET(Start,$A42,37)),0)","v":0},{"$f":"IF(TODAY()-I$2>0,SUM(OFFSET(Start,$A42,18):OFFSET(Start,$A42,37)),0)","v":0},{"$f":"IF(TODAY()-J$2>0,SUM(OFFSET(Start,$A42,18):OFFSET(Start,$A42,37)),0)","v":0},{"$f":"IF(TODAY()-K$2>0,SUM(OFFSET(Start,$A42,18):OFFSET(Start,$A42,37)),0)","v":0},{"$f":"IF(TODAY()-L$2>0,SUM(OFFSET(Start,$A42,18):OFFSET(Start,$A42,37)),0)","v":0},{"$f":"IF(TODAY()-M$2>0,SUM(OFFSET(Start,$A42,18):OFFSET(Start,$A42,37)),0)","v":0},{"$f":"IF(TODAY()-N$2>0,SUM(OFFSET(Start,$A42,18):OFFSET(Start,$A42,37)),0)","v":0},{"$f":"IF(TODAY()-O$2>0,SUM(OFFSET(Start,$A42,18):OFFSET(Start,$A42,37)),0)","v":0},{"$f":"IF(TODAY()-P$2>0,SUM(OFFSET(Start,$A42,18):OFFSET(Start,$A42,37)),0)","v":0},{"$f":"IF(TODAY()-Q$2>0,SUM(OFFSET(Start,$A42,18):OFFSET(Start,$A42,37)),0)","v":0},{"$f":"IF(TODAY()-R$2>0,SUM(OFFSET(Start,$A42,18):OFFSET(Start,$A42,37)),0)","v":0},{"$f":"IF(TODAY()-S$2>0,SUM(OFFSET(Start,$A42,18):OFFSET(Start,$A42,37)),0)","v":0},{"$f":"IF(TODAY()-T$2>0,SUM(OFFSET(Start,$A42,18):OFFSET(Start,$A42,37)),0)","v":0},{"$f":"IF(TODAY()-U$2>0,SUM(OFFSET(Start,$A42,18):OFFSET(Start,$A42,37)),0)","v":0},{"$f":"IF(TODAY()-V$2>0,SUM(OFFSET(Start,$A42,18):OFFSET(Start,$A42,37)),0)","v":0},{"$f":"IF(TODAY()-W$2>0,SUM(OFFSET(Start,$A42,18):OFFSET(Start,$A42,37)),0)","v":0},{"$f":"IF(TODAY()-X$2>0,SUM(OFFSET(Start,$A42,18):OFFSET(Start,$A42,37)),0)","v":0},{"$f":"IF(TODAY()-Y$2>0,SUM(OFFSET(Start,$A42,18):OFFSET(Start,$A42,37)),0)","v":0},{"$f":"IF(TODAY()-Z$2>0,SUM(OFFSET(Start,$A42,18):OFFSET(Start,$A42,37)),0)","v":0},{"$f":"IF(TODAY()-AA$2>0,SUM(OFFSET(Start,$A42,18):OFFSET(Start,$A42,37)),0)","v":0},{"$f":"IF(TODAY()-AB$2>0,SUM(OFFSET(Start,$A42,18):OFFSET(Start,$A42,37)),0)","v":0},{"$f":"IF(TODAY()-AC$2>0,SUM(OFFSET(Start,$A42,18):OFFSET(Start,$A42,37)),0)","v":0},{"$f":"IF(TODAY()-AD$2>0,SUM(OFFSET(Start,$A42,18):OFFSET(Start,$A42,37)),0)","v":0},{"$f":"IF(TODAY()-AE$2>0,SUM(OFFSET(Start,$A42,18):OFFSET(Start,$A42,37)),0)","v":0},{"$f":"IF(TODAY()-AF$2>0,SUM(OFFSET(Start,$A42,18):OFFSET(Start,$A42,37)),0)","v":0},{"$f":"IF(TODAY()-AG$2>0,SUM(OFFSET(Start,$A42,18):OFFSET(Start,$A42,37)),0)","v":0},{"$f":"IF(TODAY()-AH$2>0,SUM(OFFSET(Start,$A42,18):OFFSET(Start,$A42,37)),0)","v":0},{"$f":"IF(TODAY()-AI$2>0,SUM(OFFSET(Start,$A42,18):OFFSET(Start,$A42,37)),0)","v":0},{"$f":"IF(TODAY()-AJ$2>0,SUM(OFFSET(Start,$A42,18):OFFSET(Start,$A42,37)),0)","v":0},{"$f":"IF(TODAY()-AK$2>0,SUM(OFFSET(Start,$A42,18):OFFSET(Start,$A42,37)),0)","v":0},{"$f":"IF(TODAY()-AL$2>0,SUM(OFFSET(Start,$A42,18):OFFSET(Start,$A42,37)),0)","v":0},0,0,0]
[42,{"$f":"OFFSET(Start,'Mellomlagring - antall besøk'!A43,0)","v":0},{"$f":"IF(TODAY()-C$2>0,SUM(OFFSET(Start,$A43,18):OFFSET(Start,$A43,37)),0)","v":0},{"$f":"IF(TODAY()-D$2>0,SUM(OFFSET(Start,$A43,18):OFFSET(Start,$A43,37)),0)","v":0},{"$f":"IF(TODAY()-E$2>0,SUM(OFFSET(Start,$A43,18):OFFSET(Start,$A43,37)),0)","v":0},{"$f":"IF(TODAY()-F$2>0,SUM(OFFSET(Start,$A43,18):OFFSET(Start,$A43,37)),0)","v":0},{"$f":"IF(TODAY()-G$2>0,SUM(OFFSET(Start,$A43,18):OFFSET(Start,$A43,37)),0)","v":0},{"$f":"IF(TODAY()-H$2>0,SUM(OFFSET(Start,$A43,18):OFFSET(Start,$A43,37)),0)","v":0},{"$f":"IF(TODAY()-I$2>0,SUM(OFFSET(Start,$A43,18):OFFSET(Start,$A43,37)),0)","v":0},{"$f":"IF(TODAY()-J$2>0,SUM(OFFSET(Start,$A43,18):OFFSET(Start,$A43,37)),0)","v":0},{"$f":"IF(TODAY()-K$2>0,SUM(OFFSET(Start,$A43,18):OFFSET(Start,$A43,37)),0)","v":0},{"$f":"IF(TODAY()-L$2>0,SUM(OFFSET(Start,$A43,18):OFFSET(Start,$A43,37)),0)","v":0},{"$f":"IF(TODAY()-M$2>0,SUM(OFFSET(Start,$A43,18):OFFSET(Start,$A43,37)),0)","v":0},{"$f":"IF(TODAY()-N$2>0,SUM(OFFSET(Start,$A43,18):OFFSET(Start,$A43,37)),0)","v":0},{"$f":"IF(TODAY()-O$2>0,SUM(OFFSET(Start,$A43,18):OFFSET(Start,$A43,37)),0)","v":0},{"$f":"IF(TODAY()-P$2>0,SUM(OFFSET(Start,$A43,18):OFFSET(Start,$A43,37)),0)","v":0},{"$f":"IF(TODAY()-Q$2>0,SUM(OFFSET(Start,$A43,18):OFFSET(Start,$A43,37)),0)","v":0},{"$f":"IF(TODAY()-R$2>0,SUM(OFFSET(Start,$A43,18):OFFSET(Start,$A43,37)),0)","v":0},{"$f":"IF(TODAY()-S$2>0,SUM(OFFSET(Start,$A43,18):OFFSET(Start,$A43,37)),0)","v":0},{"$f":"IF(TODAY()-T$2>0,SUM(OFFSET(Start,$A43,18):OFFSET(Start,$A43,37)),0)","v":0},{"$f":"IF(TODAY()-U$2>0,SUM(OFFSET(Start,$A43,18):OFFSET(Start,$A43,37)),0)","v":0},{"$f":"IF(TODAY()-V$2>0,SUM(OFFSET(Start,$A43,18):OFFSET(Start,$A43,37)),0)","v":0},{"$f":"IF(TODAY()-W$2>0,SUM(OFFSET(Start,$A43,18):OFFSET(Start,$A43,37)),0)","v":0},{"$f":"IF(TODAY()-X$2>0,SUM(OFFSET(Start,$A43,18):OFFSET(Start,$A43,37)),0)","v":0},{"$f":"IF(TODAY()-Y$2>0,SUM(OFFSET(Start,$A43,18):OFFSET(Start,$A43,37)),0)","v":0},{"$f":"IF(TODAY()-Z$2>0,SUM(OFFSET(Start,$A43,18):OFFSET(Start,$A43,37)),0)","v":0},{"$f":"IF(TODAY()-AA$2>0,SUM(OFFSET(Start,$A43,18):OFFSET(Start,$A43,37)),0)","v":0},{"$f":"IF(TODAY()-AB$2>0,SUM(OFFSET(Start,$A43,18):OFFSET(Start,$A43,37)),0)","v":0},{"$f":"IF(TODAY()-AC$2>0,SUM(OFFSET(Start,$A43,18):OFFSET(Start,$A43,37)),0)","v":0},{"$f":"IF(TODAY()-AD$2>0,SUM(OFFSET(Start,$A43,18):OFFSET(Start,$A43,37)),0)","v":0},{"$f":"IF(TODAY()-AE$2>0,SUM(OFFSET(Start,$A43,18):OFFSET(Start,$A43,37)),0)","v":0},{"$f":"IF(TODAY()-AF$2>0,SUM(OFFSET(Start,$A43,18):OFFSET(Start,$A43,37)),0)","v":0},{"$f":"IF(TODAY()-AG$2>0,SUM(OFFSET(Start,$A43,18):OFFSET(Start,$A43,37)),0)","v":0},{"$f":"IF(TODAY()-AH$2>0,SUM(OFFSET(Start,$A43,18):OFFSET(Start,$A43,37)),0)","v":0},{"$f":"IF(TODAY()-AI$2>0,SUM(OFFSET(Start,$A43,18):OFFSET(Start,$A43,37)),0)","v":0},{"$f":"IF(TODAY()-AJ$2>0,SUM(OFFSET(Start,$A43,18):OFFSET(Start,$A43,37)),0)","v":0},{"$f":"IF(TODAY()-AK$2>0,SUM(OFFSET(Start,$A43,18):OFFSET(Start,$A43,37)),0)","v":0},{"$f":"IF(TODAY()-AL$2>0,SUM(OFFSET(Start,$A43,18):OFFSET(Start,$A43,37)),0)","v":0},0,0,0]
[43,{"$f":"OFFSET(Start,'Mellomlagring - antall besøk'!A44,0)","v":0},{"$f":"IF(TODAY()-C$2>0,SUM(OFFSET(Start,$A44,18):OFFSET(Start,$A44,37)),0)","v":0},{"$f":"IF(TODAY()-D$2>0,SUM(OFFSET(Start,$A44,18):OFFSET(Start,$A44,37)),0)","v":0},{"$f":"IF(TODAY()-E$2>0,SUM(OFFSET(Start,$A44,18):OFFSET(Start,$A44,37)),0)","v":0},{"$f":"IF(TODAY()-F$2>0,SUM(OFFSET(Start,$A44,18):OFFSET(Start,$A44,37)),0)","v":0},{"$f":"IF(TODAY()-G$2>0,SUM(OFFSET(Start,$A44,18):OFFSET(Start,$A44,37)),0)","v":0},{"$f":"IF(TODAY()-H$2>0,SUM(OFFSET(Start,$A44,18):OFFSET(Start,$A44,37)),0)","v":0},{"$f":"IF(TODAY()-I$2>0,SUM(OFFSET(Start,$A44,18):OFFSET(Start,$A44,37)),0)","v":0},{"$f":"IF(TODAY()-J$2>0,SUM(OFFSET(Start,$A44,18):OFFSET(Start,$A44,37)),0)","v":0},{"$f":"IF(TODAY()-K$2>0,SUM(OFFSET(Start,$A44,18):OFFSET(Start,$A44,37)),0)","v":0},{"$f":"IF(TODAY()-L$2>0,SUM(OFFSET(Start,$A44,18):OFFSET(Start,$A44,37)),0)","v":0},{"$f":"IF(TODAY()-M$2>0,SUM(OFFSET(Start,$A44,18):OFFSET(Start,$A44,37)),0)","v":0},{"$f":"IF(TODAY()-N$2>0,SUM(OFFSET(Start,$A44,18):OFFSET(Start,$A44,37)),0)","v":0},{"$f":"IF(TODAY()-O$2>0,SUM(OFFSET(Start,$A44,18):OFFSET(Start,$A44,37)),0)","v":0},{"$f":"IF(TODAY()-P$2>0,SUM(OFFSET(Start,$A44,18):OFFSET(Start,$A44,37)),0)","v":0},{"$f":"IF(TODAY()-Q$2>0,SUM(OFFSET(Start,$A44,18):OFFSET(Start,$A44,37)),0)","v":0},{"$f":"IF(TODAY()-R$2>0,SUM(OFFSET(Start,$A44,18):OFFSET(Start,$A44,37)),0)","v":0},{"$f":"IF(TODAY()-S$2>0,SUM(OFFSET(Start,$A44,18):OFFSET(Start,$A44,37)),0)","v":0},{"$f":"IF(TODAY()-T$2>0,SUM(OFFSET(Start,$A44,18):OFFSET(Start,$A44,37)),0)","v":0},{"$f":"IF(TODAY()-U$2>0,SUM(OFFSET(Start,$A44,18):OFFSET(Start,$A44,37)),0)","v":0},{"$f":"IF(TODAY()-V$2>0,SUM(OFFSET(Start,$A44,18):OFFSET(Start,$A44,37)),0)","v":0},{"$f":"IF(TODAY()-W$2>0,SUM(OFFSET(Start,$A44,18):OFFSET(Start,$A44,37)),0)","v":0},{"$f":"IF(TODAY()-X$2>0,SUM(OFFSET(Start,$A44,18):OFFSET(Start,$A44,37)),0)","v":0},{"$f":"IF(TODAY()-Y$2>0,SUM(OFFSET(Start,$A44,18):OFFSET(Start,$A44,37)),0)","v":0},{"$f":"IF(TODAY()-Z$2>0,SUM(OFFSET(Start,$A44,18):OFFSET(Start,$A44,37)),0)","v":0},{"$f":"IF(TODAY()-AA$2>0,SUM(OFFSET(Start,$A44,18):OFFSET(Start,$A44,37)),0)","v":0},{"$f":"IF(TODAY()-AB$2>0,SUM(OFFSET(Start,$A44,18):OFFSET(Start,$A44,37)),0)","v":0},{"$f":"IF(TODAY()-AC$2>0,SUM(OFFSET(Start,$A44,18):OFFSET(Start,$A44,37)),0)","v":0},{"$f":"IF(TODAY()-AD$2>0,SUM(OFFSET(Start,$A44,18):OFFSET(Start,$A44,37)),0)","v":0},{"$f":"IF(TODAY()-AE$2>0,SUM(OFFSET(Start,$A44,18):OFFSET(Start,$A44,37)),0)","v":0},{"$f":"IF(TODAY()-AF$2>0,SUM(OFFSET(Start,$A44,18):OFFSET(Start,$A44,37)),0)","v":0},{"$f":"IF(TODAY()-AG$2>0,SUM(OFFSET(Start,$A44,18):OFFSET(Start,$A44,37)),0)","v":0},{"$f":"IF(TODAY()-AH$2>0,SUM(OFFSET(Start,$A44,18):OFFSET(Start,$A44,37)),0)","v":0},{"$f":"IF(TODAY()-AI$2>0,SUM(OFFSET(Start,$A44,18):OFFSET(Start,$A44,37)),0)","v":0},{"$f":"IF(TODAY()-AJ$2>0,SUM(OFFSET(Start,$A44,18):OFFSET(Start,$A44,37)),0)","v":0},{"$f":"IF(TODAY()-AK$2>0,SUM(OFFSET(Start,$A44,18):OFFSET(Start,$A44,37)),0)","v":0},{"$f":"IF(TODAY()-AL$2>0,SUM(OFFSET(Start,$A44,18):OFFSET(Start,$A44,37)),0)","v":0},0,0,0]
[44,{"$f":"OFFSET(Start,'Mellomlagring - antall besøk'!A45,0)","v":0},{"$f":"IF(TODAY()-C$2>0,SUM(OFFSET(Start,$A45,18):OFFSET(Start,$A45,37)),0)","v":0},{"$f":"IF(TODAY()-D$2>0,SUM(OFFSET(Start,$A45,18):OFFSET(Start,$A45,37)),0)","v":0},{"$f":"IF(TODAY()-E$2>0,SUM(OFFSET(Start,$A45,18):OFFSET(Start,$A45,37)),0)","v":0},{"$f":"IF(TODAY()-F$2>0,SUM(OFFSET(Start,$A45,18):OFFSET(Start,$A45,37)),0)","v":0},{"$f":"IF(TODAY()-G$2>0,SUM(OFFSET(Start,$A45,18):OFFSET(Start,$A45,37)),0)","v":0},{"$f":"IF(TODAY()-H$2>0,SUM(OFFSET(Start,$A45,18):OFFSET(Start,$A45,37)),0)","v":0},{"$f":"IF(TODAY()-I$2>0,SUM(OFFSET(Start,$A45,18):OFFSET(Start,$A45,37)),0)","v":0},{"$f":"IF(TODAY()-J$2>0,SUM(OFFSET(Start,$A45,18):OFFSET(Start,$A45,37)),0)","v":0},{"$f":"IF(TODAY()-K$2>0,SUM(OFFSET(Start,$A45,18):OFFSET(Start,$A45,37)),0)","v":0},{"$f":"IF(TODAY()-L$2>0,SUM(OFFSET(Start,$A45,18):OFFSET(Start,$A45,37)),0)","v":0},{"$f":"IF(TODAY()-M$2>0,SUM(OFFSET(Start,$A45,18):OFFSET(Start,$A45,37)),0)","v":0},{"$f":"IF(TODAY()-N$2>0,SUM(OFFSET(Start,$A45,18):OFFSET(Start,$A45,37)),0)","v":0},{"$f":"IF(TODAY()-O$2>0,SUM(OFFSET(Start,$A45,18):OFFSET(Start,$A45,37)),0)","v":0},{"$f":"IF(TODAY()-P$2>0,SUM(OFFSET(Start,$A45,18):OFFSET(Start,$A45,37)),0)","v":0},{"$f":"IF(TODAY()-Q$2>0,SUM(OFFSET(Start,$A45,18):OFFSET(Start,$A45,37)),0)","v":0},{"$f":"IF(TODAY()-R$2>0,SUM(OFFSET(Start,$A45,18):OFFSET(Start,$A45,37)),0)","v":0},{"$f":"IF(TODAY()-S$2>0,SUM(OFFSET(Start,$A45,18):OFFSET(Start,$A45,37)),0)","v":0},{"$f":"IF(TODAY()-T$2>0,SUM(OFFSET(Start,$A45,18):OFFSET(Start,$A45,37)),0)","v":0},{"$f":"IF(TODAY()-U$2>0,SUM(OFFSET(Start,$A45,18):OFFSET(Start,$A45,37)),0)","v":0},{"$f":"IF(TODAY()-V$2>0,SUM(OFFSET(Start,$A45,18):OFFSET(Start,$A45,37)),0)","v":0},{"$f":"IF(TODAY()-W$2>0,SUM(OFFSET(Start,$A45,18):OFFSET(Start,$A45,37)),0)","v":0},{"$f":"IF(TODAY()-X$2>0,SUM(OFFSET(Start,$A45,18):OFFSET(Start,$A45,37)),0)","v":0},{"$f":"IF(TODAY()-Y$2>0,SUM(OFFSET(Start,$A45,18):OFFSET(Start,$A45,37)),0)","v":0},{"$f":"IF(TODAY()-Z$2>0,SUM(OFFSET(Start,$A45,18):OFFSET(Start,$A45,37)),0)","v":0},{"$f":"IF(TODAY()-AA$2>0,SUM(OFFSET(Start,$A45,18):OFFSET(Start,$A45,37)),0)","v":0},{"$f":"IF(TODAY()-AB$2>0,SUM(OFFSET(Start,$A45,18):OFFSET(Start,$A45,37)),0)","v":0},{"$f":"IF(TODAY()-AC$2>0,SUM(OFFSET(Start,$A45,18):OFFSET(Start,$A45,37)),0)","v":0},{"$f":"IF(TODAY()-AD$2>0,SUM(OFFSET(Start,$A45,18):OFFSET(Start,$A45,37)),0)","v":0},{"$f":"IF(TODAY()-AE$2>0,SUM(OFFSET(Start,$A45,18):OFFSET(Start,$A45,37)),0)","v":0},{"$f":"IF(TODAY()-AF$2>0,SUM(OFFSET(Start,$A45,18):OFFSET(Start,$A45,37)),0)","v":0},{"$f":"IF(TODAY()-AG$2>0,SUM(OFFSET(Start,$A45,18):OFFSET(Start,$A45,37)),0)","v":0},{"$f":"IF(TODAY()-AH$2>0,SUM(OFFSET(Start,$A45,18):OFFSET(Start,$A45,37)),0)","v":0},{"$f":"IF(TODAY()-AI$2>0,SUM(OFFSET(Start,$A45,18):OFFSET(Start,$A45,37)),0)","v":0},{"$f":"IF(TODAY()-AJ$2>0,SUM(OFFSET(Start,$A45,18):OFFSET(Start,$A45,37)),0)","v":0},{"$f":"IF(TODAY()-AK$2>0,SUM(OFFSET(Start,$A45,18):OFFSET(Start,$A45,37)),0)","v":0},{"$f":"IF(TODAY()-AL$2>0,SUM(OFFSET(Start,$A45,18):OFFSET(Start,$A45,37)),0)","v":0},0,0,0]
[45,{"$f":"OFFSET(Start,'Mellomlagring - antall besøk'!A46,0)","v":0},{"$f":"IF(TODAY()-C$2>0,SUM(OFFSET(Start,$A46,18):OFFSET(Start,$A46,37)),0)","v":0},{"$f":"IF(TODAY()-D$2>0,SUM(OFFSET(Start,$A46,18):OFFSET(Start,$A46,37)),0)","v":0},{"$f":"IF(TODAY()-E$2>0,SUM(OFFSET(Start,$A46,18):OFFSET(Start,$A46,37)),0)","v":0},{"$f":"IF(TODAY()-F$2>0,SUM(OFFSET(Start,$A46,18):OFFSET(Start,$A46,37)),0)","v":0},{"$f":"IF(TODAY()-G$2>0,SUM(OFFSET(Start,$A46,18):OFFSET(Start,$A46,37)),0)","v":0},{"$f":"IF(TODAY()-H$2>0,SUM(OFFSET(Start,$A46,18):OFFSET(Start,$A46,37)),0)","v":0},{"$f":"IF(TODAY()-I$2>0,SUM(OFFSET(Start,$A46,18):OFFSET(Start,$A46,37)),0)","v":0},{"$f":"IF(TODAY()-J$2>0,SUM(OFFSET(Start,$A46,18):OFFSET(Start,$A46,37)),0)","v":0},{"$f":"IF(TODAY()-K$2>0,SUM(OFFSET(Start,$A46,18):OFFSET(Start,$A46,37)),0)","v":0},{"$f":"IF(TODAY()-L$2>0,SUM(OFFSET(Start,$A46,18):OFFSET(Start,$A46,37)),0)","v":0},{"$f":"IF(TODAY()-M$2>0,SUM(OFFSET(Start,$A46,18):OFFSET(Start,$A46,37)),0)","v":0},{"$f":"IF(TODAY()-N$2>0,SUM(OFFSET(Start,$A46,18):OFFSET(Start,$A46,37)),0)","v":0},{"$f":"IF(TODAY()-O$2>0,SUM(OFFSET(Start,$A46,18):OFFSET(Start,$A46,37)),0)","v":0},{"$f":"IF(TODAY()-P$2>0,SUM(OFFSET(Start,$A46,18):OFFSET(Start,$A46,37)),0)","v":0},{"$f":"IF(TODAY()-Q$2>0,SUM(OFFSET(Start,$A46,18):OFFSET(Start,$A46,37)),0)","v":0},{"$f":"IF(TODAY()-R$2>0,SUM(OFFSET(Start,$A46,18):OFFSET(Start,$A46,37)),0)","v":0},{"$f":"IF(TODAY()-S$2>0,SUM(OFFSET(Start,$A46,18):OFFSET(Start,$A46,37)),0)","v":0},{"$f":"IF(TODAY()-T$2>0,SUM(OFFSET(Start,$A46,18):OFFSET(Start,$A46,37)),0)","v":0},{"$f":"IF(TODAY()-U$2>0,SUM(OFFSET(Start,$A46,18):OFFSET(Start,$A46,37)),0)","v":0},{"$f":"IF(TODAY()-V$2>0,SUM(OFFSET(Start,$A46,18):OFFSET(Start,$A46,37)),0)","v":0},{"$f":"IF(TODAY()-W$2>0,SUM(OFFSET(Start,$A46,18):OFFSET(Start,$A46,37)),0)","v":0},{"$f":"IF(TODAY()-X$2>0,SUM(OFFSET(Start,$A46,18):OFFSET(Start,$A46,37)),0)","v":0},{"$f":"IF(TODAY()-Y$2>0,SUM(OFFSET(Start,$A46,18):OFFSET(Start,$A46,37)),0)","v":0},{"$f":"IF(TODAY()-Z$2>0,SUM(OFFSET(Start,$A46,18):OFFSET(Start,$A46,37)),0)","v":0},{"$f":"IF(TODAY()-AA$2>0,SUM(OFFSET(Start,$A46,18):OFFSET(Start,$A46,37)),0)","v":0},{"$f":"IF(TODAY()-AB$2>0,SUM(OFFSET(Start,$A46,18):OFFSET(Start,$A46,37)),0)","v":0},{"$f":"IF(TODAY()-AC$2>0,SUM(OFFSET(Start,$A46,18):OFFSET(Start,$A46,37)),0)","v":0},{"$f":"IF(TODAY()-AD$2>0,SUM(OFFSET(Start,$A46,18):OFFSET(Start,$A46,37)),0)","v":0},{"$f":"IF(TODAY()-AE$2>0,SUM(OFFSET(Start,$A46,18):OFFSET(Start,$A46,37)),0)","v":0},{"$f":"IF(TODAY()-AF$2>0,SUM(OFFSET(Start,$A46,18):OFFSET(Start,$A46,37)),0)","v":0},{"$f":"IF(TODAY()-AG$2>0,SUM(OFFSET(Start,$A46,18):OFFSET(Start,$A46,37)),0)","v":0},{"$f":"IF(TODAY()-AH$2>0,SUM(OFFSET(Start,$A46,18):OFFSET(Start,$A46,37)),0)","v":0},{"$f":"IF(TODAY()-AI$2>0,SUM(OFFSET(Start,$A46,18):OFFSET(Start,$A46,37)),0)","v":0},{"$f":"IF(TODAY()-AJ$2>0,SUM(OFFSET(Start,$A46,18):OFFSET(Start,$A46,37)),0)","v":0},{"$f":"IF(TODAY()-AK$2>0,SUM(OFFSET(Start,$A46,18):OFFSET(Start,$A46,37)),0)","v":0},{"$f":"IF(TODAY()-AL$2>0,SUM(OFFSET(Start,$A46,18):OFFSET(Start,$A46,37)),0)","v":0},0,0,0]
[46,{"$f":"OFFSET(Start,'Mellomlagring - antall besøk'!A47,0)","v":0},{"$f":"IF(TODAY()-C$2>0,SUM(OFFSET(Start,$A47,18):OFFSET(Start,$A47,37)),0)","v":0},{"$f":"IF(TODAY()-D$2>0,SUM(OFFSET(Start,$A47,18):OFFSET(Start,$A47,37)),0)","v":0},{"$f":"IF(TODAY()-E$2>0,SUM(OFFSET(Start,$A47,18):OFFSET(Start,$A47,37)),0)","v":0},{"$f":"IF(TODAY()-F$2>0,SUM(OFFSET(Start,$A47,18):OFFSET(Start,$A47,37)),0)","v":0},{"$f":"IF(TODAY()-G$2>0,SUM(OFFSET(Start,$A47,18):OFFSET(Start,$A47,37)),0)","v":0},{"$f":"IF(TODAY()-H$2>0,SUM(OFFSET(Start,$A47,18):OFFSET(Start,$A47,37)),0)","v":0},{"$f":"IF(TODAY()-I$2>0,SUM(OFFSET(Start,$A47,18):OFFSET(Start,$A47,37)),0)","v":0},{"$f":"IF(TODAY()-J$2>0,SUM(OFFSET(Start,$A47,18):OFFSET(Start,$A47,37)),0)","v":0},{"$f":"IF(TODAY()-K$2>0,SUM(OFFSET(Start,$A47,18):OFFSET(Start,$A47,37)),0)","v":0},{"$f":"IF(TODAY()-L$2>0,SUM(OFFSET(Start,$A47,18):OFFSET(Start,$A47,37)),0)","v":0},{"$f":"IF(TODAY()-M$2>0,SUM(OFFSET(Start,$A47,18):OFFSET(Start,$A47,37)),0)","v":0},{"$f":"IF(TODAY()-N$2>0,SUM(OFFSET(Start,$A47,18):OFFSET(Start,$A47,37)),0)","v":0},{"$f":"IF(TODAY()-O$2>0,SUM(OFFSET(Start,$A47,18):OFFSET(Start,$A47,37)),0)","v":0},{"$f":"IF(TODAY()-P$2>0,SUM(OFFSET(Start,$A47,18):OFFSET(Start,$A47,37)),0)","v":0},{"$f":"IF(TODAY()-Q$2>0,SUM(OFFSET(Start,$A47,18):OFFSET(Start,$A47,37)),0)","v":0},{"$f":"IF(TODAY()-R$2>0,SUM(OFFSET(Start,$A47,18):OFFSET(Start,$A47,37)),0)","v":0},{"$f":"IF(TODAY()-S$2>0,SUM(OFFSET(Start,$A47,18):OFFSET(Start,$A47,37)),0)","v":0},{"$f":"IF(TODAY()-T$2>0,SUM(OFFSET(Start,$A47,18):OFFSET(Start,$A47,37)),0)","v":0},{"$f":"IF(TODAY()-U$2>0,SUM(OFFSET(Start,$A47,18):OFFSET(Start,$A47,37)),0)","v":0},{"$f":"IF(TODAY()-V$2>0,SUM(OFFSET(Start,$A47,18):OFFSET(Start,$A47,37)),0)","v":0},{"$f":"IF(TODAY()-W$2>0,SUM(OFFSET(Start,$A47,18):OFFSET(Start,$A47,37)),0)","v":0},{"$f":"IF(TODAY()-X$2>0,SUM(OFFSET(Start,$A47,18):OFFSET(Start,$A47,37)),0)","v":0},{"$f":"IF(TODAY()-Y$2>0,SUM(OFFSET(Start,$A47,18):OFFSET(Start,$A47,37)),0)","v":0},{"$f":"IF(TODAY()-Z$2>0,SUM(OFFSET(Start,$A47,18):OFFSET(Start,$A47,37)),0)","v":0},{"$f":"IF(TODAY()-AA$2>0,SUM(OFFSET(Start,$A47,18):OFFSET(Start,$A47,37)),0)","v":0},{"$f":"IF(TODAY()-AB$2>0,SUM(OFFSET(Start,$A47,18):OFFSET(Start,$A47,37)),0)","v":0},{"$f":"IF(TODAY()-AC$2>0,SUM(OFFSET(Start,$A47,18):OFFSET(Start,$A47,37)),0)","v":0},{"$f":"IF(TODAY()-AD$2>0,SUM(OFFSET(Start,$A47,18):OFFSET(Start,$A47,37)),0)","v":0},{"$f":"IF(TODAY()-AE$2>0,SUM(OFFSET(Start,$A47,18):OFFSET(Start,$A47,37)),0)","v":0},{"$f":"IF(TODAY()-AF$2>0,SUM(OFFSET(Start,$A47,18):OFFSET(Start,$A47,37)),0)","v":0},{"$f":"IF(TODAY()-AG$2>0,SUM(OFFSET(Start,$A47,18):OFFSET(Start,$A47,37)),0)","v":0},{"$f":"IF(TODAY()-AH$2>0,SUM(OFFSET(Start,$A47,18):OFFSET(Start,$A47,37)),0)","v":0},{"$f":"IF(TODAY()-AI$2>0,SUM(OFFSET(Start,$A47,18):OFFSET(Start,$A47,37)),0)","v":0},{"$f":"IF(TODAY()-AJ$2>0,SUM(OFFSET(Start,$A47,18):OFFSET(Start,$A47,37)),0)","v":0},{"$f":"IF(TODAY()-AK$2>0,SUM(OFFSET(Start,$A47,18):OFFSET(Start,$A47,37)),0)","v":0},{"$f":"IF(TODAY()-AL$2>0,SUM(OFFSET(Start,$A47,18):OFFSET(Start,$A47,37)),0)","v":0},0,0,0]
[47,{"$f":"OFFSET(Start,'Mellomlagring - antall besøk'!A48,0)","v":0},{"$f":"IF(TODAY()-C$2>0,SUM(OFFSET(Start,$A48,18):OFFSET(Start,$A48,37)),0)","v":0},{"$f":"IF(TODAY()-D$2>0,SUM(OFFSET(Start,$A48,18):OFFSET(Start,$A48,37)),0)","v":0},{"$f":"IF(TODAY()-E$2>0,SUM(OFFSET(Start,$A48,18):OFFSET(Start,$A48,37)),0)","v":0},{"$f":"IF(TODAY()-F$2>0,SUM(OFFSET(Start,$A48,18):OFFSET(Start,$A48,37)),0)","v":0},{"$f":"IF(TODAY()-G$2>0,SUM(OFFSET(Start,$A48,18):OFFSET(Start,$A48,37)),0)","v":0},{"$f":"IF(TODAY()-H$2>0,SUM(OFFSET(Start,$A48,18):OFFSET(Start,$A48,37)),0)","v":0},{"$f":"IF(TODAY()-I$2>0,SUM(OFFSET(Start,$A48,18):OFFSET(Start,$A48,37)),0)","v":0},{"$f":"IF(TODAY()-J$2>0,SUM(OFFSET(Start,$A48,18):OFFSET(Start,$A48,37)),0)","v":0},{"$f":"IF(TODAY()-K$2>0,SUM(OFFSET(Start,$A48,18):OFFSET(Start,$A48,37)),0)","v":0},{"$f":"IF(TODAY()-L$2>0,SUM(OFFSET(Start,$A48,18):OFFSET(Start,$A48,37)),0)","v":0},{"$f":"IF(TODAY()-M$2>0,SUM(OFFSET(Start,$A48,18):OFFSET(Start,$A48,37)),0)","v":0},{"$f":"IF(TODAY()-N$2>0,SUM(OFFSET(Start,$A48,18):OFFSET(Start,$A48,37)),0)","v":0},{"$f":"IF(TODAY()-O$2>0,SUM(OFFSET(Start,$A48,18):OFFSET(Start,$A48,37)),0)","v":0},{"$f":"IF(TODAY()-P$2>0,SUM(OFFSET(Start,$A48,18):OFFSET(Start,$A48,37)),0)","v":0},{"$f":"IF(TODAY()-Q$2>0,SUM(OFFSET(Start,$A48,18):OFFSET(Start,$A48,37)),0)","v":0},{"$f":"IF(TODAY()-R$2>0,SUM(OFFSET(Start,$A48,18):OFFSET(Start,$A48,37)),0)","v":0},{"$f":"IF(TODAY()-S$2>0,SUM(OFFSET(Start,$A48,18):OFFSET(Start,$A48,37)),0)","v":0},{"$f":"IF(TODAY()-T$2>0,SUM(OFFSET(Start,$A48,18):OFFSET(Start,$A48,37)),0)","v":0},{"$f":"IF(TODAY()-U$2>0,SUM(OFFSET(Start,$A48,18):OFFSET(Start,$A48,37)),0)","v":0},{"$f":"IF(TODAY()-V$2>0,SUM(OFFSET(Start,$A48,18):OFFSET(Start,$A48,37)),0)","v":0},{"$f":"IF(TODAY()-W$2>0,SUM(OFFSET(Start,$A48,18):OFFSET(Start,$A48,37)),0)","v":0},{"$f":"IF(TODAY()-X$2>0,SUM(OFFSET(Start,$A48,18):OFFSET(Start,$A48,37)),0)","v":0},{"$f":"IF(TODAY()-Y$2>0,SUM(OFFSET(Start,$A48,18):OFFSET(Start,$A48,37)),0)","v":0},{"$f":"IF(TODAY()-Z$2>0,SUM(OFFSET(Start,$A48,18):OFFSET(Start,$A48,37)),0)","v":0},{"$f":"IF(TODAY()-AA$2>0,SUM(OFFSET(Start,$A48,18):OFFSET(Start,$A48,37)),0)","v":0},{"$f":"IF(TODAY()-AB$2>0,SUM(OFFSET(Start,$A48,18):OFFSET(Start,$A48,37)),0)","v":0},{"$f":"IF(TODAY()-AC$2>0,SUM(OFFSET(Start,$A48,18):OFFSET(Start,$A48,37)),0)","v":0},{"$f":"IF(TODAY()-AD$2>0,SUM(OFFSET(Start,$A48,18):OFFSET(Start,$A48,37)),0)","v":0},{"$f":"IF(TODAY()-AE$2>0,SUM(OFFSET(Start,$A48,18):OFFSET(Start,$A48,37)),0)","v":0},{"$f":"IF(TODAY()-AF$2>0,SUM(OFFSET(Start,$A48,18):OFFSET(Start,$A48,37)),0)","v":0},{"$f":"IF(TODAY()-AG$2>0,SUM(OFFSET(Start,$A48,18):OFFSET(Start,$A48,37)),0)","v":0},{"$f":"IF(TODAY()-AH$2>0,SUM(OFFSET(Start,$A48,18):OFFSET(Start,$A48,37)),0)","v":0},{"$f":"IF(TODAY()-AI$2>0,SUM(OFFSET(Start,$A48,18):OFFSET(Start,$A48,37)),0)","v":0},{"$f":"IF(TODAY()-AJ$2>0,SUM(OFFSET(Start,$A48,18):OFFSET(Start,$A48,37)),0)","v":0},{"$f":"IF(TODAY()-AK$2>0,SUM(OFFSET(Start,$A48,18):OFFSET(Start,$A48,37)),0)","v":0},{"$f":"IF(TODAY()-AL$2>0,SUM(OFFSET(Start,$A48,18):OFFSET(Start,$A48,37)),0)","v":0},0,0,0]
[48,{"$f":"OFFSET(Start,'Mellomlagring - antall besøk'!A49,0)","v":0},{"$f":"IF(TODAY()-C$2>0,SUM(OFFSET(Start,$A49,18):OFFSET(Start,$A49,37)),0)","v":0},{"$f":"IF(TODAY()-D$2>0,SUM(OFFSET(Start,$A49,18):OFFSET(Start,$A49,37)),0)","v":0},{"$f":"IF(TODAY()-E$2>0,SUM(OFFSET(Start,$A49,18):OFFSET(Start,$A49,37)),0)","v":0},{"$f":"IF(TODAY()-F$2>0,SUM(OFFSET(Start,$A49,18):OFFSET(Start,$A49,37)),0)","v":0},{"$f":"IF(TODAY()-G$2>0,SUM(OFFSET(Start,$A49,18):OFFSET(Start,$A49,37)),0)","v":0},{"$f":"IF(TODAY()-H$2>0,SUM(OFFSET(Start,$A49,18):OFFSET(Start,$A49,37)),0)","v":0},{"$f":"IF(TODAY()-I$2>0,SUM(OFFSET(Start,$A49,18):OFFSET(Start,$A49,37)),0)","v":0},{"$f":"IF(TODAY()-J$2>0,SUM(OFFSET(Start,$A49,18):OFFSET(Start,$A49,37)),0)","v":0},{"$f":"IF(TODAY()-K$2>0,SUM(OFFSET(Start,$A49,18):OFFSET(Start,$A49,37)),0)","v":0},{"$f":"IF(TODAY()-L$2>0,SUM(OFFSET(Start,$A49,18):OFFSET(Start,$A49,37)),0)","v":0},{"$f":"IF(TODAY()-M$2>0,SUM(OFFSET(Start,$A49,18):OFFSET(Start,$A49,37)),0)","v":0},{"$f":"IF(TODAY()-N$2>0,SUM(OFFSET(Start,$A49,18):OFFSET(Start,$A49,37)),0)","v":0},{"$f":"IF(TODAY()-O$2>0,SUM(OFFSET(Start,$A49,18):OFFSET(Start,$A49,37)),0)","v":0},{"$f":"IF(TODAY()-P$2>0,SUM(OFFSET(Start,$A49,18):OFFSET(Start,$A49,37)),0)","v":0},{"$f":"IF(TODAY()-Q$2>0,SUM(OFFSET(Start,$A49,18):OFFSET(Start,$A49,37)),0)","v":0},{"$f":"IF(TODAY()-R$2>0,SUM(OFFSET(Start,$A49,18):OFFSET(Start,$A49,37)),0)","v":0},{"$f":"IF(TODAY()-S$2>0,SUM(OFFSET(Start,$A49,18):OFFSET(Start,$A49,37)),0)","v":0},{"$f":"IF(TODAY()-T$2>0,SUM(OFFSET(Start,$A49,18):OFFSET(Start,$A49,37)),0)","v":0},{"$f":"IF(TODAY()-U$2>0,SUM(OFFSET(Start,$A49,18):OFFSET(Start,$A49,37)),0)","v":0},{"$f":"IF(TODAY()-V$2>0,SUM(OFFSET(Start,$A49,18):OFFSET(Start,$A49,37)),0)","v":0},{"$f":"IF(TODAY()-W$2>0,SUM(OFFSET(Start,$A49,18):OFFSET(Start,$A49,37)),0)","v":0},{"$f":"IF(TODAY()-X$2>0,SUM(OFFSET(Start,$A49,18):OFFSET(Start,$A49,37)),0)","v":0},{"$f":"IF(TODAY()-Y$2>0,SUM(OFFSET(Start,$A49,18):OFFSET(Start,$A49,37)),0)","v":0},{"$f":"IF(TODAY()-Z$2>0,SUM(OFFSET(Start,$A49,18):OFFSET(Start,$A49,37)),0)","v":0},{"$f":"IF(TODAY()-AA$2>0,SUM(OFFSET(Start,$A49,18):OFFSET(Start,$A49,37)),0)","v":0},{"$f":"IF(TODAY()-AB$2>0,SUM(OFFSET(Start,$A49,18):OFFSET(Start,$A49,37)),0)","v":0},{"$f":"IF(TODAY()-AC$2>0,SUM(OFFSET(Start,$A49,18):OFFSET(Start,$A49,37)),0)","v":0},{"$f":"IF(TODAY()-AD$2>0,SUM(OFFSET(Start,$A49,18):OFFSET(Start,$A49,37)),0)","v":0},{"$f":"IF(TODAY()-AE$2>0,SUM(OFFSET(Start,$A49,18):OFFSET(Start,$A49,37)),0)","v":0},{"$f":"IF(TODAY()-AF$2>0,SUM(OFFSET(Start,$A49,18):OFFSET(Start,$A49,37)),0)","v":0},{"$f":"IF(TODAY()-AG$2>0,SUM(OFFSET(Start,$A49,18):OFFSET(Start,$A49,37)),0)","v":0},{"$f":"IF(TODAY()-AH$2>0,SUM(OFFSET(Start,$A49,18):OFFSET(Start,$A49,37)),0)","v":0},{"$f":"IF(TODAY()-AI$2>0,SUM(OFFSET(Start,$A49,18):OFFSET(Start,$A49,37)),0)","v":0},{"$f":"IF(TODAY()-AJ$2>0,SUM(OFFSET(Start,$A49,18):OFFSET(Start,$A49,37)),0)","v":0},{"$f":"IF(TODAY()-AK$2>0,SUM(OFFSET(Start,$A49,18):OFFSET(Start,$A49,37)),0)","v":0},{"$f":"IF(TODAY()-AL$2>0,SUM(OFFSET(Start,$A49,18):OFFSET(Start,$A49,37)),0)","v":0},0,0,0]
[49,{"$f":"OFFSET(Start,'Mellomlagring - antall besøk'!A50,0)","v":0},{"$f":"IF(TODAY()-C$2>0,SUM(OFFSET(Start,$A50,18):OFFSET(Start,$A50,37)),0)","v":0},{"$f":"IF(TODAY()-D$2>0,SUM(OFFSET(Start,$A50,18):OFFSET(Start,$A50,37)),0)","v":0},{"$f":"IF(TODAY()-E$2>0,SUM(OFFSET(Start,$A50,18):OFFSET(Start,$A50,37)),0)","v":0},{"$f":"IF(TODAY()-F$2>0,SUM(OFFSET(Start,$A50,18):OFFSET(Start,$A50,37)),0)","v":0},{"$f":"IF(TODAY()-G$2>0,SUM(OFFSET(Start,$A50,18):OFFSET(Start,$A50,37)),0)","v":0},{"$f":"IF(TODAY()-H$2>0,SUM(OFFSET(Start,$A50,18):OFFSET(Start,$A50,37)),0)","v":0},{"$f":"IF(TODAY()-I$2>0,SUM(OFFSET(Start,$A50,18):OFFSET(Start,$A50,37)),0)","v":0},{"$f":"IF(TODAY()-J$2>0,SUM(OFFSET(Start,$A50,18):OFFSET(Start,$A50,37)),0)","v":0},{"$f":"IF(TODAY()-K$2>0,SUM(OFFSET(Start,$A50,18):OFFSET(Start,$A50,37)),0)","v":0},{"$f":"IF(TODAY()-L$2>0,SUM(OFFSET(Start,$A50,18):OFFSET(Start,$A50,37)),0)","v":0},{"$f":"IF(TODAY()-M$2>0,SUM(OFFSET(Start,$A50,18):OFFSET(Start,$A50,37)),0)","v":0},{"$f":"IF(TODAY()-N$2>0,SUM(OFFSET(Start,$A50,18):OFFSET(Start,$A50,37)),0)","v":0},{"$f":"IF(TODAY()-O$2>0,SUM(OFFSET(Start,$A50,18):OFFSET(Start,$A50,37)),0)","v":0},{"$f":"IF(TODAY()-P$2>0,SUM(OFFSET(Start,$A50,18):OFFSET(Start,$A50,37)),0)","v":0},{"$f":"IF(TODAY()-Q$2>0,SUM(OFFSET(Start,$A50,18):OFFSET(Start,$A50,37)),0)","v":0},{"$f":"IF(TODAY()-R$2>0,SUM(OFFSET(Start,$A50,18):OFFSET(Start,$A50,37)),0)","v":0},{"$f":"IF(TODAY()-S$2>0,SUM(OFFSET(Start,$A50,18):OFFSET(Start,$A50,37)),0)","v":0},{"$f":"IF(TODAY()-T$2>0,SUM(OFFSET(Start,$A50,18):OFFSET(Start,$A50,37)),0)","v":0},{"$f":"IF(TODAY()-U$2>0,SUM(OFFSET(Start,$A50,18):OFFSET(Start,$A50,37)),0)","v":0},{"$f":"IF(TODAY()-V$2>0,SUM(OFFSET(Start,$A50,18):OFFSET(Start,$A50,37)),0)","v":0},{"$f":"IF(TODAY()-W$2>0,SUM(OFFSET(Start,$A50,18):OFFSET(Start,$A50,37)),0)","v":0},{"$f":"IF(TODAY()-X$2>0,SUM(OFFSET(Start,$A50,18):OFFSET(Start,$A50,37)),0)","v":0},{"$f":"IF(TODAY()-Y$2>0,SUM(OFFSET(Start,$A50,18):OFFSET(Start,$A50,37)),0)","v":0},{"$f":"IF(TODAY()-Z$2>0,SUM(OFFSET(Start,$A50,18):OFFSET(Start,$A50,37)),0)","v":0},{"$f":"IF(TODAY()-AA$2>0,SUM(OFFSET(Start,$A50,18):OFFSET(Start,$A50,37)),0)","v":0},{"$f":"IF(TODAY()-AB$2>0,SUM(OFFSET(Start,$A50,18):OFFSET(Start,$A50,37)),0)","v":0},{"$f":"IF(TODAY()-AC$2>0,SUM(OFFSET(Start,$A50,18):OFFSET(Start,$A50,37)),0)","v":0},{"$f":"IF(TODAY()-AD$2>0,SUM(OFFSET(Start,$A50,18):OFFSET(Start,$A50,37)),0)","v":0},{"$f":"IF(TODAY()-AE$2>0,SUM(OFFSET(Start,$A50,18):OFFSET(Start,$A50,37)),0)","v":0},{"$f":"IF(TODAY()-AF$2>0,SUM(OFFSET(Start,$A50,18):OFFSET(Start,$A50,37)),0)","v":0},{"$f":"IF(TODAY()-AG$2>0,SUM(OFFSET(Start,$A50,18):OFFSET(Start,$A50,37)),0)","v":0},{"$f":"IF(TODAY()-AH$2>0,SUM(OFFSET(Start,$A50,18):OFFSET(Start,$A50,37)),0)","v":0},{"$f":"IF(TODAY()-AI$2>0,SUM(OFFSET(Start,$A50,18):OFFSET(Start,$A50,37)),0)","v":0},{"$f":"IF(TODAY()-AJ$2>0,SUM(OFFSET(Start,$A50,18):OFFSET(Start,$A50,37)),0)","v":0},{"$f":"IF(TODAY()-AK$2>0,SUM(OFFSET(Start,$A50,18):OFFSET(Start,$A50,37)),0)","v":0},{"$f":"IF(TODAY()-AL$2>0,SUM(OFFSET(Start,$A50,18):OFFSET(Start,$A50,37)),0)","v":0},0,0,0]
[50,{"$f":"OFFSET(Start,'Mellomlagring - antall besøk'!A51,0)","v":0},{"$f":"IF(TODAY()-C$2>0,SUM(OFFSET(Start,$A51,18):OFFSET(Start,$A51,37)),0)","v":0},{"$f":"IF(TODAY()-D$2>0,SUM(OFFSET(Start,$A51,18):OFFSET(Start,$A51,37)),0)","v":0},{"$f":"IF(TODAY()-E$2>0,SUM(OFFSET(Start,$A51,18):OFFSET(Start,$A51,37)),0)","v":0},{"$f":"IF(TODAY()-F$2>0,SUM(OFFSET(Start,$A51,18):OFFSET(Start,$A51,37)),0)","v":0},{"$f":"IF(TODAY()-G$2>0,SUM(OFFSET(Start,$A51,18):OFFSET(Start,$A51,37)),0)","v":0},{"$f":"IF(TODAY()-H$2>0,SUM(OFFSET(Start,$A51,18):OFFSET(Start,$A51,37)),0)","v":0},{"$f":"IF(TODAY()-I$2>0,SUM(OFFSET(Start,$A51,18):OFFSET(Start,$A51,37)),0)","v":0},{"$f":"IF(TODAY()-J$2>0,SUM(OFFSET(Start,$A51,18):OFFSET(Start,$A51,37)),0)","v":0},{"$f":"IF(TODAY()-K$2>0,SUM(OFFSET(Start,$A51,18):OFFSET(Start,$A51,37)),0)","v":0},{"$f":"IF(TODAY()-L$2>0,SUM(OFFSET(Start,$A51,18):OFFSET(Start,$A51,37)),0)","v":0},{"$f":"IF(TODAY()-M$2>0,SUM(OFFSET(Start,$A51,18):OFFSET(Start,$A51,37)),0)","v":0},{"$f":"IF(TODAY()-N$2>0,SUM(OFFSET(Start,$A51,18):OFFSET(Start,$A51,37)),0)","v":0},{"$f":"IF(TODAY()-O$2>0,SUM(OFFSET(Start,$A51,18):OFFSET(Start,$A51,37)),0)","v":0},{"$f":"IF(TODAY()-P$2>0,SUM(OFFSET(Start,$A51,18):OFFSET(Start,$A51,37)),0)","v":0},{"$f":"IF(TODAY()-Q$2>0,SUM(OFFSET(Start,$A51,18):OFFSET(Start,$A51,37)),0)","v":0},{"$f":"IF(TODAY()-R$2>0,SUM(OFFSET(Start,$A51,18):OFFSET(Start,$A51,37)),0)","v":0},{"$f":"IF(TODAY()-S$2>0,SUM(OFFSET(Start,$A51,18):OFFSET(Start,$A51,37)),0)","v":0},{"$f":"IF(TODAY()-T$2>0,SUM(OFFSET(Start,$A51,18):OFFSET(Start,$A51,37)),0)","v":0},{"$f":"IF(TODAY()-U$2>0,SUM(OFFSET(Start,$A51,18):OFFSET(Start,$A51,37)),0)","v":0},{"$f":"IF(TODAY()-V$2>0,SUM(OFFSET(Start,$A51,18):OFFSET(Start,$A51,37)),0)","v":0},{"$f":"IF(TODAY()-W$2>0,SUM(OFFSET(Start,$A51,18):OFFSET(Start,$A51,37)),0)","v":0},{"$f":"IF(TODAY()-X$2>0,SUM(OFFSET(Start,$A51,18):OFFSET(Start,$A51,37)),0)","v":0},{"$f":"IF(TODAY()-Y$2>0,SUM(OFFSET(Start,$A51,18):OFFSET(Start,$A51,37)),0)","v":0},{"$f":"IF(TODAY()-Z$2>0,SUM(OFFSET(Start,$A51,18):OFFSET(Start,$A51,37)),0)","v":0},{"$f":"IF(TODAY()-AA$2>0,SUM(OFFSET(Start,$A51,18):OFFSET(Start,$A51,37)),0)","v":0},{"$f":"IF(TODAY()-AB$2>0,SUM(OFFSET(Start,$A51,18):OFFSET(Start,$A51,37)),0)","v":0},{"$f":"IF(TODAY()-AC$2>0,SUM(OFFSET(Start,$A51,18):OFFSET(Start,$A51,37)),0)","v":0},{"$f":"IF(TODAY()-AD$2>0,SUM(OFFSET(Start,$A51,18):OFFSET(Start,$A51,37)),0)","v":0},{"$f":"IF(TODAY()-AE$2>0,SUM(OFFSET(Start,$A51,18):OFFSET(Start,$A51,37)),0)","v":0},{"$f":"IF(TODAY()-AF$2>0,SUM(OFFSET(Start,$A51,18):OFFSET(Start,$A51,37)),0)","v":0},{"$f":"IF(TODAY()-AG$2>0,SUM(OFFSET(Start,$A51,18):OFFSET(Start,$A51,37)),0)","v":0},{"$f":"IF(TODAY()-AH$2>0,SUM(OFFSET(Start,$A51,18):OFFSET(Start,$A51,37)),0)","v":0},{"$f":"IF(TODAY()-AI$2>0,SUM(OFFSET(Start,$A51,18):OFFSET(Start,$A51,37)),0)","v":0},{"$f":"IF(TODAY()-AJ$2>0,SUM(OFFSET(Start,$A51,18):OFFSET(Start,$A51,37)),0)","v":0},{"$f":"IF(TODAY()-AK$2>0,SUM(OFFSET(Start,$A51,18):OFFSET(Start,$A51,37)),0)","v":0},{"$f":"IF(TODAY()-AL$2>0,SUM(OFFSET(Start,$A51,18):OFFSET(Start,$A51,37)),0)","v":0},0,0,0]
[51,{"$f":"OFFSET(Start,'Mellomlagring - antall besøk'!A52,0)","v":0},{"$f":"IF(TODAY()-C$2>0,SUM(OFFSET(Start,$A52,18):OFFSET(Start,$A52,37)),0)","v":0},{"$f":"IF(TODAY()-D$2>0,SUM(OFFSET(Start,$A52,18):OFFSET(Start,$A52,37)),0)","v":0},{"$f":"IF(TODAY()-E$2>0,SUM(OFFSET(Start,$A52,18):OFFSET(Start,$A52,37)),0)","v":0},{"$f":"IF(TODAY()-F$2>0,SUM(OFFSET(Start,$A52,18):OFFSET(Start,$A52,37)),0)","v":0},{"$f":"IF(TODAY()-G$2>0,SUM(OFFSET(Start,$A52,18):OFFSET(Start,$A52,37)),0)","v":0},{"$f":"IF(TODAY()-H$2>0,SUM(OFFSET(Start,$A52,18):OFFSET(Start,$A52,37)),0)","v":0},{"$f":"IF(TODAY()-I$2>0,SUM(OFFSET(Start,$A52,18):OFFSET(Start,$A52,37)),0)","v":0},{"$f":"IF(TODAY()-J$2>0,SUM(OFFSET(Start,$A52,18):OFFSET(Start,$A52,37)),0)","v":0},{"$f":"IF(TODAY()-K$2>0,SUM(OFFSET(Start,$A52,18):OFFSET(Start,$A52,37)),0)","v":0},{"$f":"IF(TODAY()-L$2>0,SUM(OFFSET(Start,$A52,18):OFFSET(Start,$A52,37)),0)","v":0},{"$f":"IF(TODAY()-M$2>0,SUM(OFFSET(Start,$A52,18):OFFSET(Start,$A52,37)),0)","v":0},{"$f":"IF(TODAY()-N$2>0,SUM(OFFSET(Start,$A52,18):OFFSET(Start,$A52,37)),0)","v":0},{"$f":"IF(TODAY()-O$2>0,SUM(OFFSET(Start,$A52,18):OFFSET(Start,$A52,37)),0)","v":0},{"$f":"IF(TODAY()-P$2>0,SUM(OFFSET(Start,$A52,18):OFFSET(Start,$A52,37)),0)","v":0},{"$f":"IF(TODAY()-Q$2>0,SUM(OFFSET(Start,$A52,18):OFFSET(Start,$A52,37)),0)","v":0},{"$f":"IF(TODAY()-R$2>0,SUM(OFFSET(Start,$A52,18):OFFSET(Start,$A52,37)),0)","v":0},{"$f":"IF(TODAY()-S$2>0,SUM(OFFSET(Start,$A52,18):OFFSET(Start,$A52,37)),0)","v":0},{"$f":"IF(TODAY()-T$2>0,SUM(OFFSET(Start,$A52,18):OFFSET(Start,$A52,37)),0)","v":0},{"$f":"IF(TODAY()-U$2>0,SUM(OFFSET(Start,$A52,18):OFFSET(Start,$A52,37)),0)","v":0},{"$f":"IF(TODAY()-V$2>0,SUM(OFFSET(Start,$A52,18):OFFSET(Start,$A52,37)),0)","v":0},{"$f":"IF(TODAY()-W$2>0,SUM(OFFSET(Start,$A52,18):OFFSET(Start,$A52,37)),0)","v":0},{"$f":"IF(TODAY()-X$2>0,SUM(OFFSET(Start,$A52,18):OFFSET(Start,$A52,37)),0)","v":0},{"$f":"IF(TODAY()-Y$2>0,SUM(OFFSET(Start,$A52,18):OFFSET(Start,$A52,37)),0)","v":0},{"$f":"IF(TODAY()-Z$2>0,SUM(OFFSET(Start,$A52,18):OFFSET(Start,$A52,37)),0)","v":0},{"$f":"IF(TODAY()-AA$2>0,SUM(OFFSET(Start,$A52,18):OFFSET(Start,$A52,37)),0)","v":0},{"$f":"IF(TODAY()-AB$2>0,SUM(OFFSET(Start,$A52,18):OFFSET(Start,$A52,37)),0)","v":0},{"$f":"IF(TODAY()-AC$2>0,SUM(OFFSET(Start,$A52,18):OFFSET(Start,$A52,37)),0)","v":0},{"$f":"IF(TODAY()-AD$2>0,SUM(OFFSET(Start,$A52,18):OFFSET(Start,$A52,37)),0)","v":0},{"$f":"IF(TODAY()-AE$2>0,SUM(OFFSET(Start,$A52,18):OFFSET(Start,$A52,37)),0)","v":0},{"$f":"IF(TODAY()-AF$2>0,SUM(OFFSET(Start,$A52,18):OFFSET(Start,$A52,37)),0)","v":0},{"$f":"IF(TODAY()-AG$2>0,SUM(OFFSET(Start,$A52,18):OFFSET(Start,$A52,37)),0)","v":0},{"$f":"IF(TODAY()-AH$2>0,SUM(OFFSET(Start,$A52,18):OFFSET(Start,$A52,37)),0)","v":0},{"$f":"IF(TODAY()-AI$2>0,SUM(OFFSET(Start,$A52,18):OFFSET(Start,$A52,37)),0)","v":0},{"$f":"IF(TODAY()-AJ$2>0,SUM(OFFSET(Start,$A52,18):OFFSET(Start,$A52,37)),0)","v":0},{"$f":"IF(TODAY()-AK$2>0,SUM(OFFSET(Start,$A52,18):OFFSET(Start,$A52,37)),0)","v":0},{"$f":"IF(TODAY()-AL$2>0,SUM(OFFSET(Start,$A52,18):OFFSET(Start,$A52,37)),0)","v":0},0,0,0]
[52,{"$f":"OFFSET(Start,'Mellomlagring - antall besøk'!A53,0)","v":0},{"$f":"IF(TODAY()-C$2>0,SUM(OFFSET(Start,$A53,18):OFFSET(Start,$A53,37)),0)","v":0},{"$f":"IF(TODAY()-D$2>0,SUM(OFFSET(Start,$A53,18):OFFSET(Start,$A53,37)),0)","v":0},{"$f":"IF(TODAY()-E$2>0,SUM(OFFSET(Start,$A53,18):OFFSET(Start,$A53,37)),0)","v":0},{"$f":"IF(TODAY()-F$2>0,SUM(OFFSET(Start,$A53,18):OFFSET(Start,$A53,37)),0)","v":0},{"$f":"IF(TODAY()-G$2>0,SUM(OFFSET(Start,$A53,18):OFFSET(Start,$A53,37)),0)","v":0},{"$f":"IF(TODAY()-H$2>0,SUM(OFFSET(Start,$A53,18):OFFSET(Start,$A53,37)),0)","v":0},{"$f":"IF(TODAY()-I$2>0,SUM(OFFSET(Start,$A53,18):OFFSET(Start,$A53,37)),0)","v":0},{"$f":"IF(TODAY()-J$2>0,SUM(OFFSET(Start,$A53,18):OFFSET(Start,$A53,37)),0)","v":0},{"$f":"IF(TODAY()-K$2>0,SUM(OFFSET(Start,$A53,18):OFFSET(Start,$A53,37)),0)","v":0},{"$f":"IF(TODAY()-L$2>0,SUM(OFFSET(Start,$A53,18):OFFSET(Start,$A53,37)),0)","v":0},{"$f":"IF(TODAY()-M$2>0,SUM(OFFSET(Start,$A53,18):OFFSET(Start,$A53,37)),0)","v":0},{"$f":"IF(TODAY()-N$2>0,SUM(OFFSET(Start,$A53,18):OFFSET(Start,$A53,37)),0)","v":0},{"$f":"IF(TODAY()-O$2>0,SUM(OFFSET(Start,$A53,18):OFFSET(Start,$A53,37)),0)","v":0},{"$f":"IF(TODAY()-P$2>0,SUM(OFFSET(Start,$A53,18):OFFSET(Start,$A53,37)),0)","v":0},{"$f":"IF(TODAY()-Q$2>0,SUM(OFFSET(Start,$A53,18):OFFSET(Start,$A53,37)),0)","v":0},{"$f":"IF(TODAY()-R$2>0,SUM(OFFSET(Start,$A53,18):OFFSET(Start,$A53,37)),0)","v":0},{"$f":"IF(TODAY()-S$2>0,SUM(OFFSET(Start,$A53,18):OFFSET(Start,$A53,37)),0)","v":0},{"$f":"IF(TODAY()-T$2>0,SUM(OFFSET(Start,$A53,18):OFFSET(Start,$A53,37)),0)","v":0},{"$f":"IF(TODAY()-U$2>0,SUM(OFFSET(Start,$A53,18):OFFSET(Start,$A53,37)),0)","v":0},{"$f":"IF(TODAY()-V$2>0,SUM(OFFSET(Start,$A53,18):OFFSET(Start,$A53,37)),0)","v":0},{"$f":"IF(TODAY()-W$2>0,SUM(OFFSET(Start,$A53,18):OFFSET(Start,$A53,37)),0)","v":0},{"$f":"IF(TODAY()-X$2>0,SUM(OFFSET(Start,$A53,18):OFFSET(Start,$A53,37)),0)","v":0},{"$f":"IF(TODAY()-Y$2>0,SUM(OFFSET(Start,$A53,18):OFFSET(Start,$A53,37)),0)","v":0},{"$f":"IF(TODAY()-Z$2>0,SUM(OFFSET(Start,$A53,18):OFFSET(Start,$A53,37)),0)","v":0},{"$f":"IF(TODAY()-AA$2>0,SUM(OFFSET(Start,$A53,18):OFFSET(Start,$A53,37)),0)","v":0},{"$f":"IF(TODAY()-AB$2>0,SUM(OFFSET(Start,$A53,18):OFFSET(Start,$A53,37)),0)","v":0},{"$f":"IF(TODAY()-AC$2>0,SUM(OFFSET(Start,$A53,18):OFFSET(Start,$A53,37)),0)","v":0},{"$f":"IF(TODAY()-AD$2>0,SUM(OFFSET(Start,$A53,18):OFFSET(Start,$A53,37)),0)","v":0},{"$f":"IF(TODAY()-AE$2>0,SUM(OFFSET(Start,$A53,18):OFFSET(Start,$A53,37)),0)","v":0},{"$f":"IF(TODAY()-AF$2>0,SUM(OFFSET(Start,$A53,18):OFFSET(Start,$A53,37)),0)","v":0},{"$f":"IF(TODAY()-AG$2>0,SUM(OFFSET(Start,$A53,18):OFFSET(Start,$A53,37)),0)","v":0},{"$f":"IF(TODAY()-AH$2>0,SUM(OFFSET(Start,$A53,18):OFFSET(Start,$A53,37)),0)","v":0},{"$f":"IF(TODAY()-AI$2>0,SUM(OFFSET(Start,$A53,18):OFFSET(Start,$A53,37)),0)","v":0},{"$f":"IF(TODAY()-AJ$2>0,SUM(OFFSET(Start,$A53,18):OFFSET(Start,$A53,37)),0)","v":0},{"$f":"IF(TODAY()-AK$2>0,SUM(OFFSET(Start,$A53,18):OFFSET(Start,$A53,37)),0)","v":0},{"$f":"IF(TODAY()-AL$2>0,SUM(OFFSET(Start,$A53,18):OFFSET(Start,$A53,37)),0)","v":0},0,0,0]
[53,{"$f":"OFFSET(Start,'Mellomlagring - antall besøk'!A54,0)","v":0},{"$f":"IF(TODAY()-C$2>0,SUM(OFFSET(Start,$A54,18):OFFSET(Start,$A54,37)),0)","v":0},{"$f":"IF(TODAY()-D$2>0,SUM(OFFSET(Start,$A54,18):OFFSET(Start,$A54,37)),0)","v":0},{"$f":"IF(TODAY()-E$2>0,SUM(OFFSET(Start,$A54,18):OFFSET(Start,$A54,37)),0)","v":0},{"$f":"IF(TODAY()-F$2>0,SUM(OFFSET(Start,$A54,18):OFFSET(Start,$A54,37)),0)","v":0},{"$f":"IF(TODAY()-G$2>0,SUM(OFFSET(Start,$A54,18):OFFSET(Start,$A54,37)),0)","v":0},{"$f":"IF(TODAY()-H$2>0,SUM(OFFSET(Start,$A54,18):OFFSET(Start,$A54,37)),0)","v":0},{"$f":"IF(TODAY()-I$2>0,SUM(OFFSET(Start,$A54,18):OFFSET(Start,$A54,37)),0)","v":0},{"$f":"IF(TODAY()-J$2>0,SUM(OFFSET(Start,$A54,18):OFFSET(Start,$A54,37)),0)","v":0},{"$f":"IF(TODAY()-K$2>0,SUM(OFFSET(Start,$A54,18):OFFSET(Start,$A54,37)),0)","v":0},{"$f":"IF(TODAY()-L$2>0,SUM(OFFSET(Start,$A54,18):OFFSET(Start,$A54,37)),0)","v":0},{"$f":"IF(TODAY()-M$2>0,SUM(OFFSET(Start,$A54,18):OFFSET(Start,$A54,37)),0)","v":0},{"$f":"IF(TODAY()-N$2>0,SUM(OFFSET(Start,$A54,18):OFFSET(Start,$A54,37)),0)","v":0},{"$f":"IF(TODAY()-O$2>0,SUM(OFFSET(Start,$A54,18):OFFSET(Start,$A54,37)),0)","v":0},{"$f":"IF(TODAY()-P$2>0,SUM(OFFSET(Start,$A54,18):OFFSET(Start,$A54,37)),0)","v":0},{"$f":"IF(TODAY()-Q$2>0,SUM(OFFSET(Start,$A54,18):OFFSET(Start,$A54,37)),0)","v":0},{"$f":"IF(TODAY()-R$2>0,SUM(OFFSET(Start,$A54,18):OFFSET(Start,$A54,37)),0)","v":0},{"$f":"IF(TODAY()-S$2>0,SUM(OFFSET(Start,$A54,18):OFFSET(Start,$A54,37)),0)","v":0},{"$f":"IF(TODAY()-T$2>0,SUM(OFFSET(Start,$A54,18):OFFSET(Start,$A54,37)),0)","v":0},{"$f":"IF(TODAY()-U$2>0,SUM(OFFSET(Start,$A54,18):OFFSET(Start,$A54,37)),0)","v":0},{"$f":"IF(TODAY()-V$2>0,SUM(OFFSET(Start,$A54,18):OFFSET(Start,$A54,37)),0)","v":0},{"$f":"IF(TODAY()-W$2>0,SUM(OFFSET(Start,$A54,18):OFFSET(Start,$A54,37)),0)","v":0},{"$f":"IF(TODAY()-X$2>0,SUM(OFFSET(Start,$A54,18):OFFSET(Start,$A54,37)),0)","v":0},{"$f":"IF(TODAY()-Y$2>0,SUM(OFFSET(Start,$A54,18):OFFSET(Start,$A54,37)),0)","v":0},{"$f":"IF(TODAY()-Z$2>0,SUM(OFFSET(Start,$A54,18):OFFSET(Start,$A54,37)),0)","v":0},{"$f":"IF(TODAY()-AA$2>0,SUM(OFFSET(Start,$A54,18):OFFSET(Start,$A54,37)),0)","v":0},{"$f":"IF(TODAY()-AB$2>0,SUM(OFFSET(Start,$A54,18):OFFSET(Start,$A54,37)),0)","v":0},{"$f":"IF(TODAY()-AC$2>0,SUM(OFFSET(Start,$A54,18):OFFSET(Start,$A54,37)),0)","v":0},{"$f":"IF(TODAY()-AD$2>0,SUM(OFFSET(Start,$A54,18):OFFSET(Start,$A54,37)),0)","v":0},{"$f":"IF(TODAY()-AE$2>0,SUM(OFFSET(Start,$A54,18):OFFSET(Start,$A54,37)),0)","v":0},{"$f":"IF(TODAY()-AF$2>0,SUM(OFFSET(Start,$A54,18):OFFSET(Start,$A54,37)),0)","v":0},{"$f":"IF(TODAY()-AG$2>0,SUM(OFFSET(Start,$A54,18):OFFSET(Start,$A54,37)),0)","v":0},{"$f":"IF(TODAY()-AH$2>0,SUM(OFFSET(Start,$A54,18):OFFSET(Start,$A54,37)),0)","v":0},{"$f":"IF(TODAY()-AI$2>0,SUM(OFFSET(Start,$A54,18):OFFSET(Start,$A54,37)),0)","v":0},{"$f":"IF(TODAY()-AJ$2>0,SUM(OFFSET(Start,$A54,18):OFFSET(Start,$A54,37)),0)","v":0},{"$f":"IF(TODAY()-AK$2>0,SUM(OFFSET(Start,$A54,18):OFFSET(Start,$A54,37)),0)","v":0},{"$f":"IF(TODAY()-AL$2>0,SUM(OFFSET(Start,$A54,18):OFFSET(Start,$A54,37)),0)","v":0},0,0,0]
[54,{"$f":"OFFSET(Start,'Mellomlagring - antall besøk'!A55,0)","v":0},{"$f":"IF(TODAY()-C$2>0,SUM(OFFSET(Start,$A55,18):OFFSET(Start,$A55,37)),0)","v":0},{"$f":"IF(TODAY()-D$2>0,SUM(OFFSET(Start,$A55,18):OFFSET(Start,$A55,37)),0)","v":0},{"$f":"IF(TODAY()-E$2>0,SUM(OFFSET(Start,$A55,18):OFFSET(Start,$A55,37)),0)","v":0},{"$f":"IF(TODAY()-F$2>0,SUM(OFFSET(Start,$A55,18):OFFSET(Start,$A55,37)),0)","v":0},{"$f":"IF(TODAY()-G$2>0,SUM(OFFSET(Start,$A55,18):OFFSET(Start,$A55,37)),0)","v":0},{"$f":"IF(TODAY()-H$2>0,SUM(OFFSET(Start,$A55,18):OFFSET(Start,$A55,37)),0)","v":0},{"$f":"IF(TODAY()-I$2>0,SUM(OFFSET(Start,$A55,18):OFFSET(Start,$A55,37)),0)","v":0},{"$f":"IF(TODAY()-J$2>0,SUM(OFFSET(Start,$A55,18):OFFSET(Start,$A55,37)),0)","v":0},{"$f":"IF(TODAY()-K$2>0,SUM(OFFSET(Start,$A55,18):OFFSET(Start,$A55,37)),0)","v":0},{"$f":"IF(TODAY()-L$2>0,SUM(OFFSET(Start,$A55,18):OFFSET(Start,$A55,37)),0)","v":0},{"$f":"IF(TODAY()-M$2>0,SUM(OFFSET(Start,$A55,18):OFFSET(Start,$A55,37)),0)","v":0},{"$f":"IF(TODAY()-N$2>0,SUM(OFFSET(Start,$A55,18):OFFSET(Start,$A55,37)),0)","v":0},{"$f":"IF(TODAY()-O$2>0,SUM(OFFSET(Start,$A55,18):OFFSET(Start,$A55,37)),0)","v":0},{"$f":"IF(TODAY()-P$2>0,SUM(OFFSET(Start,$A55,18):OFFSET(Start,$A55,37)),0)","v":0},{"$f":"IF(TODAY()-Q$2>0,SUM(OFFSET(Start,$A55,18):OFFSET(Start,$A55,37)),0)","v":0},{"$f":"IF(TODAY()-R$2>0,SUM(OFFSET(Start,$A55,18):OFFSET(Start,$A55,37)),0)","v":0},{"$f":"IF(TODAY()-S$2>0,SUM(OFFSET(Start,$A55,18):OFFSET(Start,$A55,37)),0)","v":0},{"$f":"IF(TODAY()-T$2>0,SUM(OFFSET(Start,$A55,18):OFFSET(Start,$A55,37)),0)","v":0},{"$f":"IF(TODAY()-U$2>0,SUM(OFFSET(Start,$A55,18):OFFSET(Start,$A55,37)),0)","v":0},{"$f":"IF(TODAY()-V$2>0,SUM(OFFSET(Start,$A55,18):OFFSET(Start,$A55,37)),0)","v":0},{"$f":"IF(TODAY()-W$2>0,SUM(OFFSET(Start,$A55,18):OFFSET(Start,$A55,37)),0)","v":0},{"$f":"IF(TODAY()-X$2>0,SUM(OFFSET(Start,$A55,18):OFFSET(Start,$A55,37)),0)","v":0},{"$f":"IF(TODAY()-Y$2>0,SUM(OFFSET(Start,$A55,18):OFFSET(Start,$A55,37)),0)","v":0},{"$f":"IF(TODAY()-Z$2>0,SUM(OFFSET(Start,$A55,18):OFFSET(Start,$A55,37)),0)","v":0},{"$f":"IF(TODAY()-AA$2>0,SUM(OFFSET(Start,$A55,18):OFFSET(Start,$A55,37)),0)","v":0},{"$f":"IF(TODAY()-AB$2>0,SUM(OFFSET(Start,$A55,18):OFFSET(Start,$A55,37)),0)","v":0},{"$f":"IF(TODAY()-AC$2>0,SUM(OFFSET(Start,$A55,18):OFFSET(Start,$A55,37)),0)","v":0},{"$f":"IF(TODAY()-AD$2>0,SUM(OFFSET(Start,$A55,18):OFFSET(Start,$A55,37)),0)","v":0},{"$f":"IF(TODAY()-AE$2>0,SUM(OFFSET(Start,$A55,18):OFFSET(Start,$A55,37)),0)","v":0},{"$f":"IF(TODAY()-AF$2>0,SUM(OFFSET(Start,$A55,18):OFFSET(Start,$A55,37)),0)","v":0},{"$f":"IF(TODAY()-AG$2>0,SUM(OFFSET(Start,$A55,18):OFFSET(Start,$A55,37)),0)","v":0},{"$f":"IF(TODAY()-AH$2>0,SUM(OFFSET(Start,$A55,18):OFFSET(Start,$A55,37)),0)","v":0},{"$f":"IF(TODAY()-AI$2>0,SUM(OFFSET(Start,$A55,18):OFFSET(Start,$A55,37)),0)","v":0},{"$f":"IF(TODAY()-AJ$2>0,SUM(OFFSET(Start,$A55,18):OFFSET(Start,$A55,37)),0)","v":0},{"$f":"IF(TODAY()-AK$2>0,SUM(OFFSET(Start,$A55,18):OFFSET(Start,$A55,37)),0)","v":0},{"$f":"IF(TODAY()-AL$2>0,SUM(OFFSET(Start,$A55,18):OFFSET(Start,$A55,37)),0)","v":0},0,0,0]
[55,{"$f":"OFFSET(Start,'Mellomlagring - antall besøk'!A56,0)","v":0},{"$f":"IF(TODAY()-C$2>0,SUM(OFFSET(Start,$A56,18):OFFSET(Start,$A56,37)),0)","v":0},{"$f":"IF(TODAY()-D$2>0,SUM(OFFSET(Start,$A56,18):OFFSET(Start,$A56,37)),0)","v":0},{"$f":"IF(TODAY()-E$2>0,SUM(OFFSET(Start,$A56,18):OFFSET(Start,$A56,37)),0)","v":0},{"$f":"IF(TODAY()-F$2>0,SUM(OFFSET(Start,$A56,18):OFFSET(Start,$A56,37)),0)","v":0},{"$f":"IF(TODAY()-G$2>0,SUM(OFFSET(Start,$A56,18):OFFSET(Start,$A56,37)),0)","v":0},{"$f":"IF(TODAY()-H$2>0,SUM(OFFSET(Start,$A56,18):OFFSET(Start,$A56,37)),0)","v":0},{"$f":"IF(TODAY()-I$2>0,SUM(OFFSET(Start,$A56,18):OFFSET(Start,$A56,37)),0)","v":0},{"$f":"IF(TODAY()-J$2>0,SUM(OFFSET(Start,$A56,18):OFFSET(Start,$A56,37)),0)","v":0},{"$f":"IF(TODAY()-K$2>0,SUM(OFFSET(Start,$A56,18):OFFSET(Start,$A56,37)),0)","v":0},{"$f":"IF(TODAY()-L$2>0,SUM(OFFSET(Start,$A56,18):OFFSET(Start,$A56,37)),0)","v":0},{"$f":"IF(TODAY()-M$2>0,SUM(OFFSET(Start,$A56,18):OFFSET(Start,$A56,37)),0)","v":0},{"$f":"IF(TODAY()-N$2>0,SUM(OFFSET(Start,$A56,18):OFFSET(Start,$A56,37)),0)","v":0},{"$f":"IF(TODAY()-O$2>0,SUM(OFFSET(Start,$A56,18):OFFSET(Start,$A56,37)),0)","v":0},{"$f":"IF(TODAY()-P$2>0,SUM(OFFSET(Start,$A56,18):OFFSET(Start,$A56,37)),0)","v":0},{"$f":"IF(TODAY()-Q$2>0,SUM(OFFSET(Start,$A56,18):OFFSET(Start,$A56,37)),0)","v":0},{"$f":"IF(TODAY()-R$2>0,SUM(OFFSET(Start,$A56,18):OFFSET(Start,$A56,37)),0)","v":0},{"$f":"IF(TODAY()-S$2>0,SUM(OFFSET(Start,$A56,18):OFFSET(Start,$A56,37)),0)","v":0},{"$f":"IF(TODAY()-T$2>0,SUM(OFFSET(Start,$A56,18):OFFSET(Start,$A56,37)),0)","v":0},{"$f":"IF(TODAY()-U$2>0,SUM(OFFSET(Start,$A56,18):OFFSET(Start,$A56,37)),0)","v":0},{"$f":"IF(TODAY()-V$2>0,SUM(OFFSET(Start,$A56,18):OFFSET(Start,$A56,37)),0)","v":0},{"$f":"IF(TODAY()-W$2>0,SUM(OFFSET(Start,$A56,18):OFFSET(Start,$A56,37)),0)","v":0},{"$f":"IF(TODAY()-X$2>0,SUM(OFFSET(Start,$A56,18):OFFSET(Start,$A56,37)),0)","v":0},{"$f":"IF(TODAY()-Y$2>0,SUM(OFFSET(Start,$A56,18):OFFSET(Start,$A56,37)),0)","v":0},{"$f":"IF(TODAY()-Z$2>0,SUM(OFFSET(Start,$A56,18):OFFSET(Start,$A56,37)),0)","v":0},{"$f":"IF(TODAY()-AA$2>0,SUM(OFFSET(Start,$A56,18):OFFSET(Start,$A56,37)),0)","v":0},{"$f":"IF(TODAY()-AB$2>0,SUM(OFFSET(Start,$A56,18):OFFSET(Start,$A56,37)),0)","v":0},{"$f":"IF(TODAY()-AC$2>0,SUM(OFFSET(Start,$A56,18):OFFSET(Start,$A56,37)),0)","v":0},{"$f":"IF(TODAY()-AD$2>0,SUM(OFFSET(Start,$A56,18):OFFSET(Start,$A56,37)),0)","v":0},{"$f":"IF(TODAY()-AE$2>0,SUM(OFFSET(Start,$A56,18):OFFSET(Start,$A56,37)),0)","v":0},{"$f":"IF(TODAY()-AF$2>0,SUM(OFFSET(Start,$A56,18):OFFSET(Start,$A56,37)),0)","v":0},{"$f":"IF(TODAY()-AG$2>0,SUM(OFFSET(Start,$A56,18):OFFSET(Start,$A56,37)),0)","v":0},{"$f":"IF(TODAY()-AH$2>0,SUM(OFFSET(Start,$A56,18):OFFSET(Start,$A56,37)),0)","v":0},{"$f":"IF(TODAY()-AI$2>0,SUM(OFFSET(Start,$A56,18):OFFSET(Start,$A56,37)),0)","v":0},{"$f":"IF(TODAY()-AJ$2>0,SUM(OFFSET(Start,$A56,18):OFFSET(Start,$A56,37)),0)","v":0},{"$f":"IF(TODAY()-AK$2>0,SUM(OFFSET(Start,$A56,18):OFFSET(Start,$A56,37)),0)","v":0},{"$f":"IF(TODAY()-AL$2>0,SUM(OFFSET(Start,$A56,18):OFFSET(Start,$A56,37)),0)","v":0},0,0,0]
[56,{"$f":"OFFSET(Start,'Mellomlagring - antall besøk'!A57,0)","v":0},{"$f":"IF(TODAY()-C$2>0,SUM(OFFSET(Start,$A57,18):OFFSET(Start,$A57,37)),0)","v":0},{"$f":"IF(TODAY()-D$2>0,SUM(OFFSET(Start,$A57,18):OFFSET(Start,$A57,37)),0)","v":0},{"$f":"IF(TODAY()-E$2>0,SUM(OFFSET(Start,$A57,18):OFFSET(Start,$A57,37)),0)","v":0},{"$f":"IF(TODAY()-F$2>0,SUM(OFFSET(Start,$A57,18):OFFSET(Start,$A57,37)),0)","v":0},{"$f":"IF(TODAY()-G$2>0,SUM(OFFSET(Start,$A57,18):OFFSET(Start,$A57,37)),0)","v":0},{"$f":"IF(TODAY()-H$2>0,SUM(OFFSET(Start,$A57,18):OFFSET(Start,$A57,37)),0)","v":0},{"$f":"IF(TODAY()-I$2>0,SUM(OFFSET(Start,$A57,18):OFFSET(Start,$A57,37)),0)","v":0},{"$f":"IF(TODAY()-J$2>0,SUM(OFFSET(Start,$A57,18):OFFSET(Start,$A57,37)),0)","v":0},{"$f":"IF(TODAY()-K$2>0,SUM(OFFSET(Start,$A57,18):OFFSET(Start,$A57,37)),0)","v":0},{"$f":"IF(TODAY()-L$2>0,SUM(OFFSET(Start,$A57,18):OFFSET(Start,$A57,37)),0)","v":0},{"$f":"IF(TODAY()-M$2>0,SUM(OFFSET(Start,$A57,18):OFFSET(Start,$A57,37)),0)","v":0},{"$f":"IF(TODAY()-N$2>0,SUM(OFFSET(Start,$A57,18):OFFSET(Start,$A57,37)),0)","v":0},{"$f":"IF(TODAY()-O$2>0,SUM(OFFSET(Start,$A57,18):OFFSET(Start,$A57,37)),0)","v":0},{"$f":"IF(TODAY()-P$2>0,SUM(OFFSET(Start,$A57,18):OFFSET(Start,$A57,37)),0)","v":0},{"$f":"IF(TODAY()-Q$2>0,SUM(OFFSET(Start,$A57,18):OFFSET(Start,$A57,37)),0)","v":0},{"$f":"IF(TODAY()-R$2>0,SUM(OFFSET(Start,$A57,18):OFFSET(Start,$A57,37)),0)","v":0},{"$f":"IF(TODAY()-S$2>0,SUM(OFFSET(Start,$A57,18):OFFSET(Start,$A57,37)),0)","v":0},{"$f":"IF(TODAY()-T$2>0,SUM(OFFSET(Start,$A57,18):OFFSET(Start,$A57,37)),0)","v":0},{"$f":"IF(TODAY()-U$2>0,SUM(OFFSET(Start,$A57,18):OFFSET(Start,$A57,37)),0)","v":0},{"$f":"IF(TODAY()-V$2>0,SUM(OFFSET(Start,$A57,18):OFFSET(Start,$A57,37)),0)","v":0},{"$f":"IF(TODAY()-W$2>0,SUM(OFFSET(Start,$A57,18):OFFSET(Start,$A57,37)),0)","v":0},{"$f":"IF(TODAY()-X$2>0,SUM(OFFSET(Start,$A57,18):OFFSET(Start,$A57,37)),0)","v":0},{"$f":"IF(TODAY()-Y$2>0,SUM(OFFSET(Start,$A57,18):OFFSET(Start,$A57,37)),0)","v":0},{"$f":"IF(TODAY()-Z$2>0,SUM(OFFSET(Start,$A57,18):OFFSET(Start,$A57,37)),0)","v":0},{"$f":"IF(TODAY()-AA$2>0,SUM(OFFSET(Start,$A57,18):OFFSET(Start,$A57,37)),0)","v":0},{"$f":"IF(TODAY()-AB$2>0,SUM(OFFSET(Start,$A57,18):OFFSET(Start,$A57,37)),0)","v":0},{"$f":"IF(TODAY()-AC$2>0,SUM(OFFSET(Start,$A57,18):OFFSET(Start,$A57,37)),0)","v":0},{"$f":"IF(TODAY()-AD$2>0,SUM(OFFSET(Start,$A57,18):OFFSET(Start,$A57,37)),0)","v":0},{"$f":"IF(TODAY()-AE$2>0,SUM(OFFSET(Start,$A57,18):OFFSET(Start,$A57,37)),0)","v":0},{"$f":"IF(TODAY()-AF$2>0,SUM(OFFSET(Start,$A57,18):OFFSET(Start,$A57,37)),0)","v":0},{"$f":"IF(TODAY()-AG$2>0,SUM(OFFSET(Start,$A57,18):OFFSET(Start,$A57,37)),0)","v":0},{"$f":"IF(TODAY()-AH$2>0,SUM(OFFSET(Start,$A57,18):OFFSET(Start,$A57,37)),0)","v":0},{"$f":"IF(TODAY()-AI$2>0,SUM(OFFSET(Start,$A57,18):OFFSET(Start,$A57,37)),0)","v":0},{"$f":"IF(TODAY()-AJ$2>0,SUM(OFFSET(Start,$A57,18):OFFSET(Start,$A57,37)),0)","v":0},{"$f":"IF(TODAY()-AK$2>0,SUM(OFFSET(Start,$A57,18):OFFSET(Start,$A57,37)),0)","v":0},{"$f":"IF(TODAY()-AL$2>0,SUM(OFFSET(Start,$A57,18):OFFSET(Start,$A57,37)),0)","v":0},0,0,0]
[57,{"$f":"OFFSET(Start,'Mellomlagring - antall besøk'!A58,0)","v":0},{"$f":"IF(TODAY()-C$2>0,SUM(OFFSET(Start,$A58,18):OFFSET(Start,$A58,37)),0)","v":0},{"$f":"IF(TODAY()-D$2>0,SUM(OFFSET(Start,$A58,18):OFFSET(Start,$A58,37)),0)","v":0},{"$f":"IF(TODAY()-E$2>0,SUM(OFFSET(Start,$A58,18):OFFSET(Start,$A58,37)),0)","v":0},{"$f":"IF(TODAY()-F$2>0,SUM(OFFSET(Start,$A58,18):OFFSET(Start,$A58,37)),0)","v":0},{"$f":"IF(TODAY()-G$2>0,SUM(OFFSET(Start,$A58,18):OFFSET(Start,$A58,37)),0)","v":0},{"$f":"IF(TODAY()-H$2>0,SUM(OFFSET(Start,$A58,18):OFFSET(Start,$A58,37)),0)","v":0},{"$f":"IF(TODAY()-I$2>0,SUM(OFFSET(Start,$A58,18):OFFSET(Start,$A58,37)),0)","v":0},{"$f":"IF(TODAY()-J$2>0,SUM(OFFSET(Start,$A58,18):OFFSET(Start,$A58,37)),0)","v":0},{"$f":"IF(TODAY()-K$2>0,SUM(OFFSET(Start,$A58,18):OFFSET(Start,$A58,37)),0)","v":0},{"$f":"IF(TODAY()-L$2>0,SUM(OFFSET(Start,$A58,18):OFFSET(Start,$A58,37)),0)","v":0},{"$f":"IF(TODAY()-M$2>0,SUM(OFFSET(Start,$A58,18):OFFSET(Start,$A58,37)),0)","v":0},{"$f":"IF(TODAY()-N$2>0,SUM(OFFSET(Start,$A58,18):OFFSET(Start,$A58,37)),0)","v":0},{"$f":"IF(TODAY()-O$2>0,SUM(OFFSET(Start,$A58,18):OFFSET(Start,$A58,37)),0)","v":0},{"$f":"IF(TODAY()-P$2>0,SUM(OFFSET(Start,$A58,18):OFFSET(Start,$A58,37)),0)","v":0},{"$f":"IF(TODAY()-Q$2>0,SUM(OFFSET(Start,$A58,18):OFFSET(Start,$A58,37)),0)","v":0},{"$f":"IF(TODAY()-R$2>0,SUM(OFFSET(Start,$A58,18):OFFSET(Start,$A58,37)),0)","v":0},{"$f":"IF(TODAY()-S$2>0,SUM(OFFSET(Start,$A58,18):OFFSET(Start,$A58,37)),0)","v":0},{"$f":"IF(TODAY()-T$2>0,SUM(OFFSET(Start,$A58,18):OFFSET(Start,$A58,37)),0)","v":0},{"$f":"IF(TODAY()-U$2>0,SUM(OFFSET(Start,$A58,18):OFFSET(Start,$A58,37)),0)","v":0},{"$f":"IF(TODAY()-V$2>0,SUM(OFFSET(Start,$A58,18):OFFSET(Start,$A58,37)),0)","v":0},{"$f":"IF(TODAY()-W$2>0,SUM(OFFSET(Start,$A58,18):OFFSET(Start,$A58,37)),0)","v":0},{"$f":"IF(TODAY()-X$2>0,SUM(OFFSET(Start,$A58,18):OFFSET(Start,$A58,37)),0)","v":0},{"$f":"IF(TODAY()-Y$2>0,SUM(OFFSET(Start,$A58,18):OFFSET(Start,$A58,37)),0)","v":0},{"$f":"IF(TODAY()-Z$2>0,SUM(OFFSET(Start,$A58,18):OFFSET(Start,$A58,37)),0)","v":0},{"$f":"IF(TODAY()-AA$2>0,SUM(OFFSET(Start,$A58,18):OFFSET(Start,$A58,37)),0)","v":0},{"$f":"IF(TODAY()-AB$2>0,SUM(OFFSET(Start,$A58,18):OFFSET(Start,$A58,37)),0)","v":0},{"$f":"IF(TODAY()-AC$2>0,SUM(OFFSET(Start,$A58,18):OFFSET(Start,$A58,37)),0)","v":0},{"$f":"IF(TODAY()-AD$2>0,SUM(OFFSET(Start,$A58,18):OFFSET(Start,$A58,37)),0)","v":0},{"$f":"IF(TODAY()-AE$2>0,SUM(OFFSET(Start,$A58,18):OFFSET(Start,$A58,37)),0)","v":0},{"$f":"IF(TODAY()-AF$2>0,SUM(OFFSET(Start,$A58,18):OFFSET(Start,$A58,37)),0)","v":0},{"$f":"IF(TODAY()-AG$2>0,SUM(OFFSET(Start,$A58,18):OFFSET(Start,$A58,37)),0)","v":0},{"$f":"IF(TODAY()-AH$2>0,SUM(OFFSET(Start,$A58,18):OFFSET(Start,$A58,37)),0)","v":0},{"$f":"IF(TODAY()-AI$2>0,SUM(OFFSET(Start,$A58,18):OFFSET(Start,$A58,37)),0)","v":0},{"$f":"IF(TODAY()-AJ$2>0,SUM(OFFSET(Start,$A58,18):OFFSET(Start,$A58,37)),0)","v":0},{"$f":"IF(TODAY()-AK$2>0,SUM(OFFSET(Start,$A58,18):OFFSET(Start,$A58,37)),0)","v":0},{"$f":"IF(TODAY()-AL$2>0,SUM(OFFSET(Start,$A58,18):OFFSET(Start,$A58,37)),0)","v":0},0,0,0]
[58,{"$f":"OFFSET(Start,'Mellomlagring - antall besøk'!A59,0)","v":0},{"$f":"IF(TODAY()-C$2>0,SUM(OFFSET(Start,$A59,18):OFFSET(Start,$A59,37)),0)","v":0},{"$f":"IF(TODAY()-D$2>0,SUM(OFFSET(Start,$A59,18):OFFSET(Start,$A59,37)),0)","v":0},{"$f":"IF(TODAY()-E$2>0,SUM(OFFSET(Start,$A59,18):OFFSET(Start,$A59,37)),0)","v":0},{"$f":"IF(TODAY()-F$2>0,SUM(OFFSET(Start,$A59,18):OFFSET(Start,$A59,37)),0)","v":0},{"$f":"IF(TODAY()-G$2>0,SUM(OFFSET(Start,$A59,18):OFFSET(Start,$A59,37)),0)","v":0},{"$f":"IF(TODAY()-H$2>0,SUM(OFFSET(Start,$A59,18):OFFSET(Start,$A59,37)),0)","v":0},{"$f":"IF(TODAY()-I$2>0,SUM(OFFSET(Start,$A59,18):OFFSET(Start,$A59,37)),0)","v":0},{"$f":"IF(TODAY()-J$2>0,SUM(OFFSET(Start,$A59,18):OFFSET(Start,$A59,37)),0)","v":0},{"$f":"IF(TODAY()-K$2>0,SUM(OFFSET(Start,$A59,18):OFFSET(Start,$A59,37)),0)","v":0},{"$f":"IF(TODAY()-L$2>0,SUM(OFFSET(Start,$A59,18):OFFSET(Start,$A59,37)),0)","v":0},{"$f":"IF(TODAY()-M$2>0,SUM(OFFSET(Start,$A59,18):OFFSET(Start,$A59,37)),0)","v":0},{"$f":"IF(TODAY()-N$2>0,SUM(OFFSET(Start,$A59,18):OFFSET(Start,$A59,37)),0)","v":0},{"$f":"IF(TODAY()-O$2>0,SUM(OFFSET(Start,$A59,18):OFFSET(Start,$A59,37)),0)","v":0},{"$f":"IF(TODAY()-P$2>0,SUM(OFFSET(Start,$A59,18):OFFSET(Start,$A59,37)),0)","v":0},{"$f":"IF(TODAY()-Q$2>0,SUM(OFFSET(Start,$A59,18):OFFSET(Start,$A59,37)),0)","v":0},{"$f":"IF(TODAY()-R$2>0,SUM(OFFSET(Start,$A59,18):OFFSET(Start,$A59,37)),0)","v":0},{"$f":"IF(TODAY()-S$2>0,SUM(OFFSET(Start,$A59,18):OFFSET(Start,$A59,37)),0)","v":0},{"$f":"IF(TODAY()-T$2>0,SUM(OFFSET(Start,$A59,18):OFFSET(Start,$A59,37)),0)","v":0},{"$f":"IF(TODAY()-U$2>0,SUM(OFFSET(Start,$A59,18):OFFSET(Start,$A59,37)),0)","v":0},{"$f":"IF(TODAY()-V$2>0,SUM(OFFSET(Start,$A59,18):OFFSET(Start,$A59,37)),0)","v":0},{"$f":"IF(TODAY()-W$2>0,SUM(OFFSET(Start,$A59,18):OFFSET(Start,$A59,37)),0)","v":0},{"$f":"IF(TODAY()-X$2>0,SUM(OFFSET(Start,$A59,18):OFFSET(Start,$A59,37)),0)","v":0},{"$f":"IF(TODAY()-Y$2>0,SUM(OFFSET(Start,$A59,18):OFFSET(Start,$A59,37)),0)","v":0},{"$f":"IF(TODAY()-Z$2>0,SUM(OFFSET(Start,$A59,18):OFFSET(Start,$A59,37)),0)","v":0},{"$f":"IF(TODAY()-AA$2>0,SUM(OFFSET(Start,$A59,18):OFFSET(Start,$A59,37)),0)","v":0},{"$f":"IF(TODAY()-AB$2>0,SUM(OFFSET(Start,$A59,18):OFFSET(Start,$A59,37)),0)","v":0},{"$f":"IF(TODAY()-AC$2>0,SUM(OFFSET(Start,$A59,18):OFFSET(Start,$A59,37)),0)","v":0},{"$f":"IF(TODAY()-AD$2>0,SUM(OFFSET(Start,$A59,18):OFFSET(Start,$A59,37)),0)","v":0},{"$f":"IF(TODAY()-AE$2>0,SUM(OFFSET(Start,$A59,18):OFFSET(Start,$A59,37)),0)","v":0},{"$f":"IF(TODAY()-AF$2>0,SUM(OFFSET(Start,$A59,18):OFFSET(Start,$A59,37)),0)","v":0},{"$f":"IF(TODAY()-AG$2>0,SUM(OFFSET(Start,$A59,18):OFFSET(Start,$A59,37)),0)","v":0},{"$f":"IF(TODAY()-AH$2>0,SUM(OFFSET(Start,$A59,18):OFFSET(Start,$A59,37)),0)","v":0},{"$f":"IF(TODAY()-AI$2>0,SUM(OFFSET(Start,$A59,18):OFFSET(Start,$A59,37)),0)","v":0},{"$f":"IF(TODAY()-AJ$2>0,SUM(OFFSET(Start,$A59,18):OFFSET(Start,$A59,37)),0)","v":0},{"$f":"IF(TODAY()-AK$2>0,SUM(OFFSET(Start,$A59,18):OFFSET(Start,$A59,37)),0)","v":0},{"$f":"IF(TODAY()-AL$2>0,SUM(OFFSET(Start,$A59,18):OFFSET(Start,$A59,37)),0)","v":0},0,0,0]
[59,{"$f":"OFFSET(Start,'Mellomlagring - antall besøk'!A60,0)","v":0},{"$f":"IF(TODAY()-C$2>0,SUM(OFFSET(Start,$A60,18):OFFSET(Start,$A60,37)),0)","v":0},{"$f":"IF(TODAY()-D$2>0,SUM(OFFSET(Start,$A60,18):OFFSET(Start,$A60,37)),0)","v":0},{"$f":"IF(TODAY()-E$2>0,SUM(OFFSET(Start,$A60,18):OFFSET(Start,$A60,37)),0)","v":0},{"$f":"IF(TODAY()-F$2>0,SUM(OFFSET(Start,$A60,18):OFFSET(Start,$A60,37)),0)","v":0},{"$f":"IF(TODAY()-G$2>0,SUM(OFFSET(Start,$A60,18):OFFSET(Start,$A60,37)),0)","v":0},{"$f":"IF(TODAY()-H$2>0,SUM(OFFSET(Start,$A60,18):OFFSET(Start,$A60,37)),0)","v":0},{"$f":"IF(TODAY()-I$2>0,SUM(OFFSET(Start,$A60,18):OFFSET(Start,$A60,37)),0)","v":0},{"$f":"IF(TODAY()-J$2>0,SUM(OFFSET(Start,$A60,18):OFFSET(Start,$A60,37)),0)","v":0},{"$f":"IF(TODAY()-K$2>0,SUM(OFFSET(Start,$A60,18):OFFSET(Start,$A60,37)),0)","v":0},{"$f":"IF(TODAY()-L$2>0,SUM(OFFSET(Start,$A60,18):OFFSET(Start,$A60,37)),0)","v":0},{"$f":"IF(TODAY()-M$2>0,SUM(OFFSET(Start,$A60,18):OFFSET(Start,$A60,37)),0)","v":0},{"$f":"IF(TODAY()-N$2>0,SUM(OFFSET(Start,$A60,18):OFFSET(Start,$A60,37)),0)","v":0},{"$f":"IF(TODAY()-O$2>0,SUM(OFFSET(Start,$A60,18):OFFSET(Start,$A60,37)),0)","v":0},{"$f":"IF(TODAY()-P$2>0,SUM(OFFSET(Start,$A60,18):OFFSET(Start,$A60,37)),0)","v":0},{"$f":"IF(TODAY()-Q$2>0,SUM(OFFSET(Start,$A60,18):OFFSET(Start,$A60,37)),0)","v":0},{"$f":"IF(TODAY()-R$2>0,SUM(OFFSET(Start,$A60,18):OFFSET(Start,$A60,37)),0)","v":0},{"$f":"IF(TODAY()-S$2>0,SUM(OFFSET(Start,$A60,18):OFFSET(Start,$A60,37)),0)","v":0},{"$f":"IF(TODAY()-T$2>0,SUM(OFFSET(Start,$A60,18):OFFSET(Start,$A60,37)),0)","v":0},{"$f":"IF(TODAY()-U$2>0,SUM(OFFSET(Start,$A60,18):OFFSET(Start,$A60,37)),0)","v":0},{"$f":"IF(TODAY()-V$2>0,SUM(OFFSET(Start,$A60,18):OFFSET(Start,$A60,37)),0)","v":0},{"$f":"IF(TODAY()-W$2>0,SUM(OFFSET(Start,$A60,18):OFFSET(Start,$A60,37)),0)","v":0},{"$f":"IF(TODAY()-X$2>0,SUM(OFFSET(Start,$A60,18):OFFSET(Start,$A60,37)),0)","v":0},{"$f":"IF(TODAY()-Y$2>0,SUM(OFFSET(Start,$A60,18):OFFSET(Start,$A60,37)),0)","v":0},{"$f":"IF(TODAY()-Z$2>0,SUM(OFFSET(Start,$A60,18):OFFSET(Start,$A60,37)),0)","v":0},{"$f":"IF(TODAY()-AA$2>0,SUM(OFFSET(Start,$A60,18):OFFSET(Start,$A60,37)),0)","v":0},{"$f":"IF(TODAY()-AB$2>0,SUM(OFFSET(Start,$A60,18):OFFSET(Start,$A60,37)),0)","v":0},{"$f":"IF(TODAY()-AC$2>0,SUM(OFFSET(Start,$A60,18):OFFSET(Start,$A60,37)),0)","v":0},{"$f":"IF(TODAY()-AD$2>0,SUM(OFFSET(Start,$A60,18):OFFSET(Start,$A60,37)),0)","v":0},{"$f":"IF(TODAY()-AE$2>0,SUM(OFFSET(Start,$A60,18):OFFSET(Start,$A60,37)),0)","v":0},{"$f":"IF(TODAY()-AF$2>0,SUM(OFFSET(Start,$A60,18):OFFSET(Start,$A60,37)),0)","v":0},{"$f":"IF(TODAY()-AG$2>0,SUM(OFFSET(Start,$A60,18):OFFSET(Start,$A60,37)),0)","v":0},{"$f":"IF(TODAY()-AH$2>0,SUM(OFFSET(Start,$A60,18):OFFSET(Start,$A60,37)),0)","v":0},{"$f":"IF(TODAY()-AI$2>0,SUM(OFFSET(Start,$A60,18):OFFSET(Start,$A60,37)),0)","v":0},{"$f":"IF(TODAY()-AJ$2>0,SUM(OFFSET(Start,$A60,18):OFFSET(Start,$A60,37)),0)","v":0},{"$f":"IF(TODAY()-AK$2>0,SUM(OFFSET(Start,$A60,18):OFFSET(Start,$A60,37)),0)","v":0},{"$f":"IF(TODAY()-AL$2>0,SUM(OFFSET(Start,$A60,18):OFFSET(Start,$A60,37)),0)","v":0},0,0,0]
[60,{"$f":"OFFSET(Start,'Mellomlagring - antall besøk'!A61,0)","v":0},{"$f":"IF(TODAY()-C$2>0,SUM(OFFSET(Start,$A61,18):OFFSET(Start,$A61,37)),0)","v":0},{"$f":"IF(TODAY()-D$2>0,SUM(OFFSET(Start,$A61,18):OFFSET(Start,$A61,37)),0)","v":0},{"$f":"IF(TODAY()-E$2>0,SUM(OFFSET(Start,$A61,18):OFFSET(Start,$A61,37)),0)","v":0},{"$f":"IF(TODAY()-F$2>0,SUM(OFFSET(Start,$A61,18):OFFSET(Start,$A61,37)),0)","v":0},{"$f":"IF(TODAY()-G$2>0,SUM(OFFSET(Start,$A61,18):OFFSET(Start,$A61,37)),0)","v":0},{"$f":"IF(TODAY()-H$2>0,SUM(OFFSET(Start,$A61,18):OFFSET(Start,$A61,37)),0)","v":0},{"$f":"IF(TODAY()-I$2>0,SUM(OFFSET(Start,$A61,18):OFFSET(Start,$A61,37)),0)","v":0},{"$f":"IF(TODAY()-J$2>0,SUM(OFFSET(Start,$A61,18):OFFSET(Start,$A61,37)),0)","v":0},{"$f":"IF(TODAY()-K$2>0,SUM(OFFSET(Start,$A61,18):OFFSET(Start,$A61,37)),0)","v":0},{"$f":"IF(TODAY()-L$2>0,SUM(OFFSET(Start,$A61,18):OFFSET(Start,$A61,37)),0)","v":0},{"$f":"IF(TODAY()-M$2>0,SUM(OFFSET(Start,$A61,18):OFFSET(Start,$A61,37)),0)","v":0},{"$f":"IF(TODAY()-N$2>0,SUM(OFFSET(Start,$A61,18):OFFSET(Start,$A61,37)),0)","v":0},{"$f":"IF(TODAY()-O$2>0,SUM(OFFSET(Start,$A61,18):OFFSET(Start,$A61,37)),0)","v":0},{"$f":"IF(TODAY()-P$2>0,SUM(OFFSET(Start,$A61,18):OFFSET(Start,$A61,37)),0)","v":0},{"$f":"IF(TODAY()-Q$2>0,SUM(OFFSET(Start,$A61,18):OFFSET(Start,$A61,37)),0)","v":0},{"$f":"IF(TODAY()-R$2>0,SUM(OFFSET(Start,$A61,18):OFFSET(Start,$A61,37)),0)","v":0},{"$f":"IF(TODAY()-S$2>0,SUM(OFFSET(Start,$A61,18):OFFSET(Start,$A61,37)),0)","v":0},{"$f":"IF(TODAY()-T$2>0,SUM(OFFSET(Start,$A61,18):OFFSET(Start,$A61,37)),0)","v":0},{"$f":"IF(TODAY()-U$2>0,SUM(OFFSET(Start,$A61,18):OFFSET(Start,$A61,37)),0)","v":0},{"$f":"IF(TODAY()-V$2>0,SUM(OFFSET(Start,$A61,18):OFFSET(Start,$A61,37)),0)","v":0},{"$f":"IF(TODAY()-W$2>0,SUM(OFFSET(Start,$A61,18):OFFSET(Start,$A61,37)),0)","v":0},{"$f":"IF(TODAY()-X$2>0,SUM(OFFSET(Start,$A61,18):OFFSET(Start,$A61,37)),0)","v":0},{"$f":"IF(TODAY()-Y$2>0,SUM(OFFSET(Start,$A61,18):OFFSET(Start,$A61,37)),0)","v":0},{"$f":"IF(TODAY()-Z$2>0,SUM(OFFSET(Start,$A61,18):OFFSET(Start,$A61,37)),0)","v":0},{"$f":"IF(TODAY()-AA$2>0,SUM(OFFSET(Start,$A61,18):OFFSET(Start,$A61,37)),0)","v":0},{"$f":"IF(TODAY()-AB$2>0,SUM(OFFSET(Start,$A61,18):OFFSET(Start,$A61,37)),0)","v":0},{"$f":"IF(TODAY()-AC$2>0,SUM(OFFSET(Start,$A61,18):OFFSET(Start,$A61,37)),0)","v":0},{"$f":"IF(TODAY()-AD$2>0,SUM(OFFSET(Start,$A61,18):OFFSET(Start,$A61,37)),0)","v":0},{"$f":"IF(TODAY()-AE$2>0,SUM(OFFSET(Start,$A61,18):OFFSET(Start,$A61,37)),0)","v":0},{"$f":"IF(TODAY()-AF$2>0,SUM(OFFSET(Start,$A61,18):OFFSET(Start,$A61,37)),0)","v":0},{"$f":"IF(TODAY()-AG$2>0,SUM(OFFSET(Start,$A61,18):OFFSET(Start,$A61,37)),0)","v":0},{"$f":"IF(TODAY()-AH$2>0,SUM(OFFSET(Start,$A61,18):OFFSET(Start,$A61,37)),0)","v":0},{"$f":"IF(TODAY()-AI$2>0,SUM(OFFSET(Start,$A61,18):OFFSET(Start,$A61,37)),0)","v":0},{"$f":"IF(TODAY()-AJ$2>0,SUM(OFFSET(Start,$A61,18):OFFSET(Start,$A61,37)),0)","v":0},{"$f":"IF(TODAY()-AK$2>0,SUM(OFFSET(Start,$A61,18):OFFSET(Start,$A61,37)),0)","v":0},{"$f":"IF(TODAY()-AL$2>0,SUM(OFFSET(Start,$A61,18):OFFSET(Start,$A61,37)),0)","v":0},0,0,0]
[61,{"$f":"OFFSET(Start,'Mellomlagring - antall besøk'!A62,0)","v":0},{"$f":"IF(TODAY()-C$2>0,SUM(OFFSET(Start,$A62,18):OFFSET(Start,$A62,37)),0)","v":0},{"$f":"IF(TODAY()-D$2>0,SUM(OFFSET(Start,$A62,18):OFFSET(Start,$A62,37)),0)","v":0},{"$f":"IF(TODAY()-E$2>0,SUM(OFFSET(Start,$A62,18):OFFSET(Start,$A62,37)),0)","v":0},{"$f":"IF(TODAY()-F$2>0,SUM(OFFSET(Start,$A62,18):OFFSET(Start,$A62,37)),0)","v":0},{"$f":"IF(TODAY()-G$2>0,SUM(OFFSET(Start,$A62,18):OFFSET(Start,$A62,37)),0)","v":0},{"$f":"IF(TODAY()-H$2>0,SUM(OFFSET(Start,$A62,18):OFFSET(Start,$A62,37)),0)","v":0},{"$f":"IF(TODAY()-I$2>0,SUM(OFFSET(Start,$A62,18):OFFSET(Start,$A62,37)),0)","v":0},{"$f":"IF(TODAY()-J$2>0,SUM(OFFSET(Start,$A62,18):OFFSET(Start,$A62,37)),0)","v":0},{"$f":"IF(TODAY()-K$2>0,SUM(OFFSET(Start,$A62,18):OFFSET(Start,$A62,37)),0)","v":0},{"$f":"IF(TODAY()-L$2>0,SUM(OFFSET(Start,$A62,18):OFFSET(Start,$A62,37)),0)","v":0},{"$f":"IF(TODAY()-M$2>0,SUM(OFFSET(Start,$A62,18):OFFSET(Start,$A62,37)),0)","v":0},{"$f":"IF(TODAY()-N$2>0,SUM(OFFSET(Start,$A62,18):OFFSET(Start,$A62,37)),0)","v":0},{"$f":"IF(TODAY()-O$2>0,SUM(OFFSET(Start,$A62,18):OFFSET(Start,$A62,37)),0)","v":0},{"$f":"IF(TODAY()-P$2>0,SUM(OFFSET(Start,$A62,18):OFFSET(Start,$A62,37)),0)","v":0},{"$f":"IF(TODAY()-Q$2>0,SUM(OFFSET(Start,$A62,18):OFFSET(Start,$A62,37)),0)","v":0},{"$f":"IF(TODAY()-R$2>0,SUM(OFFSET(Start,$A62,18):OFFSET(Start,$A62,37)),0)","v":0},{"$f":"IF(TODAY()-S$2>0,SUM(OFFSET(Start,$A62,18):OFFSET(Start,$A62,37)),0)","v":0},{"$f":"IF(TODAY()-T$2>0,SUM(OFFSET(Start,$A62,18):OFFSET(Start,$A62,37)),0)","v":0},{"$f":"IF(TODAY()-U$2>0,SUM(OFFSET(Start,$A62,18):OFFSET(Start,$A62,37)),0)","v":0},{"$f":"IF(TODAY()-V$2>0,SUM(OFFSET(Start,$A62,18):OFFSET(Start,$A62,37)),0)","v":0},{"$f":"IF(TODAY()-W$2>0,SUM(OFFSET(Start,$A62,18):OFFSET(Start,$A62,37)),0)","v":0},{"$f":"IF(TODAY()-X$2>0,SUM(OFFSET(Start,$A62,18):OFFSET(Start,$A62,37)),0)","v":0},{"$f":"IF(TODAY()-Y$2>0,SUM(OFFSET(Start,$A62,18):OFFSET(Start,$A62,37)),0)","v":0},{"$f":"IF(TODAY()-Z$2>0,SUM(OFFSET(Start,$A62,18):OFFSET(Start,$A62,37)),0)","v":0},{"$f":"IF(TODAY()-AA$2>0,SUM(OFFSET(Start,$A62,18):OFFSET(Start,$A62,37)),0)","v":0},{"$f":"IF(TODAY()-AB$2>0,SUM(OFFSET(Start,$A62,18):OFFSET(Start,$A62,37)),0)","v":0},{"$f":"IF(TODAY()-AC$2>0,SUM(OFFSET(Start,$A62,18):OFFSET(Start,$A62,37)),0)","v":0},{"$f":"IF(TODAY()-AD$2>0,SUM(OFFSET(Start,$A62,18):OFFSET(Start,$A62,37)),0)","v":0},{"$f":"IF(TODAY()-AE$2>0,SUM(OFFSET(Start,$A62,18):OFFSET(Start,$A62,37)),0)","v":0},{"$f":"IF(TODAY()-AF$2>0,SUM(OFFSET(Start,$A62,18):OFFSET(Start,$A62,37)),0)","v":0},{"$f":"IF(TODAY()-AG$2>0,SUM(OFFSET(Start,$A62,18):OFFSET(Start,$A62,37)),0)","v":0},{"$f":"IF(TODAY()-AH$2>0,SUM(OFFSET(Start,$A62,18):OFFSET(Start,$A62,37)),0)","v":0},{"$f":"IF(TODAY()-AI$2>0,SUM(OFFSET(Start,$A62,18):OFFSET(Start,$A62,37)),0)","v":0},{"$f":"IF(TODAY()-AJ$2>0,SUM(OFFSET(Start,$A62,18):OFFSET(Start,$A62,37)),0)","v":0},{"$f":"IF(TODAY()-AK$2>0,SUM(OFFSET(Start,$A62,18):OFFSET(Start,$A62,37)),0)","v":0},{"$f":"IF(TODAY()-AL$2>0,SUM(OFFSET(Start,$A62,18):OFFSET(Start,$A62,37)),0)","v":0},0,0,0]
[62,{"$f":"OFFSET(Start,'Mellomlagring - antall besøk'!A63,0)","v":0},{"$f":"IF(TODAY()-C$2>0,SUM(OFFSET(Start,$A63,18):OFFSET(Start,$A63,37)),0)","v":0},{"$f":"IF(TODAY()-D$2>0,SUM(OFFSET(Start,$A63,18):OFFSET(Start,$A63,37)),0)","v":0},{"$f":"IF(TODAY()-E$2>0,SUM(OFFSET(Start,$A63,18):OFFSET(Start,$A63,37)),0)","v":0},{"$f":"IF(TODAY()-F$2>0,SUM(OFFSET(Start,$A63,18):OFFSET(Start,$A63,37)),0)","v":0},{"$f":"IF(TODAY()-G$2>0,SUM(OFFSET(Start,$A63,18):OFFSET(Start,$A63,37)),0)","v":0},{"$f":"IF(TODAY()-H$2>0,SUM(OFFSET(Start,$A63,18):OFFSET(Start,$A63,37)),0)","v":0},{"$f":"IF(TODAY()-I$2>0,SUM(OFFSET(Start,$A63,18):OFFSET(Start,$A63,37)),0)","v":0},{"$f":"IF(TODAY()-J$2>0,SUM(OFFSET(Start,$A63,18):OFFSET(Start,$A63,37)),0)","v":0},{"$f":"IF(TODAY()-K$2>0,SUM(OFFSET(Start,$A63,18):OFFSET(Start,$A63,37)),0)","v":0},{"$f":"IF(TODAY()-L$2>0,SUM(OFFSET(Start,$A63,18):OFFSET(Start,$A63,37)),0)","v":0},{"$f":"IF(TODAY()-M$2>0,SUM(OFFSET(Start,$A63,18):OFFSET(Start,$A63,37)),0)","v":0},{"$f":"IF(TODAY()-N$2>0,SUM(OFFSET(Start,$A63,18):OFFSET(Start,$A63,37)),0)","v":0},{"$f":"IF(TODAY()-O$2>0,SUM(OFFSET(Start,$A63,18):OFFSET(Start,$A63,37)),0)","v":0},{"$f":"IF(TODAY()-P$2>0,SUM(OFFSET(Start,$A63,18):OFFSET(Start,$A63,37)),0)","v":0},{"$f":"IF(TODAY()-Q$2>0,SUM(OFFSET(Start,$A63,18):OFFSET(Start,$A63,37)),0)","v":0},{"$f":"IF(TODAY()-R$2>0,SUM(OFFSET(Start,$A63,18):OFFSET(Start,$A63,37)),0)","v":0},{"$f":"IF(TODAY()-S$2>0,SUM(OFFSET(Start,$A63,18):OFFSET(Start,$A63,37)),0)","v":0},{"$f":"IF(TODAY()-T$2>0,SUM(OFFSET(Start,$A63,18):OFFSET(Start,$A63,37)),0)","v":0},{"$f":"IF(TODAY()-U$2>0,SUM(OFFSET(Start,$A63,18):OFFSET(Start,$A63,37)),0)","v":0},{"$f":"IF(TODAY()-V$2>0,SUM(OFFSET(Start,$A63,18):OFFSET(Start,$A63,37)),0)","v":0},{"$f":"IF(TODAY()-W$2>0,SUM(OFFSET(Start,$A63,18):OFFSET(Start,$A63,37)),0)","v":0},{"$f":"IF(TODAY()-X$2>0,SUM(OFFSET(Start,$A63,18):OFFSET(Start,$A63,37)),0)","v":0},{"$f":"IF(TODAY()-Y$2>0,SUM(OFFSET(Start,$A63,18):OFFSET(Start,$A63,37)),0)","v":0},{"$f":"IF(TODAY()-Z$2>0,SUM(OFFSET(Start,$A63,18):OFFSET(Start,$A63,37)),0)","v":0},{"$f":"IF(TODAY()-AA$2>0,SUM(OFFSET(Start,$A63,18):OFFSET(Start,$A63,37)),0)","v":0},{"$f":"IF(TODAY()-AB$2>0,SUM(OFFSET(Start,$A63,18):OFFSET(Start,$A63,37)),0)","v":0},{"$f":"IF(TODAY()-AC$2>0,SUM(OFFSET(Start,$A63,18):OFFSET(Start,$A63,37)),0)","v":0},{"$f":"IF(TODAY()-AD$2>0,SUM(OFFSET(Start,$A63,18):OFFSET(Start,$A63,37)),0)","v":0},{"$f":"IF(TODAY()-AE$2>0,SUM(OFFSET(Start,$A63,18):OFFSET(Start,$A63,37)),0)","v":0},{"$f":"IF(TODAY()-AF$2>0,SUM(OFFSET(Start,$A63,18):OFFSET(Start,$A63,37)),0)","v":0},{"$f":"IF(TODAY()-AG$2>0,SUM(OFFSET(Start,$A63,18):OFFSET(Start,$A63,37)),0)","v":0},{"$f":"IF(TODAY()-AH$2>0,SUM(OFFSET(Start,$A63,18):OFFSET(Start,$A63,37)),0)","v":0},{"$f":"IF(TODAY()-AI$2>0,SUM(OFFSET(Start,$A63,18):OFFSET(Start,$A63,37)),0)","v":0},{"$f":"IF(TODAY()-AJ$2>0,SUM(OFFSET(Start,$A63,18):OFFSET(Start,$A63,37)),0)","v":0},{"$f":"IF(TODAY()-AK$2>0,SUM(OFFSET(Start,$A63,18):OFFSET(Start,$A63,37)),0)","v":0},{"$f":"IF(TODAY()-AL$2>0,SUM(OFFSET(Start,$A63,18):OFFSET(Start,$A63,37)),0)","v":0},0,0,0]
[63,{"$f":"OFFSET(Start,'Mellomlagring - antall besøk'!A64,0)","v":0},{"$f":"IF(TODAY()-C$2>0,SUM(OFFSET(Start,$A64,18):OFFSET(Start,$A64,37)),0)","v":0},{"$f":"IF(TODAY()-D$2>0,SUM(OFFSET(Start,$A64,18):OFFSET(Start,$A64,37)),0)","v":0},{"$f":"IF(TODAY()-E$2>0,SUM(OFFSET(Start,$A64,18):OFFSET(Start,$A64,37)),0)","v":0},{"$f":"IF(TODAY()-F$2>0,SUM(OFFSET(Start,$A64,18):OFFSET(Start,$A64,37)),0)","v":0},{"$f":"IF(TODAY()-G$2>0,SUM(OFFSET(Start,$A64,18):OFFSET(Start,$A64,37)),0)","v":0},{"$f":"IF(TODAY()-H$2>0,SUM(OFFSET(Start,$A64,18):OFFSET(Start,$A64,37)),0)","v":0},{"$f":"IF(TODAY()-I$2>0,SUM(OFFSET(Start,$A64,18):OFFSET(Start,$A64,37)),0)","v":0},{"$f":"IF(TODAY()-J$2>0,SUM(OFFSET(Start,$A64,18):OFFSET(Start,$A64,37)),0)","v":0},{"$f":"IF(TODAY()-K$2>0,SUM(OFFSET(Start,$A64,18):OFFSET(Start,$A64,37)),0)","v":0},{"$f":"IF(TODAY()-L$2>0,SUM(OFFSET(Start,$A64,18):OFFSET(Start,$A64,37)),0)","v":0},{"$f":"IF(TODAY()-M$2>0,SUM(OFFSET(Start,$A64,18):OFFSET(Start,$A64,37)),0)","v":0},{"$f":"IF(TODAY()-N$2>0,SUM(OFFSET(Start,$A64,18):OFFSET(Start,$A64,37)),0)","v":0},{"$f":"IF(TODAY()-O$2>0,SUM(OFFSET(Start,$A64,18):OFFSET(Start,$A64,37)),0)","v":0},{"$f":"IF(TODAY()-P$2>0,SUM(OFFSET(Start,$A64,18):OFFSET(Start,$A64,37)),0)","v":0},{"$f":"IF(TODAY()-Q$2>0,SUM(OFFSET(Start,$A64,18):OFFSET(Start,$A64,37)),0)","v":0},{"$f":"IF(TODAY()-R$2>0,SUM(OFFSET(Start,$A64,18):OFFSET(Start,$A64,37)),0)","v":0},{"$f":"IF(TODAY()-S$2>0,SUM(OFFSET(Start,$A64,18):OFFSET(Start,$A64,37)),0)","v":0},{"$f":"IF(TODAY()-T$2>0,SUM(OFFSET(Start,$A64,18):OFFSET(Start,$A64,37)),0)","v":0},{"$f":"IF(TODAY()-U$2>0,SUM(OFFSET(Start,$A64,18):OFFSET(Start,$A64,37)),0)","v":0},{"$f":"IF(TODAY()-V$2>0,SUM(OFFSET(Start,$A64,18):OFFSET(Start,$A64,37)),0)","v":0},{"$f":"IF(TODAY()-W$2>0,SUM(OFFSET(Start,$A64,18):OFFSET(Start,$A64,37)),0)","v":0},{"$f":"IF(TODAY()-X$2>0,SUM(OFFSET(Start,$A64,18):OFFSET(Start,$A64,37)),0)","v":0},{"$f":"IF(TODAY()-Y$2>0,SUM(OFFSET(Start,$A64,18):OFFSET(Start,$A64,37)),0)","v":0},{"$f":"IF(TODAY()-Z$2>0,SUM(OFFSET(Start,$A64,18):OFFSET(Start,$A64,37)),0)","v":0},{"$f":"IF(TODAY()-AA$2>0,SUM(OFFSET(Start,$A64,18):OFFSET(Start,$A64,37)),0)","v":0},{"$f":"IF(TODAY()-AB$2>0,SUM(OFFSET(Start,$A64,18):OFFSET(Start,$A64,37)),0)","v":0},{"$f":"IF(TODAY()-AC$2>0,SUM(OFFSET(Start,$A64,18):OFFSET(Start,$A64,37)),0)","v":0},{"$f":"IF(TODAY()-AD$2>0,SUM(OFFSET(Start,$A64,18):OFFSET(Start,$A64,37)),0)","v":0},{"$f":"IF(TODAY()-AE$2>0,SUM(OFFSET(Start,$A64,18):OFFSET(Start,$A64,37)),0)","v":0},{"$f":"IF(TODAY()-AF$2>0,SUM(OFFSET(Start,$A64,18):OFFSET(Start,$A64,37)),0)","v":0},{"$f":"IF(TODAY()-AG$2>0,SUM(OFFSET(Start,$A64,18):OFFSET(Start,$A64,37)),0)","v":0},{"$f":"IF(TODAY()-AH$2>0,SUM(OFFSET(Start,$A64,18):OFFSET(Start,$A64,37)),0)","v":0},{"$f":"IF(TODAY()-AI$2>0,SUM(OFFSET(Start,$A64,18):OFFSET(Start,$A64,37)),0)","v":0},{"$f":"IF(TODAY()-AJ$2>0,SUM(OFFSET(Start,$A64,18):OFFSET(Start,$A64,37)),0)","v":0},{"$f":"IF(TODAY()-AK$2>0,SUM(OFFSET(Start,$A64,18):OFFSET(Start,$A64,37)),0)","v":0},{"$f":"IF(TODAY()-AL$2>0,SUM(OFFSET(Start,$A64,18):OFFSET(Start,$A64,37)),0)","v":0},0,0,0]
[64,{"$f":"OFFSET(Start,'Mellomlagring - antall besøk'!A65,0)","v":0},{"$f":"IF(TODAY()-C$2>0,SUM(OFFSET(Start,$A65,18):OFFSET(Start,$A65,37)),0)","v":0},{"$f":"IF(TODAY()-D$2>0,SUM(OFFSET(Start,$A65,18):OFFSET(Start,$A65,37)),0)","v":0},{"$f":"IF(TODAY()-E$2>0,SUM(OFFSET(Start,$A65,18):OFFSET(Start,$A65,37)),0)","v":0},{"$f":"IF(TODAY()-F$2>0,SUM(OFFSET(Start,$A65,18):OFFSET(Start,$A65,37)),0)","v":0},{"$f":"IF(TODAY()-G$2>0,SUM(OFFSET(Start,$A65,18):OFFSET(Start,$A65,37)),0)","v":0},{"$f":"IF(TODAY()-H$2>0,SUM(OFFSET(Start,$A65,18):OFFSET(Start,$A65,37)),0)","v":0},{"$f":"IF(TODAY()-I$2>0,SUM(OFFSET(Start,$A65,18):OFFSET(Start,$A65,37)),0)","v":0},{"$f":"IF(TODAY()-J$2>0,SUM(OFFSET(Start,$A65,18):OFFSET(Start,$A65,37)),0)","v":0},{"$f":"IF(TODAY()-K$2>0,SUM(OFFSET(Start,$A65,18):OFFSET(Start,$A65,37)),0)","v":0},{"$f":"IF(TODAY()-L$2>0,SUM(OFFSET(Start,$A65,18):OFFSET(Start,$A65,37)),0)","v":0},{"$f":"IF(TODAY()-M$2>0,SUM(OFFSET(Start,$A65,18):OFFSET(Start,$A65,37)),0)","v":0},{"$f":"IF(TODAY()-N$2>0,SUM(OFFSET(Start,$A65,18):OFFSET(Start,$A65,37)),0)","v":0},{"$f":"IF(TODAY()-O$2>0,SUM(OFFSET(Start,$A65,18):OFFSET(Start,$A65,37)),0)","v":0},{"$f":"IF(TODAY()-P$2>0,SUM(OFFSET(Start,$A65,18):OFFSET(Start,$A65,37)),0)","v":0},{"$f":"IF(TODAY()-Q$2>0,SUM(OFFSET(Start,$A65,18):OFFSET(Start,$A65,37)),0)","v":0},{"$f":"IF(TODAY()-R$2>0,SUM(OFFSET(Start,$A65,18):OFFSET(Start,$A65,37)),0)","v":0},{"$f":"IF(TODAY()-S$2>0,SUM(OFFSET(Start,$A65,18):OFFSET(Start,$A65,37)),0)","v":0},{"$f":"IF(TODAY()-T$2>0,SUM(OFFSET(Start,$A65,18):OFFSET(Start,$A65,37)),0)","v":0},{"$f":"IF(TODAY()-U$2>0,SUM(OFFSET(Start,$A65,18):OFFSET(Start,$A65,37)),0)","v":0},{"$f":"IF(TODAY()-V$2>0,SUM(OFFSET(Start,$A65,18):OFFSET(Start,$A65,37)),0)","v":0},{"$f":"IF(TODAY()-W$2>0,SUM(OFFSET(Start,$A65,18):OFFSET(Start,$A65,37)),0)","v":0},{"$f":"IF(TODAY()-X$2>0,SUM(OFFSET(Start,$A65,18):OFFSET(Start,$A65,37)),0)","v":0},{"$f":"IF(TODAY()-Y$2>0,SUM(OFFSET(Start,$A65,18):OFFSET(Start,$A65,37)),0)","v":0},{"$f":"IF(TODAY()-Z$2>0,SUM(OFFSET(Start,$A65,18):OFFSET(Start,$A65,37)),0)","v":0},{"$f":"IF(TODAY()-AA$2>0,SUM(OFFSET(Start,$A65,18):OFFSET(Start,$A65,37)),0)","v":0},{"$f":"IF(TODAY()-AB$2>0,SUM(OFFSET(Start,$A65,18):OFFSET(Start,$A65,37)),0)","v":0},{"$f":"IF(TODAY()-AC$2>0,SUM(OFFSET(Start,$A65,18):OFFSET(Start,$A65,37)),0)","v":0},{"$f":"IF(TODAY()-AD$2>0,SUM(OFFSET(Start,$A65,18):OFFSET(Start,$A65,37)),0)","v":0},{"$f":"IF(TODAY()-AE$2>0,SUM(OFFSET(Start,$A65,18):OFFSET(Start,$A65,37)),0)","v":0},{"$f":"IF(TODAY()-AF$2>0,SUM(OFFSET(Start,$A65,18):OFFSET(Start,$A65,37)),0)","v":0},{"$f":"IF(TODAY()-AG$2>0,SUM(OFFSET(Start,$A65,18):OFFSET(Start,$A65,37)),0)","v":0},{"$f":"IF(TODAY()-AH$2>0,SUM(OFFSET(Start,$A65,18):OFFSET(Start,$A65,37)),0)","v":0},{"$f":"IF(TODAY()-AI$2>0,SUM(OFFSET(Start,$A65,18):OFFSET(Start,$A65,37)),0)","v":0},{"$f":"IF(TODAY()-AJ$2>0,SUM(OFFSET(Start,$A65,18):OFFSET(Start,$A65,37)),0)","v":0},{"$f":"IF(TODAY()-AK$2>0,SUM(OFFSET(Start,$A65,18):OFFSET(Start,$A65,37)),0)","v":0},{"$f":"IF(TODAY()-AL$2>0,SUM(OFFSET(Start,$A65,18):OFFSET(Start,$A65,37)),0)","v":0},0,0,0]
[65,{"$f":"OFFSET(Start,'Mellomlagring - antall besøk'!A66,0)","v":0},{"$f":"IF(TODAY()-C$2>0,SUM(OFFSET(Start,$A66,18):OFFSET(Start,$A66,37)),0)","v":0},{"$f":"IF(TODAY()-D$2>0,SUM(OFFSET(Start,$A66,18):OFFSET(Start,$A66,37)),0)","v":0},{"$f":"IF(TODAY()-E$2>0,SUM(OFFSET(Start,$A66,18):OFFSET(Start,$A66,37)),0)","v":0},{"$f":"IF(TODAY()-F$2>0,SUM(OFFSET(Start,$A66,18):OFFSET(Start,$A66,37)),0)","v":0},{"$f":"IF(TODAY()-G$2>0,SUM(OFFSET(Start,$A66,18):OFFSET(Start,$A66,37)),0)","v":0},{"$f":"IF(TODAY()-H$2>0,SUM(OFFSET(Start,$A66,18):OFFSET(Start,$A66,37)),0)","v":0},{"$f":"IF(TODAY()-I$2>0,SUM(OFFSET(Start,$A66,18):OFFSET(Start,$A66,37)),0)","v":0},{"$f":"IF(TODAY()-J$2>0,SUM(OFFSET(Start,$A66,18):OFFSET(Start,$A66,37)),0)","v":0},{"$f":"IF(TODAY()-K$2>0,SUM(OFFSET(Start,$A66,18):OFFSET(Start,$A66,37)),0)","v":0},{"$f":"IF(TODAY()-L$2>0,SUM(OFFSET(Start,$A66,18):OFFSET(Start,$A66,37)),0)","v":0},{"$f":"IF(TODAY()-M$2>0,SUM(OFFSET(Start,$A66,18):OFFSET(Start,$A66,37)),0)","v":0},{"$f":"IF(TODAY()-N$2>0,SUM(OFFSET(Start,$A66,18):OFFSET(Start,$A66,37)),0)","v":0},{"$f":"IF(TODAY()-O$2>0,SUM(OFFSET(Start,$A66,18):OFFSET(Start,$A66,37)),0)","v":0},{"$f":"IF(TODAY()-P$2>0,SUM(OFFSET(Start,$A66,18):OFFSET(Start,$A66,37)),0)","v":0},{"$f":"IF(TODAY()-Q$2>0,SUM(OFFSET(Start,$A66,18):OFFSET(Start,$A66,37)),0)","v":0},{"$f":"IF(TODAY()-R$2>0,SUM(OFFSET(Start,$A66,18):OFFSET(Start,$A66,37)),0)","v":0},{"$f":"IF(TODAY()-S$2>0,SUM(OFFSET(Start,$A66,18):OFFSET(Start,$A66,37)),0)","v":0},{"$f":"IF(TODAY()-T$2>0,SUM(OFFSET(Start,$A66,18):OFFSET(Start,$A66,37)),0)","v":0},{"$f":"IF(TODAY()-U$2>0,SUM(OFFSET(Start,$A66,18):OFFSET(Start,$A66,37)),0)","v":0},{"$f":"IF(TODAY()-V$2>0,SUM(OFFSET(Start,$A66,18):OFFSET(Start,$A66,37)),0)","v":0},{"$f":"IF(TODAY()-W$2>0,SUM(OFFSET(Start,$A66,18):OFFSET(Start,$A66,37)),0)","v":0},{"$f":"IF(TODAY()-X$2>0,SUM(OFFSET(Start,$A66,18):OFFSET(Start,$A66,37)),0)","v":0},{"$f":"IF(TODAY()-Y$2>0,SUM(OFFSET(Start,$A66,18):OFFSET(Start,$A66,37)),0)","v":0},{"$f":"IF(TODAY()-Z$2>0,SUM(OFFSET(Start,$A66,18):OFFSET(Start,$A66,37)),0)","v":0},{"$f":"IF(TODAY()-AA$2>0,SUM(OFFSET(Start,$A66,18):OFFSET(Start,$A66,37)),0)","v":0},{"$f":"IF(TODAY()-AB$2>0,SUM(OFFSET(Start,$A66,18):OFFSET(Start,$A66,37)),0)","v":0},{"$f":"IF(TODAY()-AC$2>0,SUM(OFFSET(Start,$A66,18):OFFSET(Start,$A66,37)),0)","v":0},{"$f":"IF(TODAY()-AD$2>0,SUM(OFFSET(Start,$A66,18):OFFSET(Start,$A66,37)),0)","v":0},{"$f":"IF(TODAY()-AE$2>0,SUM(OFFSET(Start,$A66,18):OFFSET(Start,$A66,37)),0)","v":0},{"$f":"IF(TODAY()-AF$2>0,SUM(OFFSET(Start,$A66,18):OFFSET(Start,$A66,37)),0)","v":0},{"$f":"IF(TODAY()-AG$2>0,SUM(OFFSET(Start,$A66,18):OFFSET(Start,$A66,37)),0)","v":0},{"$f":"IF(TODAY()-AH$2>0,SUM(OFFSET(Start,$A66,18):OFFSET(Start,$A66,37)),0)","v":0},{"$f":"IF(TODAY()-AI$2>0,SUM(OFFSET(Start,$A66,18):OFFSET(Start,$A66,37)),0)","v":0},{"$f":"IF(TODAY()-AJ$2>0,SUM(OFFSET(Start,$A66,18):OFFSET(Start,$A66,37)),0)","v":0},{"$f":"IF(TODAY()-AK$2>0,SUM(OFFSET(Start,$A66,18):OFFSET(Start,$A66,37)),0)","v":0},{"$f":"IF(TODAY()-AL$2>0,SUM(OFFSET(Start,$A66,18):OFFSET(Start,$A66,37)),0)","v":0},0,0,0]
[66,{"$f":"OFFSET(Start,'Mellomlagring - antall besøk'!A67,0)","v":0},{"$f":"IF(TODAY()-C$2>0,SUM(OFFSET(Start,$A67,18):OFFSET(Start,$A67,37)),0)","v":0},{"$f":"IF(TODAY()-D$2>0,SUM(OFFSET(Start,$A67,18):OFFSET(Start,$A67,37)),0)","v":0},{"$f":"IF(TODAY()-E$2>0,SUM(OFFSET(Start,$A67,18):OFFSET(Start,$A67,37)),0)","v":0},{"$f":"IF(TODAY()-F$2>0,SUM(OFFSET(Start,$A67,18):OFFSET(Start,$A67,37)),0)","v":0},{"$f":"IF(TODAY()-G$2>0,SUM(OFFSET(Start,$A67,18):OFFSET(Start,$A67,37)),0)","v":0},{"$f":"IF(TODAY()-H$2>0,SUM(OFFSET(Start,$A67,18):OFFSET(Start,$A67,37)),0)","v":0},{"$f":"IF(TODAY()-I$2>0,SUM(OFFSET(Start,$A67,18):OFFSET(Start,$A67,37)),0)","v":0},{"$f":"IF(TODAY()-J$2>0,SUM(OFFSET(Start,$A67,18):OFFSET(Start,$A67,37)),0)","v":0},{"$f":"IF(TODAY()-K$2>0,SUM(OFFSET(Start,$A67,18):OFFSET(Start,$A67,37)),0)","v":0},{"$f":"IF(TODAY()-L$2>0,SUM(OFFSET(Start,$A67,18):OFFSET(Start,$A67,37)),0)","v":0},{"$f":"IF(TODAY()-M$2>0,SUM(OFFSET(Start,$A67,18):OFFSET(Start,$A67,37)),0)","v":0},{"$f":"IF(TODAY()-N$2>0,SUM(OFFSET(Start,$A67,18):OFFSET(Start,$A67,37)),0)","v":0},{"$f":"IF(TODAY()-O$2>0,SUM(OFFSET(Start,$A67,18):OFFSET(Start,$A67,37)),0)","v":0},{"$f":"IF(TODAY()-P$2>0,SUM(OFFSET(Start,$A67,18):OFFSET(Start,$A67,37)),0)","v":0},{"$f":"IF(TODAY()-Q$2>0,SUM(OFFSET(Start,$A67,18):OFFSET(Start,$A67,37)),0)","v":0},{"$f":"IF(TODAY()-R$2>0,SUM(OFFSET(Start,$A67,18):OFFSET(Start,$A67,37)),0)","v":0},{"$f":"IF(TODAY()-S$2>0,SUM(OFFSET(Start,$A67,18):OFFSET(Start,$A67,37)),0)","v":0},{"$f":"IF(TODAY()-T$2>0,SUM(OFFSET(Start,$A67,18):OFFSET(Start,$A67,37)),0)","v":0},{"$f":"IF(TODAY()-U$2>0,SUM(OFFSET(Start,$A67,18):OFFSET(Start,$A67,37)),0)","v":0},{"$f":"IF(TODAY()-V$2>0,SUM(OFFSET(Start,$A67,18):OFFSET(Start,$A67,37)),0)","v":0},{"$f":"IF(TODAY()-W$2>0,SUM(OFFSET(Start,$A67,18):OFFSET(Start,$A67,37)),0)","v":0},{"$f":"IF(TODAY()-X$2>0,SUM(OFFSET(Start,$A67,18):OFFSET(Start,$A67,37)),0)","v":0},{"$f":"IF(TODAY()-Y$2>0,SUM(OFFSET(Start,$A67,18):OFFSET(Start,$A67,37)),0)","v":0},{"$f":"IF(TODAY()-Z$2>0,SUM(OFFSET(Start,$A67,18):OFFSET(Start,$A67,37)),0)","v":0},{"$f":"IF(TODAY()-AA$2>0,SUM(OFFSET(Start,$A67,18):OFFSET(Start,$A67,37)),0)","v":0},{"$f":"IF(TODAY()-AB$2>0,SUM(OFFSET(Start,$A67,18):OFFSET(Start,$A67,37)),0)","v":0},{"$f":"IF(TODAY()-AC$2>0,SUM(OFFSET(Start,$A67,18):OFFSET(Start,$A67,37)),0)","v":0},{"$f":"IF(TODAY()-AD$2>0,SUM(OFFSET(Start,$A67,18):OFFSET(Start,$A67,37)),0)","v":0},{"$f":"IF(TODAY()-AE$2>0,SUM(OFFSET(Start,$A67,18):OFFSET(Start,$A67,37)),0)","v":0},{"$f":"IF(TODAY()-AF$2>0,SUM(OFFSET(Start,$A67,18):OFFSET(Start,$A67,37)),0)","v":0},{"$f":"IF(TODAY()-AG$2>0,SUM(OFFSET(Start,$A67,18):OFFSET(Start,$A67,37)),0)","v":0},{"$f":"IF(TODAY()-AH$2>0,SUM(OFFSET(Start,$A67,18):OFFSET(Start,$A67,37)),0)","v":0},{"$f":"IF(TODAY()-AI$2>0,SUM(OFFSET(Start,$A67,18):OFFSET(Start,$A67,37)),0)","v":0},{"$f":"IF(TODAY()-AJ$2>0,SUM(OFFSET(Start,$A67,18):OFFSET(Start,$A67,37)),0)","v":0},{"$f":"IF(TODAY()-AK$2>0,SUM(OFFSET(Start,$A67,18):OFFSET(Start,$A67,37)),0)","v":0},{"$f":"IF(TODAY()-AL$2>0,SUM(OFFSET(Start,$A67,18):OFFSET(Start,$A67,37)),0)","v":0},0,{"$f":"OFFSET(Start,$A67,3)+OFFSET(Start,$A67,4)+OFFSET(Start,$A67,17)","v":0},0]
[67,{"$f":"OFFSET(Start,'Mellomlagring - antall besøk'!A68,0)","v":0},{"$f":"IF(TODAY()-C$2>0,SUM(OFFSET(Start,$A68,18):OFFSET(Start,$A68,37)),0)","v":0},{"$f":"IF(TODAY()-D$2>0,SUM(OFFSET(Start,$A68,18):OFFSET(Start,$A68,37)),0)","v":0},{"$f":"IF(TODAY()-E$2>0,SUM(OFFSET(Start,$A68,18):OFFSET(Start,$A68,37)),0)","v":0},{"$f":"IF(TODAY()-F$2>0,SUM(OFFSET(Start,$A68,18):OFFSET(Start,$A68,37)),0)","v":0},{"$f":"IF(TODAY()-G$2>0,SUM(OFFSET(Start,$A68,18):OFFSET(Start,$A68,37)),0)","v":0},{"$f":"IF(TODAY()-H$2>0,SUM(OFFSET(Start,$A68,18):OFFSET(Start,$A68,37)),0)","v":0},{"$f":"IF(TODAY()-I$2>0,SUM(OFFSET(Start,$A68,18):OFFSET(Start,$A68,37)),0)","v":0},{"$f":"IF(TODAY()-J$2>0,SUM(OFFSET(Start,$A68,18):OFFSET(Start,$A68,37)),0)","v":0},{"$f":"IF(TODAY()-K$2>0,SUM(OFFSET(Start,$A68,18):OFFSET(Start,$A68,37)),0)","v":0},{"$f":"IF(TODAY()-L$2>0,SUM(OFFSET(Start,$A68,18):OFFSET(Start,$A68,37)),0)","v":0},{"$f":"IF(TODAY()-M$2>0,SUM(OFFSET(Start,$A68,18):OFFSET(Start,$A68,37)),0)","v":0},{"$f":"IF(TODAY()-N$2>0,SUM(OFFSET(Start,$A68,18):OFFSET(Start,$A68,37)),0)","v":0},{"$f":"IF(TODAY()-O$2>0,SUM(OFFSET(Start,$A68,18):OFFSET(Start,$A68,37)),0)","v":0},{"$f":"IF(TODAY()-P$2>0,SUM(OFFSET(Start,$A68,18):OFFSET(Start,$A68,37)),0)","v":0},{"$f":"IF(TODAY()-Q$2>0,SUM(OFFSET(Start,$A68,18):OFFSET(Start,$A68,37)),0)","v":0},{"$f":"IF(TODAY()-R$2>0,SUM(OFFSET(Start,$A68,18):OFFSET(Start,$A68,37)),0)","v":0},{"$f":"IF(TODAY()-S$2>0,SUM(OFFSET(Start,$A68,18):OFFSET(Start,$A68,37)),0)","v":0},{"$f":"IF(TODAY()-T$2>0,SUM(OFFSET(Start,$A68,18):OFFSET(Start,$A68,37)),0)","v":0},{"$f":"IF(TODAY()-U$2>0,SUM(OFFSET(Start,$A68,18):OFFSET(Start,$A68,37)),0)","v":0},{"$f":"IF(TODAY()-V$2>0,SUM(OFFSET(Start,$A68,18):OFFSET(Start,$A68,37)),0)","v":0},{"$f":"IF(TODAY()-W$2>0,SUM(OFFSET(Start,$A68,18):OFFSET(Start,$A68,37)),0)","v":0},{"$f":"IF(TODAY()-X$2>0,SUM(OFFSET(Start,$A68,18):OFFSET(Start,$A68,37)),0)","v":0},{"$f":"IF(TODAY()-Y$2>0,SUM(OFFSET(Start,$A68,18):OFFSET(Start,$A68,37)),0)","v":0},{"$f":"IF(TODAY()-Z$2>0,SUM(OFFSET(Start,$A68,18):OFFSET(Start,$A68,37)),0)","v":0},{"$f":"IF(TODAY()-AA$2>0,SUM(OFFSET(Start,$A68,18):OFFSET(Start,$A68,37)),0)","v":0},{"$f":"IF(TODAY()-AB$2>0,SUM(OFFSET(Start,$A68,18):OFFSET(Start,$A68,37)),0)","v":0},{"$f":"IF(TODAY()-AC$2>0,SUM(OFFSET(Start,$A68,18):OFFSET(Start,$A68,37)),0)","v":0},{"$f":"IF(TODAY()-AD$2>0,SUM(OFFSET(Start,$A68,18):OFFSET(Start,$A68,37)),0)","v":0},{"$f":"IF(TODAY()-AE$2>0,SUM(OFFSET(Start,$A68,18):OFFSET(Start,$A68,37)),0)","v":0},{"$f":"IF(TODAY()-AF$2>0,SUM(OFFSET(Start,$A68,18):OFFSET(Start,$A68,37)),0)","v":0},{"$f":"IF(TODAY()-AG$2>0,SUM(OFFSET(Start,$A68,18):OFFSET(Start,$A68,37)),0)","v":0},{"$f":"IF(TODAY()-AH$2>0,SUM(OFFSET(Start,$A68,18):OFFSET(Start,$A68,37)),0)","v":0},{"$f":"IF(TODAY()-AI$2>0,SUM(OFFSET(Start,$A68,18):OFFSET(Start,$A68,37)),0)","v":0},{"$f":"IF(TODAY()-AJ$2>0,SUM(OFFSET(Start,$A68,18):OFFSET(Start,$A68,37)),0)","v":0},{"$f":"IF(TODAY()-AK$2>0,SUM(OFFSET(Start,$A68,18):OFFSET(Start,$A68,37)),0)","v":0},{"$f":"IF(TODAY()-AL$2>0,SUM(OFFSET(Start,$A68,18):OFFSET(Start,$A68,37)),0)","v":0},{"$f":"SUM(C68:AL68)","v":0},0,{"$f":"AM68+AN68","v":0}]
[{"$f":"+A68+1","v":68},{"$f":"OFFSET(Start,'Mellomlagring - antall besøk'!A69,0)","v":0},{"$f":"IF(TODAY()-C$2>0,SUM(OFFSET(Start,$A69,18):OFFSET(Start,$A69,37)),0)","v":0},{"$f":"IF(TODAY()-D$2>0,SUM(OFFSET(Start,$A69,18):OFFSET(Start,$A69,37)),0)","v":0},{"$f":"IF(TODAY()-E$2>0,SUM(OFFSET(Start,$A69,18):OFFSET(Start,$A69,37)),0)","v":0},{"$f":"IF(TODAY()-F$2>0,SUM(OFFSET(Start,$A69,18):OFFSET(Start,$A69,37)),0)","v":0},{"$f":"IF(TODAY()-G$2>0,SUM(OFFSET(Start,$A69,18):OFFSET(Start,$A69,37)),0)","v":0},{"$f":"IF(TODAY()-H$2>0,SUM(OFFSET(Start,$A69,18):OFFSET(Start,$A69,37)),0)","v":0},{"$f":"IF(TODAY()-I$2>0,SUM(OFFSET(Start,$A69,18):OFFSET(Start,$A69,37)),0)","v":0},{"$f":"IF(TODAY()-J$2>0,SUM(OFFSET(Start,$A69,18):OFFSET(Start,$A69,37)),0)","v":0},{"$f":"IF(TODAY()-K$2>0,SUM(OFFSET(Start,$A69,18):OFFSET(Start,$A69,37)),0)","v":0},{"$f":"IF(TODAY()-L$2>0,SUM(OFFSET(Start,$A69,18):OFFSET(Start,$A69,37)),0)","v":0},{"$f":"IF(TODAY()-M$2>0,SUM(OFFSET(Start,$A69,18):OFFSET(Start,$A69,37)),0)","v":0},{"$f":"IF(TODAY()-N$2>0,SUM(OFFSET(Start,$A69,18):OFFSET(Start,$A69,37)),0)","v":0},{"$f":"IF(TODAY()-O$2>0,SUM(OFFSET(Start,$A69,18):OFFSET(Start,$A69,37)),0)","v":0},{"$f":"IF(TODAY()-P$2>0,SUM(OFFSET(Start,$A69,18):OFFSET(Start,$A69,37)),0)","v":0},{"$f":"IF(TODAY()-Q$2>0,SUM(OFFSET(Start,$A69,18):OFFSET(Start,$A69,37)),0)","v":0},{"$f":"IF(TODAY()-R$2>0,SUM(OFFSET(Start,$A69,18):OFFSET(Start,$A69,37)),0)","v":0},{"$f":"IF(TODAY()-S$2>0,SUM(OFFSET(Start,$A69,18):OFFSET(Start,$A69,37)),0)","v":0},{"$f":"IF(TODAY()-T$2>0,SUM(OFFSET(Start,$A69,18):OFFSET(Start,$A69,37)),0)","v":0},{"$f":"IF(TODAY()-U$2>0,SUM(OFFSET(Start,$A69,18):OFFSET(Start,$A69,37)),0)","v":0},{"$f":"IF(TODAY()-V$2>0,SUM(OFFSET(Start,$A69,18):OFFSET(Start,$A69,37)),0)","v":0},{"$f":"IF(TODAY()-W$2>0,SUM(OFFSET(Start,$A69,18):OFFSET(Start,$A69,37)),0)","v":0},{"$f":"IF(TODAY()-X$2>0,SUM(OFFSET(Start,$A69,18):OFFSET(Start,$A69,37)),0)","v":0},{"$f":"IF(TODAY()-Y$2>0,SUM(OFFSET(Start,$A69,18):OFFSET(Start,$A69,37)),0)","v":0},{"$f":"IF(TODAY()-Z$2>0,SUM(OFFSET(Start,$A69,18):OFFSET(Start,$A69,37)),0)","v":0},{"$f":"IF(TODAY()-AA$2>0,SUM(OFFSET(Start,$A69,18):OFFSET(Start,$A69,37)),0)","v":0},{"$f":"IF(TODAY()-AB$2>0,SUM(OFFSET(Start,$A69,18):OFFSET(Start,$A69,37)),0)","v":0},{"$f":"IF(TODAY()-AC$2>0,SUM(OFFSET(Start,$A69,18):OFFSET(Start,$A69,37)),0)","v":0},{"$f":"IF(TODAY()-AD$2>0,SUM(OFFSET(Start,$A69,18):OFFSET(Start,$A69,37)),0)","v":0},{"$f":"IF(TODAY()-AE$2>0,SUM(OFFSET(Start,$A69,18):OFFSET(Start,$A69,37)),0)","v":0},{"$f":"IF(TODAY()-AF$2>0,SUM(OFFSET(Start,$A69,18):OFFSET(Start,$A69,37)),0)","v":0},{"$f":"IF(TODAY()-AG$2>0,SUM(OFFSET(Start,$A69,18):OFFSET(Start,$A69,37)),0)","v":0},{"$f":"IF(TODAY()-AH$2>0,SUM(OFFSET(Start,$A69,18):OFFSET(Start,$A69,37)),0)","v":0},{"$f":"IF(TODAY()-AI$2>0,SUM(OFFSET(Start,$A69,18):OFFSET(Start,$A69,37)),0)","v":0},{"$f":"IF(TODAY()-AJ$2>0,SUM(OFFSET(Start,$A69,18):OFFSET(Start,$A69,37)),0)","v":0},{"$f":"IF(TODAY()-AK$2>0,SUM(OFFSET(Start,$A69,18):OFFSET(Start,$A69,37)),0)","v":0},{"$f":"IF(TODAY()-AL$2>0,SUM(OFFSET(Start,$A69,18):OFFSET(Start,$A69,37)),0)","v":0},0,0,0]
[69,{"$f":"OFFSET(Start,'Mellomlagring - antall besøk'!A70,0)","v":0},{"$f":"IF(TODAY()-C$2>0,SUM(OFFSET(Start,$A70,18):OFFSET(Start,$A70,37)),0)","v":0},{"$f":"IF(TODAY()-D$2>0,SUM(OFFSET(Start,$A70,18):OFFSET(Start,$A70,37)),0)","v":0},{"$f":"IF(TODAY()-E$2>0,SUM(OFFSET(Start,$A70,18):OFFSET(Start,$A70,37)),0)","v":0},{"$f":"IF(TODAY()-F$2>0,SUM(OFFSET(Start,$A70,18):OFFSET(Start,$A70,37)),0)","v":0},{"$f":"IF(TODAY()-G$2>0,SUM(OFFSET(Start,$A70,18):OFFSET(Start,$A70,37)),0)","v":0},{"$f":"IF(TODAY()-H$2>0,SUM(OFFSET(Start,$A70,18):OFFSET(Start,$A70,37)),0)","v":0},{"$f":"IF(TODAY()-I$2>0,SUM(OFFSET(Start,$A70,18):OFFSET(Start,$A70,37)),0)","v":0},{"$f":"IF(TODAY()-J$2>0,SUM(OFFSET(Start,$A70,18):OFFSET(Start,$A70,37)),0)","v":0},{"$f":"IF(TODAY()-K$2>0,SUM(OFFSET(Start,$A70,18):OFFSET(Start,$A70,37)),0)","v":0},{"$f":"IF(TODAY()-L$2>0,SUM(OFFSET(Start,$A70,18):OFFSET(Start,$A70,37)),0)","v":0},{"$f":"IF(TODAY()-M$2>0,SUM(OFFSET(Start,$A70,18):OFFSET(Start,$A70,37)),0)","v":0},{"$f":"IF(TODAY()-N$2>0,SUM(OFFSET(Start,$A70,18):OFFSET(Start,$A70,37)),0)","v":0},{"$f":"IF(TODAY()-O$2>0,SUM(OFFSET(Start,$A70,18):OFFSET(Start,$A70,37)),0)","v":0},{"$f":"IF(TODAY()-P$2>0,SUM(OFFSET(Start,$A70,18):OFFSET(Start,$A70,37)),0)","v":0},{"$f":"IF(TODAY()-Q$2>0,SUM(OFFSET(Start,$A70,18):OFFSET(Start,$A70,37)),0)","v":0},{"$f":"IF(TODAY()-R$2>0,SUM(OFFSET(Start,$A70,18):OFFSET(Start,$A70,37)),0)","v":0},{"$f":"IF(TODAY()-S$2>0,SUM(OFFSET(Start,$A70,18):OFFSET(Start,$A70,37)),0)","v":0},{"$f":"IF(TODAY()-T$2>0,SUM(OFFSET(Start,$A70,18):OFFSET(Start,$A70,37)),0)","v":0},{"$f":"IF(TODAY()-U$2>0,SUM(OFFSET(Start,$A70,18):OFFSET(Start,$A70,37)),0)","v":0},{"$f":"IF(TODAY()-V$2>0,SUM(OFFSET(Start,$A70,18):OFFSET(Start,$A70,37)),0)","v":0},{"$f":"IF(TODAY()-W$2>0,SUM(OFFSET(Start,$A70,18):OFFSET(Start,$A70,37)),0)","v":0},{"$f":"IF(TODAY()-X$2>0,SUM(OFFSET(Start,$A70,18):OFFSET(Start,$A70,37)),0)","v":0},{"$f":"IF(TODAY()-Y$2>0,SUM(OFFSET(Start,$A70,18):OFFSET(Start,$A70,37)),0)","v":0},{"$f":"IF(TODAY()-Z$2>0,SUM(OFFSET(Start,$A70,18):OFFSET(Start,$A70,37)),0)","v":0},{"$f":"IF(TODAY()-AA$2>0,SUM(OFFSET(Start,$A70,18):OFFSET(Start,$A70,37)),0)","v":0},{"$f":"IF(TODAY()-AB$2>0,SUM(OFFSET(Start,$A70,18):OFFSET(Start,$A70,37)),0)","v":0},{"$f":"IF(TODAY()-AC$2>0,SUM(OFFSET(Start,$A70,18):OFFSET(Start,$A70,37)),0)","v":0},{"$f":"IF(TODAY()-AD$2>0,SUM(OFFSET(Start,$A70,18):OFFSET(Start,$A70,37)),0)","v":0},{"$f":"IF(TODAY()-AE$2>0,SUM(OFFSET(Start,$A70,18):OFFSET(Start,$A70,37)),0)","v":0},{"$f":"IF(TODAY()-AF$2>0,SUM(OFFSET(Start,$A70,18):OFFSET(Start,$A70,37)),0)","v":0},{"$f":"IF(TODAY()-AG$2>0,SUM(OFFSET(Start,$A70,18):OFFSET(Start,$A70,37)),0)","v":0},{"$f":"IF(TODAY()-AH$2>0,SUM(OFFSET(Start,$A70,18):OFFSET(Start,$A70,37)),0)","v":0},{"$f":"IF(TODAY()-AI$2>0,SUM(OFFSET(Start,$A70,18):OFFSET(Start,$A70,37)),0)","v":0},{"$f":"IF(TODAY()-AJ$2>0,SUM(OFFSET(Start,$A70,18):OFFSET(Start,$A70,37)),0)","v":0},{"$f":"IF(TODAY()-AK$2>0,SUM(OFFSET(Start,$A70,18):OFFSET(Start,$A70,37)),0)","v":0},{"$f":"IF(TODAY()-AL$2>0,SUM(OFFSET(Start,$A70,18):OFFSET(Start,$A70,37)),0)","v":0},0,0,0]
[70,{"$f":"OFFSET(Start,'Mellomlagring - antall besøk'!A71,0)","v":0},{"$f":"IF(TODAY()-C$2>0,SUM(OFFSET(Start,$A71,18):OFFSET(Start,$A71,37)),0)","v":0},{"$f":"IF(TODAY()-D$2>0,SUM(OFFSET(Start,$A71,18):OFFSET(Start,$A71,37)),0)","v":0},{"$f":"IF(TODAY()-E$2>0,SUM(OFFSET(Start,$A71,18):OFFSET(Start,$A71,37)),0)","v":0},{"$f":"IF(TODAY()-F$2>0,SUM(OFFSET(Start,$A71,18):OFFSET(Start,$A71,37)),0)","v":0},{"$f":"IF(TODAY()-G$2>0,SUM(OFFSET(Start,$A71,18):OFFSET(Start,$A71,37)),0)","v":0},{"$f":"IF(TODAY()-H$2>0,SUM(OFFSET(Start,$A71,18):OFFSET(Start,$A71,37)),0)","v":0},{"$f":"IF(TODAY()-I$2>0,SUM(OFFSET(Start,$A71,18):OFFSET(Start,$A71,37)),0)","v":0},{"$f":"IF(TODAY()-J$2>0,SUM(OFFSET(Start,$A71,18):OFFSET(Start,$A71,37)),0)","v":0},{"$f":"IF(TODAY()-K$2>0,SUM(OFFSET(Start,$A71,18):OFFSET(Start,$A71,37)),0)","v":0},{"$f":"IF(TODAY()-L$2>0,SUM(OFFSET(Start,$A71,18):OFFSET(Start,$A71,37)),0)","v":0},{"$f":"IF(TODAY()-M$2>0,SUM(OFFSET(Start,$A71,18):OFFSET(Start,$A71,37)),0)","v":0},{"$f":"IF(TODAY()-N$2>0,SUM(OFFSET(Start,$A71,18):OFFSET(Start,$A71,37)),0)","v":0},{"$f":"IF(TODAY()-O$2>0,SUM(OFFSET(Start,$A71,18):OFFSET(Start,$A71,37)),0)","v":0},{"$f":"IF(TODAY()-P$2>0,SUM(OFFSET(Start,$A71,18):OFFSET(Start,$A71,37)),0)","v":0},{"$f":"IF(TODAY()-Q$2>0,SUM(OFFSET(Start,$A71,18):OFFSET(Start,$A71,37)),0)","v":0},{"$f":"IF(TODAY()-R$2>0,SUM(OFFSET(Start,$A71,18):OFFSET(Start,$A71,37)),0)","v":0},{"$f":"IF(TODAY()-S$2>0,SUM(OFFSET(Start,$A71,18):OFFSET(Start,$A71,37)),0)","v":0},{"$f":"IF(TODAY()-T$2>0,SUM(OFFSET(Start,$A71,18):OFFSET(Start,$A71,37)),0)","v":0},{"$f":"IF(TODAY()-U$2>0,SUM(OFFSET(Start,$A71,18):OFFSET(Start,$A71,37)),0)","v":0},{"$f":"IF(TODAY()-V$2>0,SUM(OFFSET(Start,$A71,18):OFFSET(Start,$A71,37)),0)","v":0},{"$f":"IF(TODAY()-W$2>0,SUM(OFFSET(Start,$A71,18):OFFSET(Start,$A71,37)),0)","v":0},{"$f":"IF(TODAY()-X$2>0,SUM(OFFSET(Start,$A71,18):OFFSET(Start,$A71,37)),0)","v":0},{"$f":"IF(TODAY()-Y$2>0,SUM(OFFSET(Start,$A71,18):OFFSET(Start,$A71,37)),0)","v":0},{"$f":"IF(TODAY()-Z$2>0,SUM(OFFSET(Start,$A71,18):OFFSET(Start,$A71,37)),0)","v":0},{"$f":"IF(TODAY()-AA$2>0,SUM(OFFSET(Start,$A71,18):OFFSET(Start,$A71,37)),0)","v":0},{"$f":"IF(TODAY()-AB$2>0,SUM(OFFSET(Start,$A71,18):OFFSET(Start,$A71,37)),0)","v":0},{"$f":"IF(TODAY()-AC$2>0,SUM(OFFSET(Start,$A71,18):OFFSET(Start,$A71,37)),0)","v":0},{"$f":"IF(TODAY()-AD$2>0,SUM(OFFSET(Start,$A71,18):OFFSET(Start,$A71,37)),0)","v":0},{"$f":"IF(TODAY()-AE$2>0,SUM(OFFSET(Start,$A71,18):OFFSET(Start,$A71,37)),0)","v":0},{"$f":"IF(TODAY()-AF$2>0,SUM(OFFSET(Start,$A71,18):OFFSET(Start,$A71,37)),0)","v":0},{"$f":"IF(TODAY()-AG$2>0,SUM(OFFSET(Start,$A71,18):OFFSET(Start,$A71,37)),0)","v":0},{"$f":"IF(TODAY()-AH$2>0,SUM(OFFSET(Start,$A71,18):OFFSET(Start,$A71,37)),0)","v":0},{"$f":"IF(TODAY()-AI$2>0,SUM(OFFSET(Start,$A71,18):OFFSET(Start,$A71,37)),0)","v":0},{"$f":"IF(TODAY()-AJ$2>0,SUM(OFFSET(Start,$A71,18):OFFSET(Start,$A71,37)),0)","v":0},{"$f":"IF(TODAY()-AK$2>0,SUM(OFFSET(Start,$A71,18):OFFSET(Start,$A71,37)),0)","v":0},{"$f":"IF(TODAY()-AL$2>0,SUM(OFFSET(Start,$A71,18):OFFSET(Start,$A71,37)),0)","v":0},0,0,0]
[71,{"$f":"OFFSET(Start,'Mellomlagring - antall besøk'!A72,0)","v":0},{"$f":"IF(TODAY()-C$2>0,SUM(OFFSET(Start,$A72,18):OFFSET(Start,$A72,37)),0)","v":0},{"$f":"IF(TODAY()-D$2>0,SUM(OFFSET(Start,$A72,18):OFFSET(Start,$A72,37)),0)","v":0},{"$f":"IF(TODAY()-E$2>0,SUM(OFFSET(Start,$A72,18):OFFSET(Start,$A72,37)),0)","v":0},{"$f":"IF(TODAY()-F$2>0,SUM(OFFSET(Start,$A72,18):OFFSET(Start,$A72,37)),0)","v":0},{"$f":"IF(TODAY()-G$2>0,SUM(OFFSET(Start,$A72,18):OFFSET(Start,$A72,37)),0)","v":0},{"$f":"IF(TODAY()-H$2>0,SUM(OFFSET(Start,$A72,18):OFFSET(Start,$A72,37)),0)","v":0},{"$f":"IF(TODAY()-I$2>0,SUM(OFFSET(Start,$A72,18):OFFSET(Start,$A72,37)),0)","v":0},{"$f":"IF(TODAY()-J$2>0,SUM(OFFSET(Start,$A72,18):OFFSET(Start,$A72,37)),0)","v":0},{"$f":"IF(TODAY()-K$2>0,SUM(OFFSET(Start,$A72,18):OFFSET(Start,$A72,37)),0)","v":0},{"$f":"IF(TODAY()-L$2>0,SUM(OFFSET(Start,$A72,18):OFFSET(Start,$A72,37)),0)","v":0},{"$f":"IF(TODAY()-M$2>0,SUM(OFFSET(Start,$A72,18):OFFSET(Start,$A72,37)),0)","v":0},{"$f":"IF(TODAY()-N$2>0,SUM(OFFSET(Start,$A72,18):OFFSET(Start,$A72,37)),0)","v":0},{"$f":"IF(TODAY()-O$2>0,SUM(OFFSET(Start,$A72,18):OFFSET(Start,$A72,37)),0)","v":0},{"$f":"IF(TODAY()-P$2>0,SUM(OFFSET(Start,$A72,18):OFFSET(Start,$A72,37)),0)","v":0},{"$f":"IF(TODAY()-Q$2>0,SUM(OFFSET(Start,$A72,18):OFFSET(Start,$A72,37)),0)","v":0},{"$f":"IF(TODAY()-R$2>0,SUM(OFFSET(Start,$A72,18):OFFSET(Start,$A72,37)),0)","v":0},{"$f":"IF(TODAY()-S$2>0,SUM(OFFSET(Start,$A72,18):OFFSET(Start,$A72,37)),0)","v":0},{"$f":"IF(TODAY()-T$2>0,SUM(OFFSET(Start,$A72,18):OFFSET(Start,$A72,37)),0)","v":0},{"$f":"IF(TODAY()-U$2>0,SUM(OFFSET(Start,$A72,18):OFFSET(Start,$A72,37)),0)","v":0},{"$f":"IF(TODAY()-V$2>0,SUM(OFFSET(Start,$A72,18):OFFSET(Start,$A72,37)),0)","v":0},{"$f":"IF(TODAY()-W$2>0,SUM(OFFSET(Start,$A72,18):OFFSET(Start,$A72,37)),0)","v":0},{"$f":"IF(TODAY()-X$2>0,SUM(OFFSET(Start,$A72,18):OFFSET(Start,$A72,37)),0)","v":0},{"$f":"IF(TODAY()-Y$2>0,SUM(OFFSET(Start,$A72,18):OFFSET(Start,$A72,37)),0)","v":0},{"$f":"IF(TODAY()-Z$2>0,SUM(OFFSET(Start,$A72,18):OFFSET(Start,$A72,37)),0)","v":0},{"$f":"IF(TODAY()-AA$2>0,SUM(OFFSET(Start,$A72,18):OFFSET(Start,$A72,37)),0)","v":0},{"$f":"IF(TODAY()-AB$2>0,SUM(OFFSET(Start,$A72,18):OFFSET(Start,$A72,37)),0)","v":0},{"$f":"IF(TODAY()-AC$2>0,SUM(OFFSET(Start,$A72,18):OFFSET(Start,$A72,37)),0)","v":0},{"$f":"IF(TODAY()-AD$2>0,SUM(OFFSET(Start,$A72,18):OFFSET(Start,$A72,37)),0)","v":0},{"$f":"IF(TODAY()-AE$2>0,SUM(OFFSET(Start,$A72,18):OFFSET(Start,$A72,37)),0)","v":0},{"$f":"IF(TODAY()-AF$2>0,SUM(OFFSET(Start,$A72,18):OFFSET(Start,$A72,37)),0)","v":0},{"$f":"IF(TODAY()-AG$2>0,SUM(OFFSET(Start,$A72,18):OFFSET(Start,$A72,37)),0)","v":0},{"$f":"IF(TODAY()-AH$2>0,SUM(OFFSET(Start,$A72,18):OFFSET(Start,$A72,37)),0)","v":0},{"$f":"IF(TODAY()-AI$2>0,SUM(OFFSET(Start,$A72,18):OFFSET(Start,$A72,37)),0)","v":0},{"$f":"IF(TODAY()-AJ$2>0,SUM(OFFSET(Start,$A72,18):OFFSET(Start,$A72,37)),0)","v":0},{"$f":"IF(TODAY()-AK$2>0,SUM(OFFSET(Start,$A72,18):OFFSET(Start,$A72,37)),0)","v":0},{"$f":"IF(TODAY()-AL$2>0,SUM(OFFSET(Start,$A72,18):OFFSET(Start,$A72,37)),0)","v":0},0,0,0]
[72,{"$f":"OFFSET(Start,'Mellomlagring - antall besøk'!A73,0)","v":0},{"$f":"IF(TODAY()-C$2>0,SUM(OFFSET(Start,$A73,18):OFFSET(Start,$A73,37)),0)","v":0},{"$f":"IF(TODAY()-D$2>0,SUM(OFFSET(Start,$A73,18):OFFSET(Start,$A73,37)),0)","v":0},{"$f":"IF(TODAY()-E$2>0,SUM(OFFSET(Start,$A73,18):OFFSET(Start,$A73,37)),0)","v":0},{"$f":"IF(TODAY()-F$2>0,SUM(OFFSET(Start,$A73,18):OFFSET(Start,$A73,37)),0)","v":0},{"$f":"IF(TODAY()-G$2>0,SUM(OFFSET(Start,$A73,18):OFFSET(Start,$A73,37)),0)","v":0},{"$f":"IF(TODAY()-H$2>0,SUM(OFFSET(Start,$A73,18):OFFSET(Start,$A73,37)),0)","v":0},{"$f":"IF(TODAY()-I$2>0,SUM(OFFSET(Start,$A73,18):OFFSET(Start,$A73,37)),0)","v":0},{"$f":"IF(TODAY()-J$2>0,SUM(OFFSET(Start,$A73,18):OFFSET(Start,$A73,37)),0)","v":0},{"$f":"IF(TODAY()-K$2>0,SUM(OFFSET(Start,$A73,18):OFFSET(Start,$A73,37)),0)","v":0},{"$f":"IF(TODAY()-L$2>0,SUM(OFFSET(Start,$A73,18):OFFSET(Start,$A73,37)),0)","v":0},{"$f":"IF(TODAY()-M$2>0,SUM(OFFSET(Start,$A73,18):OFFSET(Start,$A73,37)),0)","v":0},{"$f":"IF(TODAY()-N$2>0,SUM(OFFSET(Start,$A73,18):OFFSET(Start,$A73,37)),0)","v":0},{"$f":"IF(TODAY()-O$2>0,SUM(OFFSET(Start,$A73,18):OFFSET(Start,$A73,37)),0)","v":0},{"$f":"IF(TODAY()-P$2>0,SUM(OFFSET(Start,$A73,18):OFFSET(Start,$A73,37)),0)","v":0},{"$f":"IF(TODAY()-Q$2>0,SUM(OFFSET(Start,$A73,18):OFFSET(Start,$A73,37)),0)","v":0},{"$f":"IF(TODAY()-R$2>0,SUM(OFFSET(Start,$A73,18):OFFSET(Start,$A73,37)),0)","v":0},{"$f":"IF(TODAY()-S$2>0,SUM(OFFSET(Start,$A73,18):OFFSET(Start,$A73,37)),0)","v":0},{"$f":"IF(TODAY()-T$2>0,SUM(OFFSET(Start,$A73,18):OFFSET(Start,$A73,37)),0)","v":0},{"$f":"IF(TODAY()-U$2>0,SUM(OFFSET(Start,$A73,18):OFFSET(Start,$A73,37)),0)","v":0},{"$f":"IF(TODAY()-V$2>0,SUM(OFFSET(Start,$A73,18):OFFSET(Start,$A73,37)),0)","v":0},{"$f":"IF(TODAY()-W$2>0,SUM(OFFSET(Start,$A73,18):OFFSET(Start,$A73,37)),0)","v":0},{"$f":"IF(TODAY()-X$2>0,SUM(OFFSET(Start,$A73,18):OFFSET(Start,$A73,37)),0)","v":0},{"$f":"IF(TODAY()-Y$2>0,SUM(OFFSET(Start,$A73,18):OFFSET(Start,$A73,37)),0)","v":0},{"$f":"IF(TODAY()-Z$2>0,SUM(OFFSET(Start,$A73,18):OFFSET(Start,$A73,37)),0)","v":0},{"$f":"IF(TODAY()-AA$2>0,SUM(OFFSET(Start,$A73,18):OFFSET(Start,$A73,37)),0)","v":0},{"$f":"IF(TODAY()-AB$2>0,SUM(OFFSET(Start,$A73,18):OFFSET(Start,$A73,37)),0)","v":0},{"$f":"IF(TODAY()-AC$2>0,SUM(OFFSET(Start,$A73,18):OFFSET(Start,$A73,37)),0)","v":0},{"$f":"IF(TODAY()-AD$2>0,SUM(OFFSET(Start,$A73,18):OFFSET(Start,$A73,37)),0)","v":0},{"$f":"IF(TODAY()-AE$2>0,SUM(OFFSET(Start,$A73,18):OFFSET(Start,$A73,37)),0)","v":0},{"$f":"IF(TODAY()-AF$2>0,SUM(OFFSET(Start,$A73,18):OFFSET(Start,$A73,37)),0)","v":0},{"$f":"IF(TODAY()-AG$2>0,SUM(OFFSET(Start,$A73,18):OFFSET(Start,$A73,37)),0)","v":0},{"$f":"IF(TODAY()-AH$2>0,SUM(OFFSET(Start,$A73,18):OFFSET(Start,$A73,37)),0)","v":0},{"$f":"IF(TODAY()-AI$2>0,SUM(OFFSET(Start,$A73,18):OFFSET(Start,$A73,37)),0)","v":0},{"$f":"IF(TODAY()-AJ$2>0,SUM(OFFSET(Start,$A73,18):OFFSET(Start,$A73,37)),0)","v":0},{"$f":"IF(TODAY()-AK$2>0,SUM(OFFSET(Start,$A73,18):OFFSET(Start,$A73,37)),0)","v":0},{"$f":"IF(TODAY()-AL$2>0,SUM(OFFSET(Start,$A73,18):OFFSET(Start,$A73,37)),0)","v":0},0,0,0]
[73,{"$f":"OFFSET(Start,'Mellomlagring - antall besøk'!A74,0)","v":0},{"$f":"IF(TODAY()-C$2>0,SUM(OFFSET(Start,$A74,18):OFFSET(Start,$A74,37)),0)","v":0},{"$f":"IF(TODAY()-D$2>0,SUM(OFFSET(Start,$A74,18):OFFSET(Start,$A74,37)),0)","v":0},{"$f":"IF(TODAY()-E$2>0,SUM(OFFSET(Start,$A74,18):OFFSET(Start,$A74,37)),0)","v":0},{"$f":"IF(TODAY()-F$2>0,SUM(OFFSET(Start,$A74,18):OFFSET(Start,$A74,37)),0)","v":0},{"$f":"IF(TODAY()-G$2>0,SUM(OFFSET(Start,$A74,18):OFFSET(Start,$A74,37)),0)","v":0},{"$f":"IF(TODAY()-H$2>0,SUM(OFFSET(Start,$A74,18):OFFSET(Start,$A74,37)),0)","v":0},{"$f":"IF(TODAY()-I$2>0,SUM(OFFSET(Start,$A74,18):OFFSET(Start,$A74,37)),0)","v":0},{"$f":"IF(TODAY()-J$2>0,SUM(OFFSET(Start,$A74,18):OFFSET(Start,$A74,37)),0)","v":0},{"$f":"IF(TODAY()-K$2>0,SUM(OFFSET(Start,$A74,18):OFFSET(Start,$A74,37)),0)","v":0},{"$f":"IF(TODAY()-L$2>0,SUM(OFFSET(Start,$A74,18):OFFSET(Start,$A74,37)),0)","v":0},{"$f":"IF(TODAY()-M$2>0,SUM(OFFSET(Start,$A74,18):OFFSET(Start,$A74,37)),0)","v":0},{"$f":"IF(TODAY()-N$2>0,SUM(OFFSET(Start,$A74,18):OFFSET(Start,$A74,37)),0)","v":0},{"$f":"IF(TODAY()-O$2>0,SUM(OFFSET(Start,$A74,18):OFFSET(Start,$A74,37)),0)","v":0},{"$f":"IF(TODAY()-P$2>0,SUM(OFFSET(Start,$A74,18):OFFSET(Start,$A74,37)),0)","v":0},{"$f":"IF(TODAY()-Q$2>0,SUM(OFFSET(Start,$A74,18):OFFSET(Start,$A74,37)),0)","v":0},{"$f":"IF(TODAY()-R$2>0,SUM(OFFSET(Start,$A74,18):OFFSET(Start,$A74,37)),0)","v":0},{"$f":"IF(TODAY()-S$2>0,SUM(OFFSET(Start,$A74,18):OFFSET(Start,$A74,37)),0)","v":0},{"$f":"IF(TODAY()-T$2>0,SUM(OFFSET(Start,$A74,18):OFFSET(Start,$A74,37)),0)","v":0},{"$f":"IF(TODAY()-U$2>0,SUM(OFFSET(Start,$A74,18):OFFSET(Start,$A74,37)),0)","v":0},{"$f":"IF(TODAY()-V$2>0,SUM(OFFSET(Start,$A74,18):OFFSET(Start,$A74,37)),0)","v":0},{"$f":"IF(TODAY()-W$2>0,SUM(OFFSET(Start,$A74,18):OFFSET(Start,$A74,37)),0)","v":0},{"$f":"IF(TODAY()-X$2>0,SUM(OFFSET(Start,$A74,18):OFFSET(Start,$A74,37)),0)","v":0},{"$f":"IF(TODAY()-Y$2>0,SUM(OFFSET(Start,$A74,18):OFFSET(Start,$A74,37)),0)","v":0},{"$f":"IF(TODAY()-Z$2>0,SUM(OFFSET(Start,$A74,18):OFFSET(Start,$A74,37)),0)","v":0},{"$f":"IF(TODAY()-AA$2>0,SUM(OFFSET(Start,$A74,18):OFFSET(Start,$A74,37)),0)","v":0},{"$f":"IF(TODAY()-AB$2>0,SUM(OFFSET(Start,$A74,18):OFFSET(Start,$A74,37)),0)","v":0},{"$f":"IF(TODAY()-AC$2>0,SUM(OFFSET(Start,$A74,18):OFFSET(Start,$A74,37)),0)","v":0},{"$f":"IF(TODAY()-AD$2>0,SUM(OFFSET(Start,$A74,18):OFFSET(Start,$A74,37)),0)","v":0},{"$f":"IF(TODAY()-AE$2>0,SUM(OFFSET(Start,$A74,18):OFFSET(Start,$A74,37)),0)","v":0},{"$f":"IF(TODAY()-AF$2>0,SUM(OFFSET(Start,$A74,18):OFFSET(Start,$A74,37)),0)","v":0},{"$f":"IF(TODAY()-AG$2>0,SUM(OFFSET(Start,$A74,18):OFFSET(Start,$A74,37)),0)","v":0},{"$f":"IF(TODAY()-AH$2>0,SUM(OFFSET(Start,$A74,18):OFFSET(Start,$A74,37)),0)","v":0},{"$f":"IF(TODAY()-AI$2>0,SUM(OFFSET(Start,$A74,18):OFFSET(Start,$A74,37)),0)","v":0},{"$f":"IF(TODAY()-AJ$2>0,SUM(OFFSET(Start,$A74,18):OFFSET(Start,$A74,37)),0)","v":0},{"$f":"IF(TODAY()-AK$2>0,SUM(OFFSET(Start,$A74,18):OFFSET(Start,$A74,37)),0)","v":0},{"$f":"IF(TODAY()-AL$2>0,SUM(OFFSET(Start,$A74,18):OFFSET(Start,$A74,37)),0)","v":0},0,0,0]
[74,{"$f":"OFFSET(Start,'Mellomlagring - antall besøk'!A75,0)","v":0},{"$f":"IF(TODAY()-C$2>0,SUM(OFFSET(Start,$A75,18):OFFSET(Start,$A75,37)),0)","v":0},{"$f":"IF(TODAY()-D$2>0,SUM(OFFSET(Start,$A75,18):OFFSET(Start,$A75,37)),0)","v":0},{"$f":"IF(TODAY()-E$2>0,SUM(OFFSET(Start,$A75,18):OFFSET(Start,$A75,37)),0)","v":0},{"$f":"IF(TODAY()-F$2>0,SUM(OFFSET(Start,$A75,18):OFFSET(Start,$A75,37)),0)","v":0},{"$f":"IF(TODAY()-G$2>0,SUM(OFFSET(Start,$A75,18):OFFSET(Start,$A75,37)),0)","v":0},{"$f":"IF(TODAY()-H$2>0,SUM(OFFSET(Start,$A75,18):OFFSET(Start,$A75,37)),0)","v":0},{"$f":"IF(TODAY()-I$2>0,SUM(OFFSET(Start,$A75,18):OFFSET(Start,$A75,37)),0)","v":0},{"$f":"IF(TODAY()-J$2>0,SUM(OFFSET(Start,$A75,18):OFFSET(Start,$A75,37)),0)","v":0},{"$f":"IF(TODAY()-K$2>0,SUM(OFFSET(Start,$A75,18):OFFSET(Start,$A75,37)),0)","v":0},{"$f":"IF(TODAY()-L$2>0,SUM(OFFSET(Start,$A75,18):OFFSET(Start,$A75,37)),0)","v":0},{"$f":"IF(TODAY()-M$2>0,SUM(OFFSET(Start,$A75,18):OFFSET(Start,$A75,37)),0)","v":0},{"$f":"IF(TODAY()-N$2>0,SUM(OFFSET(Start,$A75,18):OFFSET(Start,$A75,37)),0)","v":0},{"$f":"IF(TODAY()-O$2>0,SUM(OFFSET(Start,$A75,18):OFFSET(Start,$A75,37)),0)","v":0},{"$f":"IF(TODAY()-P$2>0,SUM(OFFSET(Start,$A75,18):OFFSET(Start,$A75,37)),0)","v":0},{"$f":"IF(TODAY()-Q$2>0,SUM(OFFSET(Start,$A75,18):OFFSET(Start,$A75,37)),0)","v":0},{"$f":"IF(TODAY()-R$2>0,SUM(OFFSET(Start,$A75,18):OFFSET(Start,$A75,37)),0)","v":0},{"$f":"IF(TODAY()-S$2>0,SUM(OFFSET(Start,$A75,18):OFFSET(Start,$A75,37)),0)","v":0},{"$f":"IF(TODAY()-T$2>0,SUM(OFFSET(Start,$A75,18):OFFSET(Start,$A75,37)),0)","v":0},{"$f":"IF(TODAY()-U$2>0,SUM(OFFSET(Start,$A75,18):OFFSET(Start,$A75,37)),0)","v":0},{"$f":"IF(TODAY()-V$2>0,SUM(OFFSET(Start,$A75,18):OFFSET(Start,$A75,37)),0)","v":0},{"$f":"IF(TODAY()-W$2>0,SUM(OFFSET(Start,$A75,18):OFFSET(Start,$A75,37)),0)","v":0},{"$f":"IF(TODAY()-X$2>0,SUM(OFFSET(Start,$A75,18):OFFSET(Start,$A75,37)),0)","v":0},{"$f":"IF(TODAY()-Y$2>0,SUM(OFFSET(Start,$A75,18):OFFSET(Start,$A75,37)),0)","v":0},{"$f":"IF(TODAY()-Z$2>0,SUM(OFFSET(Start,$A75,18):OFFSET(Start,$A75,37)),0)","v":0},{"$f":"IF(TODAY()-AA$2>0,SUM(OFFSET(Start,$A75,18):OFFSET(Start,$A75,37)),0)","v":0},{"$f":"IF(TODAY()-AB$2>0,SUM(OFFSET(Start,$A75,18):OFFSET(Start,$A75,37)),0)","v":0},{"$f":"IF(TODAY()-AC$2>0,SUM(OFFSET(Start,$A75,18):OFFSET(Start,$A75,37)),0)","v":0},{"$f":"IF(TODAY()-AD$2>0,SUM(OFFSET(Start,$A75,18):OFFSET(Start,$A75,37)),0)","v":0},{"$f":"IF(TODAY()-AE$2>0,SUM(OFFSET(Start,$A75,18):OFFSET(Start,$A75,37)),0)","v":0},{"$f":"IF(TODAY()-AF$2>0,SUM(OFFSET(Start,$A75,18):OFFSET(Start,$A75,37)),0)","v":0},{"$f":"IF(TODAY()-AG$2>0,SUM(OFFSET(Start,$A75,18):OFFSET(Start,$A75,37)),0)","v":0},{"$f":"IF(TODAY()-AH$2>0,SUM(OFFSET(Start,$A75,18):OFFSET(Start,$A75,37)),0)","v":0},{"$f":"IF(TODAY()-AI$2>0,SUM(OFFSET(Start,$A75,18):OFFSET(Start,$A75,37)),0)","v":0},{"$f":"IF(TODAY()-AJ$2>0,SUM(OFFSET(Start,$A75,18):OFFSET(Start,$A75,37)),0)","v":0},{"$f":"IF(TODAY()-AK$2>0,SUM(OFFSET(Start,$A75,18):OFFSET(Start,$A75,37)),0)","v":0},{"$f":"IF(TODAY()-AL$2>0,SUM(OFFSET(Start,$A75,18):OFFSET(Start,$A75,37)),0)","v":0},0,0,0]
[75,{"$f":"OFFSET(Start,'Mellomlagring - antall besøk'!A76,0)","v":0},{"$f":"IF(TODAY()-C$2>0,SUM(OFFSET(Start,$A76,18):OFFSET(Start,$A76,37)),0)","v":0},{"$f":"IF(TODAY()-D$2>0,SUM(OFFSET(Start,$A76,18):OFFSET(Start,$A76,37)),0)","v":0},{"$f":"IF(TODAY()-E$2>0,SUM(OFFSET(Start,$A76,18):OFFSET(Start,$A76,37)),0)","v":0},{"$f":"IF(TODAY()-F$2>0,SUM(OFFSET(Start,$A76,18):OFFSET(Start,$A76,37)),0)","v":0},{"$f":"IF(TODAY()-G$2>0,SUM(OFFSET(Start,$A76,18):OFFSET(Start,$A76,37)),0)","v":0},{"$f":"IF(TODAY()-H$2>0,SUM(OFFSET(Start,$A76,18):OFFSET(Start,$A76,37)),0)","v":0},{"$f":"IF(TODAY()-I$2>0,SUM(OFFSET(Start,$A76,18):OFFSET(Start,$A76,37)),0)","v":0},{"$f":"IF(TODAY()-J$2>0,SUM(OFFSET(Start,$A76,18):OFFSET(Start,$A76,37)),0)","v":0},{"$f":"IF(TODAY()-K$2>0,SUM(OFFSET(Start,$A76,18):OFFSET(Start,$A76,37)),0)","v":0},{"$f":"IF(TODAY()-L$2>0,SUM(OFFSET(Start,$A76,18):OFFSET(Start,$A76,37)),0)","v":0},{"$f":"IF(TODAY()-M$2>0,SUM(OFFSET(Start,$A76,18):OFFSET(Start,$A76,37)),0)","v":0},{"$f":"IF(TODAY()-N$2>0,SUM(OFFSET(Start,$A76,18):OFFSET(Start,$A76,37)),0)","v":0},{"$f":"IF(TODAY()-O$2>0,SUM(OFFSET(Start,$A76,18):OFFSET(Start,$A76,37)),0)","v":0},{"$f":"IF(TODAY()-P$2>0,SUM(OFFSET(Start,$A76,18):OFFSET(Start,$A76,37)),0)","v":0},{"$f":"IF(TODAY()-Q$2>0,SUM(OFFSET(Start,$A76,18):OFFSET(Start,$A76,37)),0)","v":0},{"$f":"IF(TODAY()-R$2>0,SUM(OFFSET(Start,$A76,18):OFFSET(Start,$A76,37)),0)","v":0},{"$f":"IF(TODAY()-S$2>0,SUM(OFFSET(Start,$A76,18):OFFSET(Start,$A76,37)),0)","v":0},{"$f":"IF(TODAY()-T$2>0,SUM(OFFSET(Start,$A76,18):OFFSET(Start,$A76,37)),0)","v":0},{"$f":"IF(TODAY()-U$2>0,SUM(OFFSET(Start,$A76,18):OFFSET(Start,$A76,37)),0)","v":0},{"$f":"IF(TODAY()-V$2>0,SUM(OFFSET(Start,$A76,18):OFFSET(Start,$A76,37)),0)","v":0},{"$f":"IF(TODAY()-W$2>0,SUM(OFFSET(Start,$A76,18):OFFSET(Start,$A76,37)),0)","v":0},{"$f":"IF(TODAY()-X$2>0,SUM(OFFSET(Start,$A76,18):OFFSET(Start,$A76,37)),0)","v":0},{"$f":"IF(TODAY()-Y$2>0,SUM(OFFSET(Start,$A76,18):OFFSET(Start,$A76,37)),0)","v":0},{"$f":"IF(TODAY()-Z$2>0,SUM(OFFSET(Start,$A76,18):OFFSET(Start,$A76,37)),0)","v":0},{"$f":"IF(TODAY()-AA$2>0,SUM(OFFSET(Start,$A76,18):OFFSET(Start,$A76,37)),0)","v":0},{"$f":"IF(TODAY()-AB$2>0,SUM(OFFSET(Start,$A76,18):OFFSET(Start,$A76,37)),0)","v":0},{"$f":"IF(TODAY()-AC$2>0,SUM(OFFSET(Start,$A76,18):OFFSET(Start,$A76,37)),0)","v":0},{"$f":"IF(TODAY()-AD$2>0,SUM(OFFSET(Start,$A76,18):OFFSET(Start,$A76,37)),0)","v":0},{"$f":"IF(TODAY()-AE$2>0,SUM(OFFSET(Start,$A76,18):OFFSET(Start,$A76,37)),0)","v":0},{"$f":"IF(TODAY()-AF$2>0,SUM(OFFSET(Start,$A76,18):OFFSET(Start,$A76,37)),0)","v":0},{"$f":"IF(TODAY()-AG$2>0,SUM(OFFSET(Start,$A76,18):OFFSET(Start,$A76,37)),0)","v":0},{"$f":"IF(TODAY()-AH$2>0,SUM(OFFSET(Start,$A76,18):OFFSET(Start,$A76,37)),0)","v":0},{"$f":"IF(TODAY()-AI$2>0,SUM(OFFSET(Start,$A76,18):OFFSET(Start,$A76,37)),0)","v":0},{"$f":"IF(TODAY()-AJ$2>0,SUM(OFFSET(Start,$A76,18):OFFSET(Start,$A76,37)),0)","v":0},{"$f":"IF(TODAY()-AK$2>0,SUM(OFFSET(Start,$A76,18):OFFSET(Start,$A76,37)),0)","v":0},{"$f":"IF(TODAY()-AL$2>0,SUM(OFFSET(Start,$A76,18):OFFSET(Start,$A76,37)),0)","v":0},0,0,0]
[76,{"$f":"OFFSET(Start,'Mellomlagring - antall besøk'!A77,0)","v":0},{"$f":"IF(TODAY()-C$2>0,SUM(OFFSET(Start,$A77,18):OFFSET(Start,$A77,37)),0)","v":0},{"$f":"IF(TODAY()-D$2>0,SUM(OFFSET(Start,$A77,18):OFFSET(Start,$A77,37)),0)","v":0},{"$f":"IF(TODAY()-E$2>0,SUM(OFFSET(Start,$A77,18):OFFSET(Start,$A77,37)),0)","v":0},{"$f":"IF(TODAY()-F$2>0,SUM(OFFSET(Start,$A77,18):OFFSET(Start,$A77,37)),0)","v":0},{"$f":"IF(TODAY()-G$2>0,SUM(OFFSET(Start,$A77,18):OFFSET(Start,$A77,37)),0)","v":0},{"$f":"IF(TODAY()-H$2>0,SUM(OFFSET(Start,$A77,18):OFFSET(Start,$A77,37)),0)","v":0},{"$f":"IF(TODAY()-I$2>0,SUM(OFFSET(Start,$A77,18):OFFSET(Start,$A77,37)),0)","v":0},{"$f":"IF(TODAY()-J$2>0,SUM(OFFSET(Start,$A77,18):OFFSET(Start,$A77,37)),0)","v":0},{"$f":"IF(TODAY()-K$2>0,SUM(OFFSET(Start,$A77,18):OFFSET(Start,$A77,37)),0)","v":0},{"$f":"IF(TODAY()-L$2>0,SUM(OFFSET(Start,$A77,18):OFFSET(Start,$A77,37)),0)","v":0},{"$f":"IF(TODAY()-M$2>0,SUM(OFFSET(Start,$A77,18):OFFSET(Start,$A77,37)),0)","v":0},{"$f":"IF(TODAY()-N$2>0,SUM(OFFSET(Start,$A77,18):OFFSET(Start,$A77,37)),0)","v":0},{"$f":"IF(TODAY()-O$2>0,SUM(OFFSET(Start,$A77,18):OFFSET(Start,$A77,37)),0)","v":0},{"$f":"IF(TODAY()-P$2>0,SUM(OFFSET(Start,$A77,18):OFFSET(Start,$A77,37)),0)","v":0},{"$f":"IF(TODAY()-Q$2>0,SUM(OFFSET(Start,$A77,18):OFFSET(Start,$A77,37)),0)","v":0},{"$f":"IF(TODAY()-R$2>0,SUM(OFFSET(Start,$A77,18):OFFSET(Start,$A77,37)),0)","v":0},{"$f":"IF(TODAY()-S$2>0,SUM(OFFSET(Start,$A77,18):OFFSET(Start,$A77,37)),0)","v":0},{"$f":"IF(TODAY()-T$2>0,SUM(OFFSET(Start,$A77,18):OFFSET(Start,$A77,37)),0)","v":0},{"$f":"IF(TODAY()-U$2>0,SUM(OFFSET(Start,$A77,18):OFFSET(Start,$A77,37)),0)","v":0},{"$f":"IF(TODAY()-V$2>0,SUM(OFFSET(Start,$A77,18):OFFSET(Start,$A77,37)),0)","v":0},{"$f":"IF(TODAY()-W$2>0,SUM(OFFSET(Start,$A77,18):OFFSET(Start,$A77,37)),0)","v":0},{"$f":"IF(TODAY()-X$2>0,SUM(OFFSET(Start,$A77,18):OFFSET(Start,$A77,37)),0)","v":0},{"$f":"IF(TODAY()-Y$2>0,SUM(OFFSET(Start,$A77,18):OFFSET(Start,$A77,37)),0)","v":0},{"$f":"IF(TODAY()-Z$2>0,SUM(OFFSET(Start,$A77,18):OFFSET(Start,$A77,37)),0)","v":0},{"$f":"IF(TODAY()-AA$2>0,SUM(OFFSET(Start,$A77,18):OFFSET(Start,$A77,37)),0)","v":0},{"$f":"IF(TODAY()-AB$2>0,SUM(OFFSET(Start,$A77,18):OFFSET(Start,$A77,37)),0)","v":0},{"$f":"IF(TODAY()-AC$2>0,SUM(OFFSET(Start,$A77,18):OFFSET(Start,$A77,37)),0)","v":0},{"$f":"IF(TODAY()-AD$2>0,SUM(OFFSET(Start,$A77,18):OFFSET(Start,$A77,37)),0)","v":0},{"$f":"IF(TODAY()-AE$2>0,SUM(OFFSET(Start,$A77,18):OFFSET(Start,$A77,37)),0)","v":0},{"$f":"IF(TODAY()-AF$2>0,SUM(OFFSET(Start,$A77,18):OFFSET(Start,$A77,37)),0)","v":0},{"$f":"IF(TODAY()-AG$2>0,SUM(OFFSET(Start,$A77,18):OFFSET(Start,$A77,37)),0)","v":0},{"$f":"IF(TODAY()-AH$2>0,SUM(OFFSET(Start,$A77,18):OFFSET(Start,$A77,37)),0)","v":0},{"$f":"IF(TODAY()-AI$2>0,SUM(OFFSET(Start,$A77,18):OFFSET(Start,$A77,37)),0)","v":0},{"$f":"IF(TODAY()-AJ$2>0,SUM(OFFSET(Start,$A77,18):OFFSET(Start,$A77,37)),0)","v":0},{"$f":"IF(TODAY()-AK$2>0,SUM(OFFSET(Start,$A77,18):OFFSET(Start,$A77,37)),0)","v":0},{"$f":"IF(TODAY()-AL$2>0,SUM(OFFSET(Start,$A77,18):OFFSET(Start,$A77,37)),0)","v":0},0,0,0]
[77,{"$f":"OFFSET(Start,'Mellomlagring - antall besøk'!A78,0)","v":0},{"$f":"IF(TODAY()-C$2>0,SUM(OFFSET(Start,$A78,18):OFFSET(Start,$A78,37)),0)","v":0},{"$f":"IF(TODAY()-D$2>0,SUM(OFFSET(Start,$A78,18):OFFSET(Start,$A78,37)),0)","v":0},{"$f":"IF(TODAY()-E$2>0,SUM(OFFSET(Start,$A78,18):OFFSET(Start,$A78,37)),0)","v":0},{"$f":"IF(TODAY()-F$2>0,SUM(OFFSET(Start,$A78,18):OFFSET(Start,$A78,37)),0)","v":0},{"$f":"IF(TODAY()-G$2>0,SUM(OFFSET(Start,$A78,18):OFFSET(Start,$A78,37)),0)","v":0},{"$f":"IF(TODAY()-H$2>0,SUM(OFFSET(Start,$A78,18):OFFSET(Start,$A78,37)),0)","v":0},{"$f":"IF(TODAY()-I$2>0,SUM(OFFSET(Start,$A78,18):OFFSET(Start,$A78,37)),0)","v":0},{"$f":"IF(TODAY()-J$2>0,SUM(OFFSET(Start,$A78,18):OFFSET(Start,$A78,37)),0)","v":0},{"$f":"IF(TODAY()-K$2>0,SUM(OFFSET(Start,$A78,18):OFFSET(Start,$A78,37)),0)","v":0},{"$f":"IF(TODAY()-L$2>0,SUM(OFFSET(Start,$A78,18):OFFSET(Start,$A78,37)),0)","v":0},{"$f":"IF(TODAY()-M$2>0,SUM(OFFSET(Start,$A78,18):OFFSET(Start,$A78,37)),0)","v":0},{"$f":"IF(TODAY()-N$2>0,SUM(OFFSET(Start,$A78,18):OFFSET(Start,$A78,37)),0)","v":0},{"$f":"IF(TODAY()-O$2>0,SUM(OFFSET(Start,$A78,18):OFFSET(Start,$A78,37)),0)","v":0},{"$f":"IF(TODAY()-P$2>0,SUM(OFFSET(Start,$A78,18):OFFSET(Start,$A78,37)),0)","v":0},{"$f":"IF(TODAY()-Q$2>0,SUM(OFFSET(Start,$A78,18):OFFSET(Start,$A78,37)),0)","v":0},{"$f":"IF(TODAY()-R$2>0,SUM(OFFSET(Start,$A78,18):OFFSET(Start,$A78,37)),0)","v":0},{"$f":"IF(TODAY()-S$2>0,SUM(OFFSET(Start,$A78,18):OFFSET(Start,$A78,37)),0)","v":0},{"$f":"IF(TODAY()-T$2>0,SUM(OFFSET(Start,$A78,18):OFFSET(Start,$A78,37)),0)","v":0},{"$f":"IF(TODAY()-U$2>0,SUM(OFFSET(Start,$A78,18):OFFSET(Start,$A78,37)),0)","v":0},{"$f":"IF(TODAY()-V$2>0,SUM(OFFSET(Start,$A78,18):OFFSET(Start,$A78,37)),0)","v":0},{"$f":"IF(TODAY()-W$2>0,SUM(OFFSET(Start,$A78,18):OFFSET(Start,$A78,37)),0)","v":0},{"$f":"IF(TODAY()-X$2>0,SUM(OFFSET(Start,$A78,18):OFFSET(Start,$A78,37)),0)","v":0},{"$f":"IF(TODAY()-Y$2>0,SUM(OFFSET(Start,$A78,18):OFFSET(Start,$A78,37)),0)","v":0},{"$f":"IF(TODAY()-Z$2>0,SUM(OFFSET(Start,$A78,18):OFFSET(Start,$A78,37)),0)","v":0},{"$f":"IF(TODAY()-AA$2>0,SUM(OFFSET(Start,$A78,18):OFFSET(Start,$A78,37)),0)","v":0},{"$f":"IF(TODAY()-AB$2>0,SUM(OFFSET(Start,$A78,18):OFFSET(Start,$A78,37)),0)","v":0},{"$f":"IF(TODAY()-AC$2>0,SUM(OFFSET(Start,$A78,18):OFFSET(Start,$A78,37)),0)","v":0},{"$f":"IF(TODAY()-AD$2>0,SUM(OFFSET(Start,$A78,18):OFFSET(Start,$A78,37)),0)","v":0},{"$f":"IF(TODAY()-AE$2>0,SUM(OFFSET(Start,$A78,18):OFFSET(Start,$A78,37)),0)","v":0},{"$f":"IF(TODAY()-AF$2>0,SUM(OFFSET(Start,$A78,18):OFFSET(Start,$A78,37)),0)","v":0},{"$f":"IF(TODAY()-AG$2>0,SUM(OFFSET(Start,$A78,18):OFFSET(Start,$A78,37)),0)","v":0},{"$f":"IF(TODAY()-AH$2>0,SUM(OFFSET(Start,$A78,18):OFFSET(Start,$A78,37)),0)","v":0},{"$f":"IF(TODAY()-AI$2>0,SUM(OFFSET(Start,$A78,18):OFFSET(Start,$A78,37)),0)","v":0},{"$f":"IF(TODAY()-AJ$2>0,SUM(OFFSET(Start,$A78,18):OFFSET(Start,$A78,37)),0)","v":0},{"$f":"IF(TODAY()-AK$2>0,SUM(OFFSET(Start,$A78,18):OFFSET(Start,$A78,37)),0)","v":0},{"$f":"IF(TODAY()-AL$2>0,SUM(OFFSET(Start,$A78,18):OFFSET(Start,$A78,37)),0)","v":0},0,0,0]
[78,{"$f":"OFFSET(Start,'Mellomlagring - antall besøk'!A79,0)","v":0},{"$f":"IF(TODAY()-C$2>0,SUM(OFFSET(Start,$A79,18):OFFSET(Start,$A79,37)),0)","v":0},{"$f":"IF(TODAY()-D$2>0,SUM(OFFSET(Start,$A79,18):OFFSET(Start,$A79,37)),0)","v":0},{"$f":"IF(TODAY()-E$2>0,SUM(OFFSET(Start,$A79,18):OFFSET(Start,$A79,37)),0)","v":0},{"$f":"IF(TODAY()-F$2>0,SUM(OFFSET(Start,$A79,18):OFFSET(Start,$A79,37)),0)","v":0},{"$f":"IF(TODAY()-G$2>0,SUM(OFFSET(Start,$A79,18):OFFSET(Start,$A79,37)),0)","v":0},{"$f":"IF(TODAY()-H$2>0,SUM(OFFSET(Start,$A79,18):OFFSET(Start,$A79,37)),0)","v":0},{"$f":"IF(TODAY()-I$2>0,SUM(OFFSET(Start,$A79,18):OFFSET(Start,$A79,37)),0)","v":0},{"$f":"IF(TODAY()-J$2>0,SUM(OFFSET(Start,$A79,18):OFFSET(Start,$A79,37)),0)","v":0},{"$f":"IF(TODAY()-K$2>0,SUM(OFFSET(Start,$A79,18):OFFSET(Start,$A79,37)),0)","v":0},{"$f":"IF(TODAY()-L$2>0,SUM(OFFSET(Start,$A79,18):OFFSET(Start,$A79,37)),0)","v":0},{"$f":"IF(TODAY()-M$2>0,SUM(OFFSET(Start,$A79,18):OFFSET(Start,$A79,37)),0)","v":0},{"$f":"IF(TODAY()-N$2>0,SUM(OFFSET(Start,$A79,18):OFFSET(Start,$A79,37)),0)","v":0},{"$f":"IF(TODAY()-O$2>0,SUM(OFFSET(Start,$A79,18):OFFSET(Start,$A79,37)),0)","v":0},{"$f":"IF(TODAY()-P$2>0,SUM(OFFSET(Start,$A79,18):OFFSET(Start,$A79,37)),0)","v":0},{"$f":"IF(TODAY()-Q$2>0,SUM(OFFSET(Start,$A79,18):OFFSET(Start,$A79,37)),0)","v":0},{"$f":"IF(TODAY()-R$2>0,SUM(OFFSET(Start,$A79,18):OFFSET(Start,$A79,37)),0)","v":0},{"$f":"IF(TODAY()-S$2>0,SUM(OFFSET(Start,$A79,18):OFFSET(Start,$A79,37)),0)","v":0},{"$f":"IF(TODAY()-T$2>0,SUM(OFFSET(Start,$A79,18):OFFSET(Start,$A79,37)),0)","v":0},{"$f":"IF(TODAY()-U$2>0,SUM(OFFSET(Start,$A79,18):OFFSET(Start,$A79,37)),0)","v":0},{"$f":"IF(TODAY()-V$2>0,SUM(OFFSET(Start,$A79,18):OFFSET(Start,$A79,37)),0)","v":0},{"$f":"IF(TODAY()-W$2>0,SUM(OFFSET(Start,$A79,18):OFFSET(Start,$A79,37)),0)","v":0},{"$f":"IF(TODAY()-X$2>0,SUM(OFFSET(Start,$A79,18):OFFSET(Start,$A79,37)),0)","v":0},{"$f":"IF(TODAY()-Y$2>0,SUM(OFFSET(Start,$A79,18):OFFSET(Start,$A79,37)),0)","v":0},{"$f":"IF(TODAY()-Z$2>0,SUM(OFFSET(Start,$A79,18):OFFSET(Start,$A79,37)),0)","v":0},{"$f":"IF(TODAY()-AA$2>0,SUM(OFFSET(Start,$A79,18):OFFSET(Start,$A79,37)),0)","v":0},{"$f":"IF(TODAY()-AB$2>0,SUM(OFFSET(Start,$A79,18):OFFSET(Start,$A79,37)),0)","v":0},{"$f":"IF(TODAY()-AC$2>0,SUM(OFFSET(Start,$A79,18):OFFSET(Start,$A79,37)),0)","v":0},{"$f":"IF(TODAY()-AD$2>0,SUM(OFFSET(Start,$A79,18):OFFSET(Start,$A79,37)),0)","v":0},{"$f":"IF(TODAY()-AE$2>0,SUM(OFFSET(Start,$A79,18):OFFSET(Start,$A79,37)),0)","v":0},{"$f":"IF(TODAY()-AF$2>0,SUM(OFFSET(Start,$A79,18):OFFSET(Start,$A79,37)),0)","v":0},{"$f":"IF(TODAY()-AG$2>0,SUM(OFFSET(Start,$A79,18):OFFSET(Start,$A79,37)),0)","v":0},{"$f":"IF(TODAY()-AH$2>0,SUM(OFFSET(Start,$A79,18):OFFSET(Start,$A79,37)),0)","v":0},{"$f":"IF(TODAY()-AI$2>0,SUM(OFFSET(Start,$A79,18):OFFSET(Start,$A79,37)),0)","v":0},{"$f":"IF(TODAY()-AJ$2>0,SUM(OFFSET(Start,$A79,18):OFFSET(Start,$A79,37)),0)","v":0},{"$f":"IF(TODAY()-AK$2>0,SUM(OFFSET(Start,$A79,18):OFFSET(Start,$A79,37)),0)","v":0},{"$f":"IF(TODAY()-AL$2>0,SUM(OFFSET(Start,$A79,18):OFFSET(Start,$A79,37)),0)","v":0},0,0,0]
[79,{"$f":"OFFSET(Start,'Mellomlagring - antall besøk'!A80,0)","v":0},{"$f":"IF(TODAY()-C$2>0,SUM(OFFSET(Start,$A80,18):OFFSET(Start,$A80,37)),0)","v":0},{"$f":"IF(TODAY()-D$2>0,SUM(OFFSET(Start,$A80,18):OFFSET(Start,$A80,37)),0)","v":0},{"$f":"IF(TODAY()-E$2>0,SUM(OFFSET(Start,$A80,18):OFFSET(Start,$A80,37)),0)","v":0},{"$f":"IF(TODAY()-F$2>0,SUM(OFFSET(Start,$A80,18):OFFSET(Start,$A80,37)),0)","v":0},{"$f":"IF(TODAY()-G$2>0,SUM(OFFSET(Start,$A80,18):OFFSET(Start,$A80,37)),0)","v":0},{"$f":"IF(TODAY()-H$2>0,SUM(OFFSET(Start,$A80,18):OFFSET(Start,$A80,37)),0)","v":0},{"$f":"IF(TODAY()-I$2>0,SUM(OFFSET(Start,$A80,18):OFFSET(Start,$A80,37)),0)","v":0},{"$f":"IF(TODAY()-J$2>0,SUM(OFFSET(Start,$A80,18):OFFSET(Start,$A80,37)),0)","v":0},{"$f":"IF(TODAY()-K$2>0,SUM(OFFSET(Start,$A80,18):OFFSET(Start,$A80,37)),0)","v":0},{"$f":"IF(TODAY()-L$2>0,SUM(OFFSET(Start,$A80,18):OFFSET(Start,$A80,37)),0)","v":0},{"$f":"IF(TODAY()-M$2>0,SUM(OFFSET(Start,$A80,18):OFFSET(Start,$A80,37)),0)","v":0},{"$f":"IF(TODAY()-N$2>0,SUM(OFFSET(Start,$A80,18):OFFSET(Start,$A80,37)),0)","v":0},{"$f":"IF(TODAY()-O$2>0,SUM(OFFSET(Start,$A80,18):OFFSET(Start,$A80,37)),0)","v":0},{"$f":"IF(TODAY()-P$2>0,SUM(OFFSET(Start,$A80,18):OFFSET(Start,$A80,37)),0)","v":0},{"$f":"IF(TODAY()-Q$2>0,SUM(OFFSET(Start,$A80,18):OFFSET(Start,$A80,37)),0)","v":0},{"$f":"IF(TODAY()-R$2>0,SUM(OFFSET(Start,$A80,18):OFFSET(Start,$A80,37)),0)","v":0},{"$f":"IF(TODAY()-S$2>0,SUM(OFFSET(Start,$A80,18):OFFSET(Start,$A80,37)),0)","v":0},{"$f":"IF(TODAY()-T$2>0,SUM(OFFSET(Start,$A80,18):OFFSET(Start,$A80,37)),0)","v":0},{"$f":"IF(TODAY()-U$2>0,SUM(OFFSET(Start,$A80,18):OFFSET(Start,$A80,37)),0)","v":0},{"$f":"IF(TODAY()-V$2>0,SUM(OFFSET(Start,$A80,18):OFFSET(Start,$A80,37)),0)","v":0},{"$f":"IF(TODAY()-W$2>0,SUM(OFFSET(Start,$A80,18):OFFSET(Start,$A80,37)),0)","v":0},{"$f":"IF(TODAY()-X$2>0,SUM(OFFSET(Start,$A80,18):OFFSET(Start,$A80,37)),0)","v":0},{"$f":"IF(TODAY()-Y$2>0,SUM(OFFSET(Start,$A80,18):OFFSET(Start,$A80,37)),0)","v":0},{"$f":"IF(TODAY()-Z$2>0,SUM(OFFSET(Start,$A80,18):OFFSET(Start,$A80,37)),0)","v":0},{"$f":"IF(TODAY()-AA$2>0,SUM(OFFSET(Start,$A80,18):OFFSET(Start,$A80,37)),0)","v":0},{"$f":"IF(TODAY()-AB$2>0,SUM(OFFSET(Start,$A80,18):OFFSET(Start,$A80,37)),0)","v":0},{"$f":"IF(TODAY()-AC$2>0,SUM(OFFSET(Start,$A80,18):OFFSET(Start,$A80,37)),0)","v":0},{"$f":"IF(TODAY()-AD$2>0,SUM(OFFSET(Start,$A80,18):OFFSET(Start,$A80,37)),0)","v":0},{"$f":"IF(TODAY()-AE$2>0,SUM(OFFSET(Start,$A80,18):OFFSET(Start,$A80,37)),0)","v":0},{"$f":"IF(TODAY()-AF$2>0,SUM(OFFSET(Start,$A80,18):OFFSET(Start,$A80,37)),0)","v":0},{"$f":"IF(TODAY()-AG$2>0,SUM(OFFSET(Start,$A80,18):OFFSET(Start,$A80,37)),0)","v":0},{"$f":"IF(TODAY()-AH$2>0,SUM(OFFSET(Start,$A80,18):OFFSET(Start,$A80,37)),0)","v":0},{"$f":"IF(TODAY()-AI$2>0,SUM(OFFSET(Start,$A80,18):OFFSET(Start,$A80,37)),0)","v":0},{"$f":"IF(TODAY()-AJ$2>0,SUM(OFFSET(Start,$A80,18):OFFSET(Start,$A80,37)),0)","v":0},{"$f":"IF(TODAY()-AK$2>0,SUM(OFFSET(Start,$A80,18):OFFSET(Start,$A80,37)),0)","v":0},{"$f":"IF(TODAY()-AL$2>0,SUM(OFFSET(Start,$A80,18):OFFSET(Start,$A80,37)),0)","v":0},0,0,0]
[80,{"$f":"OFFSET(Start,'Mellomlagring - antall besøk'!A81,0)","v":0},{"$f":"IF(TODAY()-C$2>0,SUM(OFFSET(Start,$A81,18):OFFSET(Start,$A81,37)),0)","v":0},{"$f":"IF(TODAY()-D$2>0,SUM(OFFSET(Start,$A81,18):OFFSET(Start,$A81,37)),0)","v":0},{"$f":"IF(TODAY()-E$2>0,SUM(OFFSET(Start,$A81,18):OFFSET(Start,$A81,37)),0)","v":0},{"$f":"IF(TODAY()-F$2>0,SUM(OFFSET(Start,$A81,18):OFFSET(Start,$A81,37)),0)","v":0},{"$f":"IF(TODAY()-G$2>0,SUM(OFFSET(Start,$A81,18):OFFSET(Start,$A81,37)),0)","v":0},{"$f":"IF(TODAY()-H$2>0,SUM(OFFSET(Start,$A81,18):OFFSET(Start,$A81,37)),0)","v":0},{"$f":"IF(TODAY()-I$2>0,SUM(OFFSET(Start,$A81,18):OFFSET(Start,$A81,37)),0)","v":0},{"$f":"IF(TODAY()-J$2>0,SUM(OFFSET(Start,$A81,18):OFFSET(Start,$A81,37)),0)","v":0},{"$f":"IF(TODAY()-K$2>0,SUM(OFFSET(Start,$A81,18):OFFSET(Start,$A81,37)),0)","v":0},{"$f":"IF(TODAY()-L$2>0,SUM(OFFSET(Start,$A81,18):OFFSET(Start,$A81,37)),0)","v":0},{"$f":"IF(TODAY()-M$2>0,SUM(OFFSET(Start,$A81,18):OFFSET(Start,$A81,37)),0)","v":0},{"$f":"IF(TODAY()-N$2>0,SUM(OFFSET(Start,$A81,18):OFFSET(Start,$A81,37)),0)","v":0},{"$f":"IF(TODAY()-O$2>0,SUM(OFFSET(Start,$A81,18):OFFSET(Start,$A81,37)),0)","v":0},{"$f":"IF(TODAY()-P$2>0,SUM(OFFSET(Start,$A81,18):OFFSET(Start,$A81,37)),0)","v":0},{"$f":"IF(TODAY()-Q$2>0,SUM(OFFSET(Start,$A81,18):OFFSET(Start,$A81,37)),0)","v":0},{"$f":"IF(TODAY()-R$2>0,SUM(OFFSET(Start,$A81,18):OFFSET(Start,$A81,37)),0)","v":0},{"$f":"IF(TODAY()-S$2>0,SUM(OFFSET(Start,$A81,18):OFFSET(Start,$A81,37)),0)","v":0},{"$f":"IF(TODAY()-T$2>0,SUM(OFFSET(Start,$A81,18):OFFSET(Start,$A81,37)),0)","v":0},{"$f":"IF(TODAY()-U$2>0,SUM(OFFSET(Start,$A81,18):OFFSET(Start,$A81,37)),0)","v":0},{"$f":"IF(TODAY()-V$2>0,SUM(OFFSET(Start,$A81,18):OFFSET(Start,$A81,37)),0)","v":0},{"$f":"IF(TODAY()-W$2>0,SUM(OFFSET(Start,$A81,18):OFFSET(Start,$A81,37)),0)","v":0},{"$f":"IF(TODAY()-X$2>0,SUM(OFFSET(Start,$A81,18):OFFSET(Start,$A81,37)),0)","v":0},{"$f":"IF(TODAY()-Y$2>0,SUM(OFFSET(Start,$A81,18):OFFSET(Start,$A81,37)),0)","v":0},{"$f":"IF(TODAY()-Z$2>0,SUM(OFFSET(Start,$A81,18):OFFSET(Start,$A81,37)),0)","v":0},{"$f":"IF(TODAY()-AA$2>0,SUM(OFFSET(Start,$A81,18):OFFSET(Start,$A81,37)),0)","v":0},{"$f":"IF(TODAY()-AB$2>0,SUM(OFFSET(Start,$A81,18):OFFSET(Start,$A81,37)),0)","v":0},{"$f":"IF(TODAY()-AC$2>0,SUM(OFFSET(Start,$A81,18):OFFSET(Start,$A81,37)),0)","v":0},{"$f":"IF(TODAY()-AD$2>0,SUM(OFFSET(Start,$A81,18):OFFSET(Start,$A81,37)),0)","v":0},{"$f":"IF(TODAY()-AE$2>0,SUM(OFFSET(Start,$A81,18):OFFSET(Start,$A81,37)),0)","v":0},{"$f":"IF(TODAY()-AF$2>0,SUM(OFFSET(Start,$A81,18):OFFSET(Start,$A81,37)),0)","v":0},{"$f":"IF(TODAY()-AG$2>0,SUM(OFFSET(Start,$A81,18):OFFSET(Start,$A81,37)),0)","v":0},{"$f":"IF(TODAY()-AH$2>0,SUM(OFFSET(Start,$A81,18):OFFSET(Start,$A81,37)),0)","v":0},{"$f":"IF(TODAY()-AI$2>0,SUM(OFFSET(Start,$A81,18):OFFSET(Start,$A81,37)),0)","v":0},{"$f":"IF(TODAY()-AJ$2>0,SUM(OFFSET(Start,$A81,18):OFFSET(Start,$A81,37)),0)","v":0},{"$f":"IF(TODAY()-AK$2>0,SUM(OFFSET(Start,$A81,18):OFFSET(Start,$A81,37)),0)","v":0},{"$f":"IF(TODAY()-AL$2>0,SUM(OFFSET(Start,$A81,18):OFFSET(Start,$A81,37)),0)","v":0},0,0,0]
[81,{"$f":"OFFSET(Start,'Mellomlagring - antall besøk'!A82,0)","v":0},{"$f":"IF(TODAY()-C$2>0,SUM(OFFSET(Start,$A82,18):OFFSET(Start,$A82,37)),0)","v":0},{"$f":"IF(TODAY()-D$2>0,SUM(OFFSET(Start,$A82,18):OFFSET(Start,$A82,37)),0)","v":0},{"$f":"IF(TODAY()-E$2>0,SUM(OFFSET(Start,$A82,18):OFFSET(Start,$A82,37)),0)","v":0},{"$f":"IF(TODAY()-F$2>0,SUM(OFFSET(Start,$A82,18):OFFSET(Start,$A82,37)),0)","v":0},{"$f":"IF(TODAY()-G$2>0,SUM(OFFSET(Start,$A82,18):OFFSET(Start,$A82,37)),0)","v":0},{"$f":"IF(TODAY()-H$2>0,SUM(OFFSET(Start,$A82,18):OFFSET(Start,$A82,37)),0)","v":0},{"$f":"IF(TODAY()-I$2>0,SUM(OFFSET(Start,$A82,18):OFFSET(Start,$A82,37)),0)","v":0},{"$f":"IF(TODAY()-J$2>0,SUM(OFFSET(Start,$A82,18):OFFSET(Start,$A82,37)),0)","v":0},{"$f":"IF(TODAY()-K$2>0,SUM(OFFSET(Start,$A82,18):OFFSET(Start,$A82,37)),0)","v":0},{"$f":"IF(TODAY()-L$2>0,SUM(OFFSET(Start,$A82,18):OFFSET(Start,$A82,37)),0)","v":0},{"$f":"IF(TODAY()-M$2>0,SUM(OFFSET(Start,$A82,18):OFFSET(Start,$A82,37)),0)","v":0},{"$f":"IF(TODAY()-N$2>0,SUM(OFFSET(Start,$A82,18):OFFSET(Start,$A82,37)),0)","v":0},{"$f":"IF(TODAY()-O$2>0,SUM(OFFSET(Start,$A82,18):OFFSET(Start,$A82,37)),0)","v":0},{"$f":"IF(TODAY()-P$2>0,SUM(OFFSET(Start,$A82,18):OFFSET(Start,$A82,37)),0)","v":0},{"$f":"IF(TODAY()-Q$2>0,SUM(OFFSET(Start,$A82,18):OFFSET(Start,$A82,37)),0)","v":0},{"$f":"IF(TODAY()-R$2>0,SUM(OFFSET(Start,$A82,18):OFFSET(Start,$A82,37)),0)","v":0},{"$f":"IF(TODAY()-S$2>0,SUM(OFFSET(Start,$A82,18):OFFSET(Start,$A82,37)),0)","v":0},{"$f":"IF(TODAY()-T$2>0,SUM(OFFSET(Start,$A82,18):OFFSET(Start,$A82,37)),0)","v":0},{"$f":"IF(TODAY()-U$2>0,SUM(OFFSET(Start,$A82,18):OFFSET(Start,$A82,37)),0)","v":0},{"$f":"IF(TODAY()-V$2>0,SUM(OFFSET(Start,$A82,18):OFFSET(Start,$A82,37)),0)","v":0},{"$f":"IF(TODAY()-W$2>0,SUM(OFFSET(Start,$A82,18):OFFSET(Start,$A82,37)),0)","v":0},{"$f":"IF(TODAY()-X$2>0,SUM(OFFSET(Start,$A82,18):OFFSET(Start,$A82,37)),0)","v":0},{"$f":"IF(TODAY()-Y$2>0,SUM(OFFSET(Start,$A82,18):OFFSET(Start,$A82,37)),0)","v":0},{"$f":"IF(TODAY()-Z$2>0,SUM(OFFSET(Start,$A82,18):OFFSET(Start,$A82,37)),0)","v":0},{"$f":"IF(TODAY()-AA$2>0,SUM(OFFSET(Start,$A82,18):OFFSET(Start,$A82,37)),0)","v":0},{"$f":"IF(TODAY()-AB$2>0,SUM(OFFSET(Start,$A82,18):OFFSET(Start,$A82,37)),0)","v":0},{"$f":"IF(TODAY()-AC$2>0,SUM(OFFSET(Start,$A82,18):OFFSET(Start,$A82,37)),0)","v":0},{"$f":"IF(TODAY()-AD$2>0,SUM(OFFSET(Start,$A82,18):OFFSET(Start,$A82,37)),0)","v":0},{"$f":"IF(TODAY()-AE$2>0,SUM(OFFSET(Start,$A82,18):OFFSET(Start,$A82,37)),0)","v":0},{"$f":"IF(TODAY()-AF$2>0,SUM(OFFSET(Start,$A82,18):OFFSET(Start,$A82,37)),0)","v":0},{"$f":"IF(TODAY()-AG$2>0,SUM(OFFSET(Start,$A82,18):OFFSET(Start,$A82,37)),0)","v":0},{"$f":"IF(TODAY()-AH$2>0,SUM(OFFSET(Start,$A82,18):OFFSET(Start,$A82,37)),0)","v":0},{"$f":"IF(TODAY()-AI$2>0,SUM(OFFSET(Start,$A82,18):OFFSET(Start,$A82,37)),0)","v":0},{"$f":"IF(TODAY()-AJ$2>0,SUM(OFFSET(Start,$A82,18):OFFSET(Start,$A82,37)),0)","v":0},{"$f":"IF(TODAY()-AK$2>0,SUM(OFFSET(Start,$A82,18):OFFSET(Start,$A82,37)),0)","v":0},{"$f":"IF(TODAY()-AL$2>0,SUM(OFFSET(Start,$A82,18):OFFSET(Start,$A82,37)),0)","v":0},0,0,0]
[82,{"$f":"OFFSET(Start,'Mellomlagring - antall besøk'!A83,0)","v":0},{"$f":"IF(TODAY()-C$2>0,SUM(OFFSET(Start,$A83,18):OFFSET(Start,$A83,37)),0)","v":0},{"$f":"IF(TODAY()-D$2>0,SUM(OFFSET(Start,$A83,18):OFFSET(Start,$A83,37)),0)","v":0},{"$f":"IF(TODAY()-E$2>0,SUM(OFFSET(Start,$A83,18):OFFSET(Start,$A83,37)),0)","v":0},{"$f":"IF(TODAY()-F$2>0,SUM(OFFSET(Start,$A83,18):OFFSET(Start,$A83,37)),0)","v":0},{"$f":"IF(TODAY()-G$2>0,SUM(OFFSET(Start,$A83,18):OFFSET(Start,$A83,37)),0)","v":0},{"$f":"IF(TODAY()-H$2>0,SUM(OFFSET(Start,$A83,18):OFFSET(Start,$A83,37)),0)","v":0},{"$f":"IF(TODAY()-I$2>0,SUM(OFFSET(Start,$A83,18):OFFSET(Start,$A83,37)),0)","v":0},{"$f":"IF(TODAY()-J$2>0,SUM(OFFSET(Start,$A83,18):OFFSET(Start,$A83,37)),0)","v":0},{"$f":"IF(TODAY()-K$2>0,SUM(OFFSET(Start,$A83,18):OFFSET(Start,$A83,37)),0)","v":0},{"$f":"IF(TODAY()-L$2>0,SUM(OFFSET(Start,$A83,18):OFFSET(Start,$A83,37)),0)","v":0},{"$f":"IF(TODAY()-M$2>0,SUM(OFFSET(Start,$A83,18):OFFSET(Start,$A83,37)),0)","v":0},{"$f":"IF(TODAY()-N$2>0,SUM(OFFSET(Start,$A83,18):OFFSET(Start,$A83,37)),0)","v":0},{"$f":"IF(TODAY()-O$2>0,SUM(OFFSET(Start,$A83,18):OFFSET(Start,$A83,37)),0)","v":0},{"$f":"IF(TODAY()-P$2>0,SUM(OFFSET(Start,$A83,18):OFFSET(Start,$A83,37)),0)","v":0},{"$f":"IF(TODAY()-Q$2>0,SUM(OFFSET(Start,$A83,18):OFFSET(Start,$A83,37)),0)","v":0},{"$f":"IF(TODAY()-R$2>0,SUM(OFFSET(Start,$A83,18):OFFSET(Start,$A83,37)),0)","v":0},{"$f":"IF(TODAY()-S$2>0,SUM(OFFSET(Start,$A83,18):OFFSET(Start,$A83,37)),0)","v":0},{"$f":"IF(TODAY()-T$2>0,SUM(OFFSET(Start,$A83,18):OFFSET(Start,$A83,37)),0)","v":0},{"$f":"IF(TODAY()-U$2>0,SUM(OFFSET(Start,$A83,18):OFFSET(Start,$A83,37)),0)","v":0},{"$f":"IF(TODAY()-V$2>0,SUM(OFFSET(Start,$A83,18):OFFSET(Start,$A83,37)),0)","v":0},{"$f":"IF(TODAY()-W$2>0,SUM(OFFSET(Start,$A83,18):OFFSET(Start,$A83,37)),0)","v":0},{"$f":"IF(TODAY()-X$2>0,SUM(OFFSET(Start,$A83,18):OFFSET(Start,$A83,37)),0)","v":0},{"$f":"IF(TODAY()-Y$2>0,SUM(OFFSET(Start,$A83,18):OFFSET(Start,$A83,37)),0)","v":0},{"$f":"IF(TODAY()-Z$2>0,SUM(OFFSET(Start,$A83,18):OFFSET(Start,$A83,37)),0)","v":0},{"$f":"IF(TODAY()-AA$2>0,SUM(OFFSET(Start,$A83,18):OFFSET(Start,$A83,37)),0)","v":0},{"$f":"IF(TODAY()-AB$2>0,SUM(OFFSET(Start,$A83,18):OFFSET(Start,$A83,37)),0)","v":0},{"$f":"IF(TODAY()-AC$2>0,SUM(OFFSET(Start,$A83,18):OFFSET(Start,$A83,37)),0)","v":0},{"$f":"IF(TODAY()-AD$2>0,SUM(OFFSET(Start,$A83,18):OFFSET(Start,$A83,37)),0)","v":0},{"$f":"IF(TODAY()-AE$2>0,SUM(OFFSET(Start,$A83,18):OFFSET(Start,$A83,37)),0)","v":0},{"$f":"IF(TODAY()-AF$2>0,SUM(OFFSET(Start,$A83,18):OFFSET(Start,$A83,37)),0)","v":0},{"$f":"IF(TODAY()-AG$2>0,SUM(OFFSET(Start,$A83,18):OFFSET(Start,$A83,37)),0)","v":0},{"$f":"IF(TODAY()-AH$2>0,SUM(OFFSET(Start,$A83,18):OFFSET(Start,$A83,37)),0)","v":0},{"$f":"IF(TODAY()-AI$2>0,SUM(OFFSET(Start,$A83,18):OFFSET(Start,$A83,37)),0)","v":0},{"$f":"IF(TODAY()-AJ$2>0,SUM(OFFSET(Start,$A83,18):OFFSET(Start,$A83,37)),0)","v":0},{"$f":"IF(TODAY()-AK$2>0,SUM(OFFSET(Start,$A83,18):OFFSET(Start,$A83,37)),0)","v":0},{"$f":"IF(TODAY()-AL$2>0,SUM(OFFSET(Start,$A83,18):OFFSET(Start,$A83,37)),0)","v":0},0,0,0]
[83,{"$f":"OFFSET(Start,'Mellomlagring - antall besøk'!A84,0)","v":0},{"$f":"IF(TODAY()-C$2>0,SUM(OFFSET(Start,$A84,18):OFFSET(Start,$A84,37)),0)","v":0},{"$f":"IF(TODAY()-D$2>0,SUM(OFFSET(Start,$A84,18):OFFSET(Start,$A84,37)),0)","v":0},{"$f":"IF(TODAY()-E$2>0,SUM(OFFSET(Start,$A84,18):OFFSET(Start,$A84,37)),0)","v":0},{"$f":"IF(TODAY()-F$2>0,SUM(OFFSET(Start,$A84,18):OFFSET(Start,$A84,37)),0)","v":0},{"$f":"IF(TODAY()-G$2>0,SUM(OFFSET(Start,$A84,18):OFFSET(Start,$A84,37)),0)","v":0},{"$f":"IF(TODAY()-H$2>0,SUM(OFFSET(Start,$A84,18):OFFSET(Start,$A84,37)),0)","v":0},{"$f":"IF(TODAY()-I$2>0,SUM(OFFSET(Start,$A84,18):OFFSET(Start,$A84,37)),0)","v":0},{"$f":"IF(TODAY()-J$2>0,SUM(OFFSET(Start,$A84,18):OFFSET(Start,$A84,37)),0)","v":0},{"$f":"IF(TODAY()-K$2>0,SUM(OFFSET(Start,$A84,18):OFFSET(Start,$A84,37)),0)","v":0},{"$f":"IF(TODAY()-L$2>0,SUM(OFFSET(Start,$A84,18):OFFSET(Start,$A84,37)),0)","v":0},{"$f":"IF(TODAY()-M$2>0,SUM(OFFSET(Start,$A84,18):OFFSET(Start,$A84,37)),0)","v":0},{"$f":"IF(TODAY()-N$2>0,SUM(OFFSET(Start,$A84,18):OFFSET(Start,$A84,37)),0)","v":0},{"$f":"IF(TODAY()-O$2>0,SUM(OFFSET(Start,$A84,18):OFFSET(Start,$A84,37)),0)","v":0},{"$f":"IF(TODAY()-P$2>0,SUM(OFFSET(Start,$A84,18):OFFSET(Start,$A84,37)),0)","v":0},{"$f":"IF(TODAY()-Q$2>0,SUM(OFFSET(Start,$A84,18):OFFSET(Start,$A84,37)),0)","v":0},{"$f":"IF(TODAY()-R$2>0,SUM(OFFSET(Start,$A84,18):OFFSET(Start,$A84,37)),0)","v":0},{"$f":"IF(TODAY()-S$2>0,SUM(OFFSET(Start,$A84,18):OFFSET(Start,$A84,37)),0)","v":0},{"$f":"IF(TODAY()-T$2>0,SUM(OFFSET(Start,$A84,18):OFFSET(Start,$A84,37)),0)","v":0},{"$f":"IF(TODAY()-U$2>0,SUM(OFFSET(Start,$A84,18):OFFSET(Start,$A84,37)),0)","v":0},{"$f":"IF(TODAY()-V$2>0,SUM(OFFSET(Start,$A84,18):OFFSET(Start,$A84,37)),0)","v":0},{"$f":"IF(TODAY()-W$2>0,SUM(OFFSET(Start,$A84,18):OFFSET(Start,$A84,37)),0)","v":0},{"$f":"IF(TODAY()-X$2>0,SUM(OFFSET(Start,$A84,18):OFFSET(Start,$A84,37)),0)","v":0},{"$f":"IF(TODAY()-Y$2>0,SUM(OFFSET(Start,$A84,18):OFFSET(Start,$A84,37)),0)","v":0},{"$f":"IF(TODAY()-Z$2>0,SUM(OFFSET(Start,$A84,18):OFFSET(Start,$A84,37)),0)","v":0},{"$f":"IF(TODAY()-AA$2>0,SUM(OFFSET(Start,$A84,18):OFFSET(Start,$A84,37)),0)","v":0},{"$f":"IF(TODAY()-AB$2>0,SUM(OFFSET(Start,$A84,18):OFFSET(Start,$A84,37)),0)","v":0},{"$f":"IF(TODAY()-AC$2>0,SUM(OFFSET(Start,$A84,18):OFFSET(Start,$A84,37)),0)","v":0},{"$f":"IF(TODAY()-AD$2>0,SUM(OFFSET(Start,$A84,18):OFFSET(Start,$A84,37)),0)","v":0},{"$f":"IF(TODAY()-AE$2>0,SUM(OFFSET(Start,$A84,18):OFFSET(Start,$A84,37)),0)","v":0},{"$f":"IF(TODAY()-AF$2>0,SUM(OFFSET(Start,$A84,18):OFFSET(Start,$A84,37)),0)","v":0},{"$f":"IF(TODAY()-AG$2>0,SUM(OFFSET(Start,$A84,18):OFFSET(Start,$A84,37)),0)","v":0},{"$f":"IF(TODAY()-AH$2>0,SUM(OFFSET(Start,$A84,18):OFFSET(Start,$A84,37)),0)","v":0},{"$f":"IF(TODAY()-AI$2>0,SUM(OFFSET(Start,$A84,18):OFFSET(Start,$A84,37)),0)","v":0},{"$f":"IF(TODAY()-AJ$2>0,SUM(OFFSET(Start,$A84,18):OFFSET(Start,$A84,37)),0)","v":0},{"$f":"IF(TODAY()-AK$2>0,SUM(OFFSET(Start,$A84,18):OFFSET(Start,$A84,37)),0)","v":0},{"$f":"IF(TODAY()-AL$2>0,SUM(OFFSET(Start,$A84,18):OFFSET(Start,$A84,37)),0)","v":0},0,0,0]
[84,{"$f":"OFFSET(Start,'Mellomlagring - antall besøk'!A85,0)","v":0},{"$f":"IF(TODAY()-C$2>0,SUM(OFFSET(Start,$A85,18):OFFSET(Start,$A85,37)),0)","v":0},{"$f":"IF(TODAY()-D$2>0,SUM(OFFSET(Start,$A85,18):OFFSET(Start,$A85,37)),0)","v":0},{"$f":"IF(TODAY()-E$2>0,SUM(OFFSET(Start,$A85,18):OFFSET(Start,$A85,37)),0)","v":0},{"$f":"IF(TODAY()-F$2>0,SUM(OFFSET(Start,$A85,18):OFFSET(Start,$A85,37)),0)","v":0},{"$f":"IF(TODAY()-G$2>0,SUM(OFFSET(Start,$A85,18):OFFSET(Start,$A85,37)),0)","v":0},{"$f":"IF(TODAY()-H$2>0,SUM(OFFSET(Start,$A85,18):OFFSET(Start,$A85,37)),0)","v":0},{"$f":"IF(TODAY()-I$2>0,SUM(OFFSET(Start,$A85,18):OFFSET(Start,$A85,37)),0)","v":0},{"$f":"IF(TODAY()-J$2>0,SUM(OFFSET(Start,$A85,18):OFFSET(Start,$A85,37)),0)","v":0},{"$f":"IF(TODAY()-K$2>0,SUM(OFFSET(Start,$A85,18):OFFSET(Start,$A85,37)),0)","v":0},{"$f":"IF(TODAY()-L$2>0,SUM(OFFSET(Start,$A85,18):OFFSET(Start,$A85,37)),0)","v":0},{"$f":"IF(TODAY()-M$2>0,SUM(OFFSET(Start,$A85,18):OFFSET(Start,$A85,37)),0)","v":0},{"$f":"IF(TODAY()-N$2>0,SUM(OFFSET(Start,$A85,18):OFFSET(Start,$A85,37)),0)","v":0},{"$f":"IF(TODAY()-O$2>0,SUM(OFFSET(Start,$A85,18):OFFSET(Start,$A85,37)),0)","v":0},{"$f":"IF(TODAY()-P$2>0,SUM(OFFSET(Start,$A85,18):OFFSET(Start,$A85,37)),0)","v":0},{"$f":"IF(TODAY()-Q$2>0,SUM(OFFSET(Start,$A85,18):OFFSET(Start,$A85,37)),0)","v":0},{"$f":"IF(TODAY()-R$2>0,SUM(OFFSET(Start,$A85,18):OFFSET(Start,$A85,37)),0)","v":0},{"$f":"IF(TODAY()-S$2>0,SUM(OFFSET(Start,$A85,18):OFFSET(Start,$A85,37)),0)","v":0},{"$f":"IF(TODAY()-T$2>0,SUM(OFFSET(Start,$A85,18):OFFSET(Start,$A85,37)),0)","v":0},{"$f":"IF(TODAY()-U$2>0,SUM(OFFSET(Start,$A85,18):OFFSET(Start,$A85,37)),0)","v":0},{"$f":"IF(TODAY()-V$2>0,SUM(OFFSET(Start,$A85,18):OFFSET(Start,$A85,37)),0)","v":0},{"$f":"IF(TODAY()-W$2>0,SUM(OFFSET(Start,$A85,18):OFFSET(Start,$A85,37)),0)","v":0},{"$f":"IF(TODAY()-X$2>0,SUM(OFFSET(Start,$A85,18):OFFSET(Start,$A85,37)),0)","v":0},{"$f":"IF(TODAY()-Y$2>0,SUM(OFFSET(Start,$A85,18):OFFSET(Start,$A85,37)),0)","v":0},{"$f":"IF(TODAY()-Z$2>0,SUM(OFFSET(Start,$A85,18):OFFSET(Start,$A85,37)),0)","v":0},{"$f":"IF(TODAY()-AA$2>0,SUM(OFFSET(Start,$A85,18):OFFSET(Start,$A85,37)),0)","v":0},{"$f":"IF(TODAY()-AB$2>0,SUM(OFFSET(Start,$A85,18):OFFSET(Start,$A85,37)),0)","v":0},{"$f":"IF(TODAY()-AC$2>0,SUM(OFFSET(Start,$A85,18):OFFSET(Start,$A85,37)),0)","v":0},{"$f":"IF(TODAY()-AD$2>0,SUM(OFFSET(Start,$A85,18):OFFSET(Start,$A85,37)),0)","v":0},{"$f":"IF(TODAY()-AE$2>0,SUM(OFFSET(Start,$A85,18):OFFSET(Start,$A85,37)),0)","v":0},{"$f":"IF(TODAY()-AF$2>0,SUM(OFFSET(Start,$A85,18):OFFSET(Start,$A85,37)),0)","v":0},{"$f":"IF(TODAY()-AG$2>0,SUM(OFFSET(Start,$A85,18):OFFSET(Start,$A85,37)),0)","v":0},{"$f":"IF(TODAY()-AH$2>0,SUM(OFFSET(Start,$A85,18):OFFSET(Start,$A85,37)),0)","v":0},{"$f":"IF(TODAY()-AI$2>0,SUM(OFFSET(Start,$A85,18):OFFSET(Start,$A85,37)),0)","v":0},{"$f":"IF(TODAY()-AJ$2>0,SUM(OFFSET(Start,$A85,18):OFFSET(Start,$A85,37)),0)","v":0},{"$f":"IF(TODAY()-AK$2>0,SUM(OFFSET(Start,$A85,18):OFFSET(Start,$A85,37)),0)","v":0},{"$f":"IF(TODAY()-AL$2>0,SUM(OFFSET(Start,$A85,18):OFFSET(Start,$A85,37)),0)","v":0},0,0,0]
[85,{"$f":"OFFSET(Start,'Mellomlagring - antall besøk'!A86,0)","v":0},{"$f":"IF(TODAY()-C$2>0,SUM(OFFSET(Start,$A86,18):OFFSET(Start,$A86,37)),0)","v":0},{"$f":"IF(TODAY()-D$2>0,SUM(OFFSET(Start,$A86,18):OFFSET(Start,$A86,37)),0)","v":0},{"$f":"IF(TODAY()-E$2>0,SUM(OFFSET(Start,$A86,18):OFFSET(Start,$A86,37)),0)","v":0},{"$f":"IF(TODAY()-F$2>0,SUM(OFFSET(Start,$A86,18):OFFSET(Start,$A86,37)),0)","v":0},{"$f":"IF(TODAY()-G$2>0,SUM(OFFSET(Start,$A86,18):OFFSET(Start,$A86,37)),0)","v":0},{"$f":"IF(TODAY()-H$2>0,SUM(OFFSET(Start,$A86,18):OFFSET(Start,$A86,37)),0)","v":0},{"$f":"IF(TODAY()-I$2>0,SUM(OFFSET(Start,$A86,18):OFFSET(Start,$A86,37)),0)","v":0},{"$f":"IF(TODAY()-J$2>0,SUM(OFFSET(Start,$A86,18):OFFSET(Start,$A86,37)),0)","v":0},{"$f":"IF(TODAY()-K$2>0,SUM(OFFSET(Start,$A86,18):OFFSET(Start,$A86,37)),0)","v":0},{"$f":"IF(TODAY()-L$2>0,SUM(OFFSET(Start,$A86,18):OFFSET(Start,$A86,37)),0)","v":0},{"$f":"IF(TODAY()-M$2>0,SUM(OFFSET(Start,$A86,18):OFFSET(Start,$A86,37)),0)","v":0},{"$f":"IF(TODAY()-N$2>0,SUM(OFFSET(Start,$A86,18):OFFSET(Start,$A86,37)),0)","v":0},{"$f":"IF(TODAY()-O$2>0,SUM(OFFSET(Start,$A86,18):OFFSET(Start,$A86,37)),0)","v":0},{"$f":"IF(TODAY()-P$2>0,SUM(OFFSET(Start,$A86,18):OFFSET(Start,$A86,37)),0)","v":0},{"$f":"IF(TODAY()-Q$2>0,SUM(OFFSET(Start,$A86,18):OFFSET(Start,$A86,37)),0)","v":0},{"$f":"IF(TODAY()-R$2>0,SUM(OFFSET(Start,$A86,18):OFFSET(Start,$A86,37)),0)","v":0},{"$f":"IF(TODAY()-S$2>0,SUM(OFFSET(Start,$A86,18):OFFSET(Start,$A86,37)),0)","v":0},{"$f":"IF(TODAY()-T$2>0,SUM(OFFSET(Start,$A86,18):OFFSET(Start,$A86,37)),0)","v":0},{"$f":"IF(TODAY()-U$2>0,SUM(OFFSET(Start,$A86,18):OFFSET(Start,$A86,37)),0)","v":0},{"$f":"IF(TODAY()-V$2>0,SUM(OFFSET(Start,$A86,18):OFFSET(Start,$A86,37)),0)","v":0},{"$f":"IF(TODAY()-W$2>0,SUM(OFFSET(Start,$A86,18):OFFSET(Start,$A86,37)),0)","v":0},{"$f":"IF(TODAY()-X$2>0,SUM(OFFSET(Start,$A86,18):OFFSET(Start,$A86,37)),0)","v":0},{"$f":"IF(TODAY()-Y$2>0,SUM(OFFSET(Start,$A86,18):OFFSET(Start,$A86,37)),0)","v":0},{"$f":"IF(TODAY()-Z$2>0,SUM(OFFSET(Start,$A86,18):OFFSET(Start,$A86,37)),0)","v":0},{"$f":"IF(TODAY()-AA$2>0,SUM(OFFSET(Start,$A86,18):OFFSET(Start,$A86,37)),0)","v":0},{"$f":"IF(TODAY()-AB$2>0,SUM(OFFSET(Start,$A86,18):OFFSET(Start,$A86,37)),0)","v":0},{"$f":"IF(TODAY()-AC$2>0,SUM(OFFSET(Start,$A86,18):OFFSET(Start,$A86,37)),0)","v":0},{"$f":"IF(TODAY()-AD$2>0,SUM(OFFSET(Start,$A86,18):OFFSET(Start,$A86,37)),0)","v":0},{"$f":"IF(TODAY()-AE$2>0,SUM(OFFSET(Start,$A86,18):OFFSET(Start,$A86,37)),0)","v":0},{"$f":"IF(TODAY()-AF$2>0,SUM(OFFSET(Start,$A86,18):OFFSET(Start,$A86,37)),0)","v":0},{"$f":"IF(TODAY()-AG$2>0,SUM(OFFSET(Start,$A86,18):OFFSET(Start,$A86,37)),0)","v":0},{"$f":"IF(TODAY()-AH$2>0,SUM(OFFSET(Start,$A86,18):OFFSET(Start,$A86,37)),0)","v":0},{"$f":"IF(TODAY()-AI$2>0,SUM(OFFSET(Start,$A86,18):OFFSET(Start,$A86,37)),0)","v":0},{"$f":"IF(TODAY()-AJ$2>0,SUM(OFFSET(Start,$A86,18):OFFSET(Start,$A86,37)),0)","v":0},{"$f":"IF(TODAY()-AK$2>0,SUM(OFFSET(Start,$A86,18):OFFSET(Start,$A86,37)),0)","v":0},{"$f":"IF(TODAY()-AL$2>0,SUM(OFFSET(Start,$A86,18):OFFSET(Start,$A86,37)),0)","v":0},0,0,0]
[86,{"$f":"OFFSET(Start,'Mellomlagring - antall besøk'!A87,0)","v":0},{"$f":"IF(TODAY()-C$2>0,SUM(OFFSET(Start,$A87,18):OFFSET(Start,$A87,37)),0)","v":0},{"$f":"IF(TODAY()-D$2>0,SUM(OFFSET(Start,$A87,18):OFFSET(Start,$A87,37)),0)","v":0},{"$f":"IF(TODAY()-E$2>0,SUM(OFFSET(Start,$A87,18):OFFSET(Start,$A87,37)),0)","v":0},{"$f":"IF(TODAY()-F$2>0,SUM(OFFSET(Start,$A87,18):OFFSET(Start,$A87,37)),0)","v":0},{"$f":"IF(TODAY()-G$2>0,SUM(OFFSET(Start,$A87,18):OFFSET(Start,$A87,37)),0)","v":0},{"$f":"IF(TODAY()-H$2>0,SUM(OFFSET(Start,$A87,18):OFFSET(Start,$A87,37)),0)","v":0},{"$f":"IF(TODAY()-I$2>0,SUM(OFFSET(Start,$A87,18):OFFSET(Start,$A87,37)),0)","v":0},{"$f":"IF(TODAY()-J$2>0,SUM(OFFSET(Start,$A87,18):OFFSET(Start,$A87,37)),0)","v":0},{"$f":"IF(TODAY()-K$2>0,SUM(OFFSET(Start,$A87,18):OFFSET(Start,$A87,37)),0)","v":0},{"$f":"IF(TODAY()-L$2>0,SUM(OFFSET(Start,$A87,18):OFFSET(Start,$A87,37)),0)","v":0},{"$f":"IF(TODAY()-M$2>0,SUM(OFFSET(Start,$A87,18):OFFSET(Start,$A87,37)),0)","v":0},{"$f":"IF(TODAY()-N$2>0,SUM(OFFSET(Start,$A87,18):OFFSET(Start,$A87,37)),0)","v":0},{"$f":"IF(TODAY()-O$2>0,SUM(OFFSET(Start,$A87,18):OFFSET(Start,$A87,37)),0)","v":0},{"$f":"IF(TODAY()-P$2>0,SUM(OFFSET(Start,$A87,18):OFFSET(Start,$A87,37)),0)","v":0},{"$f":"IF(TODAY()-Q$2>0,SUM(OFFSET(Start,$A87,18):OFFSET(Start,$A87,37)),0)","v":0},{"$f":"IF(TODAY()-R$2>0,SUM(OFFSET(Start,$A87,18):OFFSET(Start,$A87,37)),0)","v":0},{"$f":"IF(TODAY()-S$2>0,SUM(OFFSET(Start,$A87,18):OFFSET(Start,$A87,37)),0)","v":0},{"$f":"IF(TODAY()-T$2>0,SUM(OFFSET(Start,$A87,18):OFFSET(Start,$A87,37)),0)","v":0},{"$f":"IF(TODAY()-U$2>0,SUM(OFFSET(Start,$A87,18):OFFSET(Start,$A87,37)),0)","v":0},{"$f":"IF(TODAY()-V$2>0,SUM(OFFSET(Start,$A87,18):OFFSET(Start,$A87,37)),0)","v":0},{"$f":"IF(TODAY()-W$2>0,SUM(OFFSET(Start,$A87,18):OFFSET(Start,$A87,37)),0)","v":0},{"$f":"IF(TODAY()-X$2>0,SUM(OFFSET(Start,$A87,18):OFFSET(Start,$A87,37)),0)","v":0},{"$f":"IF(TODAY()-Y$2>0,SUM(OFFSET(Start,$A87,18):OFFSET(Start,$A87,37)),0)","v":0},{"$f":"IF(TODAY()-Z$2>0,SUM(OFFSET(Start,$A87,18):OFFSET(Start,$A87,37)),0)","v":0},{"$f":"IF(TODAY()-AA$2>0,SUM(OFFSET(Start,$A87,18):OFFSET(Start,$A87,37)),0)","v":0},{"$f":"IF(TODAY()-AB$2>0,SUM(OFFSET(Start,$A87,18):OFFSET(Start,$A87,37)),0)","v":0},{"$f":"IF(TODAY()-AC$2>0,SUM(OFFSET(Start,$A87,18):OFFSET(Start,$A87,37)),0)","v":0},{"$f":"IF(TODAY()-AD$2>0,SUM(OFFSET(Start,$A87,18):OFFSET(Start,$A87,37)),0)","v":0},{"$f":"IF(TODAY()-AE$2>0,SUM(OFFSET(Start,$A87,18):OFFSET(Start,$A87,37)),0)","v":0},{"$f":"IF(TODAY()-AF$2>0,SUM(OFFSET(Start,$A87,18):OFFSET(Start,$A87,37)),0)","v":0},{"$f":"IF(TODAY()-AG$2>0,SUM(OFFSET(Start,$A87,18):OFFSET(Start,$A87,37)),0)","v":0},{"$f":"IF(TODAY()-AH$2>0,SUM(OFFSET(Start,$A87,18):OFFSET(Start,$A87,37)),0)","v":0},{"$f":"IF(TODAY()-AI$2>0,SUM(OFFSET(Start,$A87,18):OFFSET(Start,$A87,37)),0)","v":0},{"$f":"IF(TODAY()-AJ$2>0,SUM(OFFSET(Start,$A87,18):OFFSET(Start,$A87,37)),0)","v":0},{"$f":"IF(TODAY()-AK$2>0,SUM(OFFSET(Start,$A87,18):OFFSET(Start,$A87,37)),0)","v":0},{"$f":"IF(TODAY()-AL$2>0,SUM(OFFSET(Start,$A87,18):OFFSET(Start,$A87,37)),0)","v":0},0,0,0]
[87,{"$f":"OFFSET(Start,'Mellomlagring - antall besøk'!A88,0)","v":0},{"$f":"IF(TODAY()-C$2>0,SUM(OFFSET(Start,$A88,18):OFFSET(Start,$A88,37)),0)","v":0},{"$f":"IF(TODAY()-D$2>0,SUM(OFFSET(Start,$A88,18):OFFSET(Start,$A88,37)),0)","v":0},{"$f":"IF(TODAY()-E$2>0,SUM(OFFSET(Start,$A88,18):OFFSET(Start,$A88,37)),0)","v":0},{"$f":"IF(TODAY()-F$2>0,SUM(OFFSET(Start,$A88,18):OFFSET(Start,$A88,37)),0)","v":0},{"$f":"IF(TODAY()-G$2>0,SUM(OFFSET(Start,$A88,18):OFFSET(Start,$A88,37)),0)","v":0},{"$f":"IF(TODAY()-H$2>0,SUM(OFFSET(Start,$A88,18):OFFSET(Start,$A88,37)),0)","v":0},{"$f":"IF(TODAY()-I$2>0,SUM(OFFSET(Start,$A88,18):OFFSET(Start,$A88,37)),0)","v":0},{"$f":"IF(TODAY()-J$2>0,SUM(OFFSET(Start,$A88,18):OFFSET(Start,$A88,37)),0)","v":0},{"$f":"IF(TODAY()-K$2>0,SUM(OFFSET(Start,$A88,18):OFFSET(Start,$A88,37)),0)","v":0},{"$f":"IF(TODAY()-L$2>0,SUM(OFFSET(Start,$A88,18):OFFSET(Start,$A88,37)),0)","v":0},{"$f":"IF(TODAY()-M$2>0,SUM(OFFSET(Start,$A88,18):OFFSET(Start,$A88,37)),0)","v":0},{"$f":"IF(TODAY()-N$2>0,SUM(OFFSET(Start,$A88,18):OFFSET(Start,$A88,37)),0)","v":0},{"$f":"IF(TODAY()-O$2>0,SUM(OFFSET(Start,$A88,18):OFFSET(Start,$A88,37)),0)","v":0},{"$f":"IF(TODAY()-P$2>0,SUM(OFFSET(Start,$A88,18):OFFSET(Start,$A88,37)),0)","v":0},{"$f":"IF(TODAY()-Q$2>0,SUM(OFFSET(Start,$A88,18):OFFSET(Start,$A88,37)),0)","v":0},{"$f":"IF(TODAY()-R$2>0,SUM(OFFSET(Start,$A88,18):OFFSET(Start,$A88,37)),0)","v":0},{"$f":"IF(TODAY()-S$2>0,SUM(OFFSET(Start,$A88,18):OFFSET(Start,$A88,37)),0)","v":0},{"$f":"IF(TODAY()-T$2>0,SUM(OFFSET(Start,$A88,18):OFFSET(Start,$A88,37)),0)","v":0},{"$f":"IF(TODAY()-U$2>0,SUM(OFFSET(Start,$A88,18):OFFSET(Start,$A88,37)),0)","v":0},{"$f":"IF(TODAY()-V$2>0,SUM(OFFSET(Start,$A88,18):OFFSET(Start,$A88,37)),0)","v":0},{"$f":"IF(TODAY()-W$2>0,SUM(OFFSET(Start,$A88,18):OFFSET(Start,$A88,37)),0)","v":0},{"$f":"IF(TODAY()-X$2>0,SUM(OFFSET(Start,$A88,18):OFFSET(Start,$A88,37)),0)","v":0},{"$f":"IF(TODAY()-Y$2>0,SUM(OFFSET(Start,$A88,18):OFFSET(Start,$A88,37)),0)","v":0},{"$f":"IF(TODAY()-Z$2>0,SUM(OFFSET(Start,$A88,18):OFFSET(Start,$A88,37)),0)","v":0},{"$f":"IF(TODAY()-AA$2>0,SUM(OFFSET(Start,$A88,18):OFFSET(Start,$A88,37)),0)","v":0},{"$f":"IF(TODAY()-AB$2>0,SUM(OFFSET(Start,$A88,18):OFFSET(Start,$A88,37)),0)","v":0},{"$f":"IF(TODAY()-AC$2>0,SUM(OFFSET(Start,$A88,18):OFFSET(Start,$A88,37)),0)","v":0},{"$f":"IF(TODAY()-AD$2>0,SUM(OFFSET(Start,$A88,18):OFFSET(Start,$A88,37)),0)","v":0},{"$f":"IF(TODAY()-AE$2>0,SUM(OFFSET(Start,$A88,18):OFFSET(Start,$A88,37)),0)","v":0},{"$f":"IF(TODAY()-AF$2>0,SUM(OFFSET(Start,$A88,18):OFFSET(Start,$A88,37)),0)","v":0},{"$f":"IF(TODAY()-AG$2>0,SUM(OFFSET(Start,$A88,18):OFFSET(Start,$A88,37)),0)","v":0},{"$f":"IF(TODAY()-AH$2>0,SUM(OFFSET(Start,$A88,18):OFFSET(Start,$A88,37)),0)","v":0},{"$f":"IF(TODAY()-AI$2>0,SUM(OFFSET(Start,$A88,18):OFFSET(Start,$A88,37)),0)","v":0},{"$f":"IF(TODAY()-AJ$2>0,SUM(OFFSET(Start,$A88,18):OFFSET(Start,$A88,37)),0)","v":0},{"$f":"IF(TODAY()-AK$2>0,SUM(OFFSET(Start,$A88,18):OFFSET(Start,$A88,37)),0)","v":0},{"$f":"IF(TODAY()-AL$2>0,SUM(OFFSET(Start,$A88,18):OFFSET(Start,$A88,37)),0)","v":0},0,0,0]
[88,{"$f":"OFFSET(Start,'Mellomlagring - antall besøk'!A89,0)","v":0},{"$f":"IF(TODAY()-C$2>0,SUM(OFFSET(Start,$A89,18):OFFSET(Start,$A89,37)),0)","v":0},{"$f":"IF(TODAY()-D$2>0,SUM(OFFSET(Start,$A89,18):OFFSET(Start,$A89,37)),0)","v":0},{"$f":"IF(TODAY()-E$2>0,SUM(OFFSET(Start,$A89,18):OFFSET(Start,$A89,37)),0)","v":0},{"$f":"IF(TODAY()-F$2>0,SUM(OFFSET(Start,$A89,18):OFFSET(Start,$A89,37)),0)","v":0},{"$f":"IF(TODAY()-G$2>0,SUM(OFFSET(Start,$A89,18):OFFSET(Start,$A89,37)),0)","v":0},{"$f":"IF(TODAY()-H$2>0,SUM(OFFSET(Start,$A89,18):OFFSET(Start,$A89,37)),0)","v":0},{"$f":"IF(TODAY()-I$2>0,SUM(OFFSET(Start,$A89,18):OFFSET(Start,$A89,37)),0)","v":0},{"$f":"IF(TODAY()-J$2>0,SUM(OFFSET(Start,$A89,18):OFFSET(Start,$A89,37)),0)","v":0},{"$f":"IF(TODAY()-K$2>0,SUM(OFFSET(Start,$A89,18):OFFSET(Start,$A89,37)),0)","v":0},{"$f":"IF(TODAY()-L$2>0,SUM(OFFSET(Start,$A89,18):OFFSET(Start,$A89,37)),0)","v":0},{"$f":"IF(TODAY()-M$2>0,SUM(OFFSET(Start,$A89,18):OFFSET(Start,$A89,37)),0)","v":0},{"$f":"IF(TODAY()-N$2>0,SUM(OFFSET(Start,$A89,18):OFFSET(Start,$A89,37)),0)","v":0},{"$f":"IF(TODAY()-O$2>0,SUM(OFFSET(Start,$A89,18):OFFSET(Start,$A89,37)),0)","v":0},{"$f":"IF(TODAY()-P$2>0,SUM(OFFSET(Start,$A89,18):OFFSET(Start,$A89,37)),0)","v":0},{"$f":"IF(TODAY()-Q$2>0,SUM(OFFSET(Start,$A89,18):OFFSET(Start,$A89,37)),0)","v":0},{"$f":"IF(TODAY()-R$2>0,SUM(OFFSET(Start,$A89,18):OFFSET(Start,$A89,37)),0)","v":0},{"$f":"IF(TODAY()-S$2>0,SUM(OFFSET(Start,$A89,18):OFFSET(Start,$A89,37)),0)","v":0},{"$f":"IF(TODAY()-T$2>0,SUM(OFFSET(Start,$A89,18):OFFSET(Start,$A89,37)),0)","v":0},{"$f":"IF(TODAY()-U$2>0,SUM(OFFSET(Start,$A89,18):OFFSET(Start,$A89,37)),0)","v":0},{"$f":"IF(TODAY()-V$2>0,SUM(OFFSET(Start,$A89,18):OFFSET(Start,$A89,37)),0)","v":0},{"$f":"IF(TODAY()-W$2>0,SUM(OFFSET(Start,$A89,18):OFFSET(Start,$A89,37)),0)","v":0},{"$f":"IF(TODAY()-X$2>0,SUM(OFFSET(Start,$A89,18):OFFSET(Start,$A89,37)),0)","v":0},{"$f":"IF(TODAY()-Y$2>0,SUM(OFFSET(Start,$A89,18):OFFSET(Start,$A89,37)),0)","v":0},{"$f":"IF(TODAY()-Z$2>0,SUM(OFFSET(Start,$A89,18):OFFSET(Start,$A89,37)),0)","v":0},{"$f":"IF(TODAY()-AA$2>0,SUM(OFFSET(Start,$A89,18):OFFSET(Start,$A89,37)),0)","v":0},{"$f":"IF(TODAY()-AB$2>0,SUM(OFFSET(Start,$A89,18):OFFSET(Start,$A89,37)),0)","v":0},{"$f":"IF(TODAY()-AC$2>0,SUM(OFFSET(Start,$A89,18):OFFSET(Start,$A89,37)),0)","v":0},{"$f":"IF(TODAY()-AD$2>0,SUM(OFFSET(Start,$A89,18):OFFSET(Start,$A89,37)),0)","v":0},{"$f":"IF(TODAY()-AE$2>0,SUM(OFFSET(Start,$A89,18):OFFSET(Start,$A89,37)),0)","v":0},{"$f":"IF(TODAY()-AF$2>0,SUM(OFFSET(Start,$A89,18):OFFSET(Start,$A89,37)),0)","v":0},{"$f":"IF(TODAY()-AG$2>0,SUM(OFFSET(Start,$A89,18):OFFSET(Start,$A89,37)),0)","v":0},{"$f":"IF(TODAY()-AH$2>0,SUM(OFFSET(Start,$A89,18):OFFSET(Start,$A89,37)),0)","v":0},{"$f":"IF(TODAY()-AI$2>0,SUM(OFFSET(Start,$A89,18):OFFSET(Start,$A89,37)),0)","v":0},{"$f":"IF(TODAY()-AJ$2>0,SUM(OFFSET(Start,$A89,18):OFFSET(Start,$A89,37)),0)","v":0},{"$f":"IF(TODAY()-AK$2>0,SUM(OFFSET(Start,$A89,18):OFFSET(Start,$A89,37)),0)","v":0},{"$f":"IF(TODAY()-AL$2>0,SUM(OFFSET(Start,$A89,18):OFFSET(Start,$A89,37)),0)","v":0},0,0,0]
[89,{"$f":"OFFSET(Start,'Mellomlagring - antall besøk'!A90,0)","v":0},{"$f":"IF(TODAY()-C$2>0,SUM(OFFSET(Start,$A90,18):OFFSET(Start,$A90,37)),0)","v":0},{"$f":"IF(TODAY()-D$2>0,SUM(OFFSET(Start,$A90,18):OFFSET(Start,$A90,37)),0)","v":0},{"$f":"IF(TODAY()-E$2>0,SUM(OFFSET(Start,$A90,18):OFFSET(Start,$A90,37)),0)","v":0},{"$f":"IF(TODAY()-F$2>0,SUM(OFFSET(Start,$A90,18):OFFSET(Start,$A90,37)),0)","v":0},{"$f":"IF(TODAY()-G$2>0,SUM(OFFSET(Start,$A90,18):OFFSET(Start,$A90,37)),0)","v":0},{"$f":"IF(TODAY()-H$2>0,SUM(OFFSET(Start,$A90,18):OFFSET(Start,$A90,37)),0)","v":0},{"$f":"IF(TODAY()-I$2>0,SUM(OFFSET(Start,$A90,18):OFFSET(Start,$A90,37)),0)","v":0},{"$f":"IF(TODAY()-J$2>0,SUM(OFFSET(Start,$A90,18):OFFSET(Start,$A90,37)),0)","v":0},{"$f":"IF(TODAY()-K$2>0,SUM(OFFSET(Start,$A90,18):OFFSET(Start,$A90,37)),0)","v":0},{"$f":"IF(TODAY()-L$2>0,SUM(OFFSET(Start,$A90,18):OFFSET(Start,$A90,37)),0)","v":0},{"$f":"IF(TODAY()-M$2>0,SUM(OFFSET(Start,$A90,18):OFFSET(Start,$A90,37)),0)","v":0},{"$f":"IF(TODAY()-N$2>0,SUM(OFFSET(Start,$A90,18):OFFSET(Start,$A90,37)),0)","v":0},{"$f":"IF(TODAY()-O$2>0,SUM(OFFSET(Start,$A90,18):OFFSET(Start,$A90,37)),0)","v":0},{"$f":"IF(TODAY()-P$2>0,SUM(OFFSET(Start,$A90,18):OFFSET(Start,$A90,37)),0)","v":0},{"$f":"IF(TODAY()-Q$2>0,SUM(OFFSET(Start,$A90,18):OFFSET(Start,$A90,37)),0)","v":0},{"$f":"IF(TODAY()-R$2>0,SUM(OFFSET(Start,$A90,18):OFFSET(Start,$A90,37)),0)","v":0},{"$f":"IF(TODAY()-S$2>0,SUM(OFFSET(Start,$A90,18):OFFSET(Start,$A90,37)),0)","v":0},{"$f":"IF(TODAY()-T$2>0,SUM(OFFSET(Start,$A90,18):OFFSET(Start,$A90,37)),0)","v":0},{"$f":"IF(TODAY()-U$2>0,SUM(OFFSET(Start,$A90,18):OFFSET(Start,$A90,37)),0)","v":0},{"$f":"IF(TODAY()-V$2>0,SUM(OFFSET(Start,$A90,18):OFFSET(Start,$A90,37)),0)","v":0},{"$f":"IF(TODAY()-W$2>0,SUM(OFFSET(Start,$A90,18):OFFSET(Start,$A90,37)),0)","v":0},{"$f":"IF(TODAY()-X$2>0,SUM(OFFSET(Start,$A90,18):OFFSET(Start,$A90,37)),0)","v":0},{"$f":"IF(TODAY()-Y$2>0,SUM(OFFSET(Start,$A90,18):OFFSET(Start,$A90,37)),0)","v":0},{"$f":"IF(TODAY()-Z$2>0,SUM(OFFSET(Start,$A90,18):OFFSET(Start,$A90,37)),0)","v":0},{"$f":"IF(TODAY()-AA$2>0,SUM(OFFSET(Start,$A90,18):OFFSET(Start,$A90,37)),0)","v":0},{"$f":"IF(TODAY()-AB$2>0,SUM(OFFSET(Start,$A90,18):OFFSET(Start,$A90,37)),0)","v":0},{"$f":"IF(TODAY()-AC$2>0,SUM(OFFSET(Start,$A90,18):OFFSET(Start,$A90,37)),0)","v":0},{"$f":"IF(TODAY()-AD$2>0,SUM(OFFSET(Start,$A90,18):OFFSET(Start,$A90,37)),0)","v":0},{"$f":"IF(TODAY()-AE$2>0,SUM(OFFSET(Start,$A90,18):OFFSET(Start,$A90,37)),0)","v":0},{"$f":"IF(TODAY()-AF$2>0,SUM(OFFSET(Start,$A90,18):OFFSET(Start,$A90,37)),0)","v":0},{"$f":"IF(TODAY()-AG$2>0,SUM(OFFSET(Start,$A90,18):OFFSET(Start,$A90,37)),0)","v":0},{"$f":"IF(TODAY()-AH$2>0,SUM(OFFSET(Start,$A90,18):OFFSET(Start,$A90,37)),0)","v":0},{"$f":"IF(TODAY()-AI$2>0,SUM(OFFSET(Start,$A90,18):OFFSET(Start,$A90,37)),0)","v":0},{"$f":"IF(TODAY()-AJ$2>0,SUM(OFFSET(Start,$A90,18):OFFSET(Start,$A90,37)),0)","v":0},{"$f":"IF(TODAY()-AK$2>0,SUM(OFFSET(Start,$A90,18):OFFSET(Start,$A90,37)),0)","v":0},{"$f":"IF(TODAY()-AL$2>0,SUM(OFFSET(Start,$A90,18):OFFSET(Start,$A90,37)),0)","v":0},0,0,0]
[90,{"$f":"OFFSET(Start,'Mellomlagring - antall besøk'!A91,0)","v":0},{"$f":"IF(TODAY()-C$2>0,SUM(OFFSET(Start,$A91,18):OFFSET(Start,$A91,37)),0)","v":0},{"$f":"IF(TODAY()-D$2>0,SUM(OFFSET(Start,$A91,18):OFFSET(Start,$A91,37)),0)","v":0},{"$f":"IF(TODAY()-E$2>0,SUM(OFFSET(Start,$A91,18):OFFSET(Start,$A91,37)),0)","v":0},{"$f":"IF(TODAY()-F$2>0,SUM(OFFSET(Start,$A91,18):OFFSET(Start,$A91,37)),0)","v":0},{"$f":"IF(TODAY()-G$2>0,SUM(OFFSET(Start,$A91,18):OFFSET(Start,$A91,37)),0)","v":0},{"$f":"IF(TODAY()-H$2>0,SUM(OFFSET(Start,$A91,18):OFFSET(Start,$A91,37)),0)","v":0},{"$f":"IF(TODAY()-I$2>0,SUM(OFFSET(Start,$A91,18):OFFSET(Start,$A91,37)),0)","v":0},{"$f":"IF(TODAY()-J$2>0,SUM(OFFSET(Start,$A91,18):OFFSET(Start,$A91,37)),0)","v":0},{"$f":"IF(TODAY()-K$2>0,SUM(OFFSET(Start,$A91,18):OFFSET(Start,$A91,37)),0)","v":0},{"$f":"IF(TODAY()-L$2>0,SUM(OFFSET(Start,$A91,18):OFFSET(Start,$A91,37)),0)","v":0},{"$f":"IF(TODAY()-M$2>0,SUM(OFFSET(Start,$A91,18):OFFSET(Start,$A91,37)),0)","v":0},{"$f":"IF(TODAY()-N$2>0,SUM(OFFSET(Start,$A91,18):OFFSET(Start,$A91,37)),0)","v":0},{"$f":"IF(TODAY()-O$2>0,SUM(OFFSET(Start,$A91,18):OFFSET(Start,$A91,37)),0)","v":0},{"$f":"IF(TODAY()-P$2>0,SUM(OFFSET(Start,$A91,18):OFFSET(Start,$A91,37)),0)","v":0},{"$f":"IF(TODAY()-Q$2>0,SUM(OFFSET(Start,$A91,18):OFFSET(Start,$A91,37)),0)","v":0},{"$f":"IF(TODAY()-R$2>0,SUM(OFFSET(Start,$A91,18):OFFSET(Start,$A91,37)),0)","v":0},{"$f":"IF(TODAY()-S$2>0,SUM(OFFSET(Start,$A91,18):OFFSET(Start,$A91,37)),0)","v":0},{"$f":"IF(TODAY()-T$2>0,SUM(OFFSET(Start,$A91,18):OFFSET(Start,$A91,37)),0)","v":0},{"$f":"IF(TODAY()-U$2>0,SUM(OFFSET(Start,$A91,18):OFFSET(Start,$A91,37)),0)","v":0},{"$f":"IF(TODAY()-V$2>0,SUM(OFFSET(Start,$A91,18):OFFSET(Start,$A91,37)),0)","v":0},{"$f":"IF(TODAY()-W$2>0,SUM(OFFSET(Start,$A91,18):OFFSET(Start,$A91,37)),0)","v":0},{"$f":"IF(TODAY()-X$2>0,SUM(OFFSET(Start,$A91,18):OFFSET(Start,$A91,37)),0)","v":0},{"$f":"IF(TODAY()-Y$2>0,SUM(OFFSET(Start,$A91,18):OFFSET(Start,$A91,37)),0)","v":0},{"$f":"IF(TODAY()-Z$2>0,SUM(OFFSET(Start,$A91,18):OFFSET(Start,$A91,37)),0)","v":0},{"$f":"IF(TODAY()-AA$2>0,SUM(OFFSET(Start,$A91,18):OFFSET(Start,$A91,37)),0)","v":0},{"$f":"IF(TODAY()-AB$2>0,SUM(OFFSET(Start,$A91,18):OFFSET(Start,$A91,37)),0)","v":0},{"$f":"IF(TODAY()-AC$2>0,SUM(OFFSET(Start,$A91,18):OFFSET(Start,$A91,37)),0)","v":0},{"$f":"IF(TODAY()-AD$2>0,SUM(OFFSET(Start,$A91,18):OFFSET(Start,$A91,37)),0)","v":0},{"$f":"IF(TODAY()-AE$2>0,SUM(OFFSET(Start,$A91,18):OFFSET(Start,$A91,37)),0)","v":0},{"$f":"IF(TODAY()-AF$2>0,SUM(OFFSET(Start,$A91,18):OFFSET(Start,$A91,37)),0)","v":0},{"$f":"IF(TODAY()-AG$2>0,SUM(OFFSET(Start,$A91,18):OFFSET(Start,$A91,37)),0)","v":0},{"$f":"IF(TODAY()-AH$2>0,SUM(OFFSET(Start,$A91,18):OFFSET(Start,$A91,37)),0)","v":0},{"$f":"IF(TODAY()-AI$2>0,SUM(OFFSET(Start,$A91,18):OFFSET(Start,$A91,37)),0)","v":0},{"$f":"IF(TODAY()-AJ$2>0,SUM(OFFSET(Start,$A91,18):OFFSET(Start,$A91,37)),0)","v":0},{"$f":"IF(TODAY()-AK$2>0,SUM(OFFSET(Start,$A91,18):OFFSET(Start,$A91,37)),0)","v":0},{"$f":"IF(TODAY()-AL$2>0,SUM(OFFSET(Start,$A91,18):OFFSET(Start,$A91,37)),0)","v":0},0,0,0]
[91,{"$f":"OFFSET(Start,'Mellomlagring - antall besøk'!A92,0)","v":0},{"$f":"IF(TODAY()-C$2>0,SUM(OFFSET(Start,$A92,18):OFFSET(Start,$A92,37)),0)","v":0},{"$f":"IF(TODAY()-D$2>0,SUM(OFFSET(Start,$A92,18):OFFSET(Start,$A92,37)),0)","v":0},{"$f":"IF(TODAY()-E$2>0,SUM(OFFSET(Start,$A92,18):OFFSET(Start,$A92,37)),0)","v":0},{"$f":"IF(TODAY()-F$2>0,SUM(OFFSET(Start,$A92,18):OFFSET(Start,$A92,37)),0)","v":0},{"$f":"IF(TODAY()-G$2>0,SUM(OFFSET(Start,$A92,18):OFFSET(Start,$A92,37)),0)","v":0},{"$f":"IF(TODAY()-H$2>0,SUM(OFFSET(Start,$A92,18):OFFSET(Start,$A92,37)),0)","v":0},{"$f":"IF(TODAY()-I$2>0,SUM(OFFSET(Start,$A92,18):OFFSET(Start,$A92,37)),0)","v":0},{"$f":"IF(TODAY()-J$2>0,SUM(OFFSET(Start,$A92,18):OFFSET(Start,$A92,37)),0)","v":0},{"$f":"IF(TODAY()-K$2>0,SUM(OFFSET(Start,$A92,18):OFFSET(Start,$A92,37)),0)","v":0},{"$f":"IF(TODAY()-L$2>0,SUM(OFFSET(Start,$A92,18):OFFSET(Start,$A92,37)),0)","v":0},{"$f":"IF(TODAY()-M$2>0,SUM(OFFSET(Start,$A92,18):OFFSET(Start,$A92,37)),0)","v":0},{"$f":"IF(TODAY()-N$2>0,SUM(OFFSET(Start,$A92,18):OFFSET(Start,$A92,37)),0)","v":0},{"$f":"IF(TODAY()-O$2>0,SUM(OFFSET(Start,$A92,18):OFFSET(Start,$A92,37)),0)","v":0},{"$f":"IF(TODAY()-P$2>0,SUM(OFFSET(Start,$A92,18):OFFSET(Start,$A92,37)),0)","v":0},{"$f":"IF(TODAY()-Q$2>0,SUM(OFFSET(Start,$A92,18):OFFSET(Start,$A92,37)),0)","v":0},{"$f":"IF(TODAY()-R$2>0,SUM(OFFSET(Start,$A92,18):OFFSET(Start,$A92,37)),0)","v":0},{"$f":"IF(TODAY()-S$2>0,SUM(OFFSET(Start,$A92,18):OFFSET(Start,$A92,37)),0)","v":0},{"$f":"IF(TODAY()-T$2>0,SUM(OFFSET(Start,$A92,18):OFFSET(Start,$A92,37)),0)","v":0},{"$f":"IF(TODAY()-U$2>0,SUM(OFFSET(Start,$A92,18):OFFSET(Start,$A92,37)),0)","v":0},{"$f":"IF(TODAY()-V$2>0,SUM(OFFSET(Start,$A92,18):OFFSET(Start,$A92,37)),0)","v":0},{"$f":"IF(TODAY()-W$2>0,SUM(OFFSET(Start,$A92,18):OFFSET(Start,$A92,37)),0)","v":0},{"$f":"IF(TODAY()-X$2>0,SUM(OFFSET(Start,$A92,18):OFFSET(Start,$A92,37)),0)","v":0},{"$f":"IF(TODAY()-Y$2>0,SUM(OFFSET(Start,$A92,18):OFFSET(Start,$A92,37)),0)","v":0},{"$f":"IF(TODAY()-Z$2>0,SUM(OFFSET(Start,$A92,18):OFFSET(Start,$A92,37)),0)","v":0},{"$f":"IF(TODAY()-AA$2>0,SUM(OFFSET(Start,$A92,18):OFFSET(Start,$A92,37)),0)","v":0},{"$f":"IF(TODAY()-AB$2>0,SUM(OFFSET(Start,$A92,18):OFFSET(Start,$A92,37)),0)","v":0},{"$f":"IF(TODAY()-AC$2>0,SUM(OFFSET(Start,$A92,18):OFFSET(Start,$A92,37)),0)","v":0},{"$f":"IF(TODAY()-AD$2>0,SUM(OFFSET(Start,$A92,18):OFFSET(Start,$A92,37)),0)","v":0},{"$f":"IF(TODAY()-AE$2>0,SUM(OFFSET(Start,$A92,18):OFFSET(Start,$A92,37)),0)","v":0},{"$f":"IF(TODAY()-AF$2>0,SUM(OFFSET(Start,$A92,18):OFFSET(Start,$A92,37)),0)","v":0},{"$f":"IF(TODAY()-AG$2>0,SUM(OFFSET(Start,$A92,18):OFFSET(Start,$A92,37)),0)","v":0},{"$f":"IF(TODAY()-AH$2>0,SUM(OFFSET(Start,$A92,18):OFFSET(Start,$A92,37)),0)","v":0},{"$f":"IF(TODAY()-AI$2>0,SUM(OFFSET(Start,$A92,18):OFFSET(Start,$A92,37)),0)","v":0},{"$f":"IF(TODAY()-AJ$2>0,SUM(OFFSET(Start,$A92,18):OFFSET(Start,$A92,37)),0)","v":0},{"$f":"IF(TODAY()-AK$2>0,SUM(OFFSET(Start,$A92,18):OFFSET(Start,$A92,37)),0)","v":0},{"$f":"IF(TODAY()-AL$2>0,SUM(OFFSET(Start,$A92,18):OFFSET(Start,$A92,37)),0)","v":0},0,0,0]
[92,{"$f":"OFFSET(Start,'Mellomlagring - antall besøk'!A93,0)","v":0},{"$f":"IF(TODAY()-C$2>0,SUM(OFFSET(Start,$A93,18):OFFSET(Start,$A93,37)),0)","v":0},{"$f":"IF(TODAY()-D$2>0,SUM(OFFSET(Start,$A93,18):OFFSET(Start,$A93,37)),0)","v":0},{"$f":"IF(TODAY()-E$2>0,SUM(OFFSET(Start,$A93,18):OFFSET(Start,$A93,37)),0)","v":0},{"$f":"IF(TODAY()-F$2>0,SUM(OFFSET(Start,$A93,18):OFFSET(Start,$A93,37)),0)","v":0},{"$f":"IF(TODAY()-G$2>0,SUM(OFFSET(Start,$A93,18):OFFSET(Start,$A93,37)),0)","v":0},{"$f":"IF(TODAY()-H$2>0,SUM(OFFSET(Start,$A93,18):OFFSET(Start,$A93,37)),0)","v":0},{"$f":"IF(TODAY()-I$2>0,SUM(OFFSET(Start,$A93,18):OFFSET(Start,$A93,37)),0)","v":0},{"$f":"IF(TODAY()-J$2>0,SUM(OFFSET(Start,$A93,18):OFFSET(Start,$A93,37)),0)","v":0},{"$f":"IF(TODAY()-K$2>0,SUM(OFFSET(Start,$A93,18):OFFSET(Start,$A93,37)),0)","v":0},{"$f":"IF(TODAY()-L$2>0,SUM(OFFSET(Start,$A93,18):OFFSET(Start,$A93,37)),0)","v":0},{"$f":"IF(TODAY()-M$2>0,SUM(OFFSET(Start,$A93,18):OFFSET(Start,$A93,37)),0)","v":0},{"$f":"IF(TODAY()-N$2>0,SUM(OFFSET(Start,$A93,18):OFFSET(Start,$A93,37)),0)","v":0},{"$f":"IF(TODAY()-O$2>0,SUM(OFFSET(Start,$A93,18):OFFSET(Start,$A93,37)),0)","v":0},{"$f":"IF(TODAY()-P$2>0,SUM(OFFSET(Start,$A93,18):OFFSET(Start,$A93,37)),0)","v":0},{"$f":"IF(TODAY()-Q$2>0,SUM(OFFSET(Start,$A93,18):OFFSET(Start,$A93,37)),0)","v":0},{"$f":"IF(TODAY()-R$2>0,SUM(OFFSET(Start,$A93,18):OFFSET(Start,$A93,37)),0)","v":0},{"$f":"IF(TODAY()-S$2>0,SUM(OFFSET(Start,$A93,18):OFFSET(Start,$A93,37)),0)","v":0},{"$f":"IF(TODAY()-T$2>0,SUM(OFFSET(Start,$A93,18):OFFSET(Start,$A93,37)),0)","v":0},{"$f":"IF(TODAY()-U$2>0,SUM(OFFSET(Start,$A93,18):OFFSET(Start,$A93,37)),0)","v":0},{"$f":"IF(TODAY()-V$2>0,SUM(OFFSET(Start,$A93,18):OFFSET(Start,$A93,37)),0)","v":0},{"$f":"IF(TODAY()-W$2>0,SUM(OFFSET(Start,$A93,18):OFFSET(Start,$A93,37)),0)","v":0},{"$f":"IF(TODAY()-X$2>0,SUM(OFFSET(Start,$A93,18):OFFSET(Start,$A93,37)),0)","v":0},{"$f":"IF(TODAY()-Y$2>0,SUM(OFFSET(Start,$A93,18):OFFSET(Start,$A93,37)),0)","v":0},{"$f":"IF(TODAY()-Z$2>0,SUM(OFFSET(Start,$A93,18):OFFSET(Start,$A93,37)),0)","v":0},{"$f":"IF(TODAY()-AA$2>0,SUM(OFFSET(Start,$A93,18):OFFSET(Start,$A93,37)),0)","v":0},{"$f":"IF(TODAY()-AB$2>0,SUM(OFFSET(Start,$A93,18):OFFSET(Start,$A93,37)),0)","v":0},{"$f":"IF(TODAY()-AC$2>0,SUM(OFFSET(Start,$A93,18):OFFSET(Start,$A93,37)),0)","v":0},{"$f":"IF(TODAY()-AD$2>0,SUM(OFFSET(Start,$A93,18):OFFSET(Start,$A93,37)),0)","v":0},{"$f":"IF(TODAY()-AE$2>0,SUM(OFFSET(Start,$A93,18):OFFSET(Start,$A93,37)),0)","v":0},{"$f":"IF(TODAY()-AF$2>0,SUM(OFFSET(Start,$A93,18):OFFSET(Start,$A93,37)),0)","v":0},{"$f":"IF(TODAY()-AG$2>0,SUM(OFFSET(Start,$A93,18):OFFSET(Start,$A93,37)),0)","v":0},{"$f":"IF(TODAY()-AH$2>0,SUM(OFFSET(Start,$A93,18):OFFSET(Start,$A93,37)),0)","v":0},{"$f":"IF(TODAY()-AI$2>0,SUM(OFFSET(Start,$A93,18):OFFSET(Start,$A93,37)),0)","v":0},{"$f":"IF(TODAY()-AJ$2>0,SUM(OFFSET(Start,$A93,18):OFFSET(Start,$A93,37)),0)","v":0},{"$f":"IF(TODAY()-AK$2>0,SUM(OFFSET(Start,$A93,18):OFFSET(Start,$A93,37)),0)","v":0},{"$f":"IF(TODAY()-AL$2>0,SUM(OFFSET(Start,$A93,18):OFFSET(Start,$A93,37)),0)","v":0},0,0,0]
[93,{"$f":"OFFSET(Start,'Mellomlagring - antall besøk'!A94,0)","v":0},{"$f":"IF(TODAY()-C$2>0,SUM(OFFSET(Start,$A94,18):OFFSET(Start,$A94,37)),0)","v":0},{"$f":"IF(TODAY()-D$2>0,SUM(OFFSET(Start,$A94,18):OFFSET(Start,$A94,37)),0)","v":0},{"$f":"IF(TODAY()-E$2>0,SUM(OFFSET(Start,$A94,18):OFFSET(Start,$A94,37)),0)","v":0},{"$f":"IF(TODAY()-F$2>0,SUM(OFFSET(Start,$A94,18):OFFSET(Start,$A94,37)),0)","v":0},{"$f":"IF(TODAY()-G$2>0,SUM(OFFSET(Start,$A94,18):OFFSET(Start,$A94,37)),0)","v":0},{"$f":"IF(TODAY()-H$2>0,SUM(OFFSET(Start,$A94,18):OFFSET(Start,$A94,37)),0)","v":0},{"$f":"IF(TODAY()-I$2>0,SUM(OFFSET(Start,$A94,18):OFFSET(Start,$A94,37)),0)","v":0},{"$f":"IF(TODAY()-J$2>0,SUM(OFFSET(Start,$A94,18):OFFSET(Start,$A94,37)),0)","v":0},{"$f":"IF(TODAY()-K$2>0,SUM(OFFSET(Start,$A94,18):OFFSET(Start,$A94,37)),0)","v":0},{"$f":"IF(TODAY()-L$2>0,SUM(OFFSET(Start,$A94,18):OFFSET(Start,$A94,37)),0)","v":0},{"$f":"IF(TODAY()-M$2>0,SUM(OFFSET(Start,$A94,18):OFFSET(Start,$A94,37)),0)","v":0},{"$f":"IF(TODAY()-N$2>0,SUM(OFFSET(Start,$A94,18):OFFSET(Start,$A94,37)),0)","v":0},{"$f":"IF(TODAY()-O$2>0,SUM(OFFSET(Start,$A94,18):OFFSET(Start,$A94,37)),0)","v":0},{"$f":"IF(TODAY()-P$2>0,SUM(OFFSET(Start,$A94,18):OFFSET(Start,$A94,37)),0)","v":0},{"$f":"IF(TODAY()-Q$2>0,SUM(OFFSET(Start,$A94,18):OFFSET(Start,$A94,37)),0)","v":0},{"$f":"IF(TODAY()-R$2>0,SUM(OFFSET(Start,$A94,18):OFFSET(Start,$A94,37)),0)","v":0},{"$f":"IF(TODAY()-S$2>0,SUM(OFFSET(Start,$A94,18):OFFSET(Start,$A94,37)),0)","v":0},{"$f":"IF(TODAY()-T$2>0,SUM(OFFSET(Start,$A94,18):OFFSET(Start,$A94,37)),0)","v":0},{"$f":"IF(TODAY()-U$2>0,SUM(OFFSET(Start,$A94,18):OFFSET(Start,$A94,37)),0)","v":0},{"$f":"IF(TODAY()-V$2>0,SUM(OFFSET(Start,$A94,18):OFFSET(Start,$A94,37)),0)","v":0},{"$f":"IF(TODAY()-W$2>0,SUM(OFFSET(Start,$A94,18):OFFSET(Start,$A94,37)),0)","v":0},{"$f":"IF(TODAY()-X$2>0,SUM(OFFSET(Start,$A94,18):OFFSET(Start,$A94,37)),0)","v":0},{"$f":"IF(TODAY()-Y$2>0,SUM(OFFSET(Start,$A94,18):OFFSET(Start,$A94,37)),0)","v":0},{"$f":"IF(TODAY()-Z$2>0,SUM(OFFSET(Start,$A94,18):OFFSET(Start,$A94,37)),0)","v":0},{"$f":"IF(TODAY()-AA$2>0,SUM(OFFSET(Start,$A94,18):OFFSET(Start,$A94,37)),0)","v":0},{"$f":"IF(TODAY()-AB$2>0,SUM(OFFSET(Start,$A94,18):OFFSET(Start,$A94,37)),0)","v":0},{"$f":"IF(TODAY()-AC$2>0,SUM(OFFSET(Start,$A94,18):OFFSET(Start,$A94,37)),0)","v":0},{"$f":"IF(TODAY()-AD$2>0,SUM(OFFSET(Start,$A94,18):OFFSET(Start,$A94,37)),0)","v":0},{"$f":"IF(TODAY()-AE$2>0,SUM(OFFSET(Start,$A94,18):OFFSET(Start,$A94,37)),0)","v":0},{"$f":"IF(TODAY()-AF$2>0,SUM(OFFSET(Start,$A94,18):OFFSET(Start,$A94,37)),0)","v":0},{"$f":"IF(TODAY()-AG$2>0,SUM(OFFSET(Start,$A94,18):OFFSET(Start,$A94,37)),0)","v":0},{"$f":"IF(TODAY()-AH$2>0,SUM(OFFSET(Start,$A94,18):OFFSET(Start,$A94,37)),0)","v":0},{"$f":"IF(TODAY()-AI$2>0,SUM(OFFSET(Start,$A94,18):OFFSET(Start,$A94,37)),0)","v":0},{"$f":"IF(TODAY()-AJ$2>0,SUM(OFFSET(Start,$A94,18):OFFSET(Start,$A94,37)),0)","v":0},{"$f":"IF(TODAY()-AK$2>0,SUM(OFFSET(Start,$A94,18):OFFSET(Start,$A94,37)),0)","v":0},{"$f":"IF(TODAY()-AL$2>0,SUM(OFFSET(Start,$A94,18):OFFSET(Start,$A94,37)),0)","v":0},0,0,0]
[94,{"$f":"OFFSET(Start,'Mellomlagring - antall besøk'!A95,0)","v":0},{"$f":"IF(TODAY()-C$2>0,SUM(OFFSET(Start,$A95,18):OFFSET(Start,$A95,37)),0)","v":0},{"$f":"IF(TODAY()-D$2>0,SUM(OFFSET(Start,$A95,18):OFFSET(Start,$A95,37)),0)","v":0},{"$f":"IF(TODAY()-E$2>0,SUM(OFFSET(Start,$A95,18):OFFSET(Start,$A95,37)),0)","v":0},{"$f":"IF(TODAY()-F$2>0,SUM(OFFSET(Start,$A95,18):OFFSET(Start,$A95,37)),0)","v":0},{"$f":"IF(TODAY()-G$2>0,SUM(OFFSET(Start,$A95,18):OFFSET(Start,$A95,37)),0)","v":0},{"$f":"IF(TODAY()-H$2>0,SUM(OFFSET(Start,$A95,18):OFFSET(Start,$A95,37)),0)","v":0},{"$f":"IF(TODAY()-I$2>0,SUM(OFFSET(Start,$A95,18):OFFSET(Start,$A95,37)),0)","v":0},{"$f":"IF(TODAY()-J$2>0,SUM(OFFSET(Start,$A95,18):OFFSET(Start,$A95,37)),0)","v":0},{"$f":"IF(TODAY()-K$2>0,SUM(OFFSET(Start,$A95,18):OFFSET(Start,$A95,37)),0)","v":0},{"$f":"IF(TODAY()-L$2>0,SUM(OFFSET(Start,$A95,18):OFFSET(Start,$A95,37)),0)","v":0},{"$f":"IF(TODAY()-M$2>0,SUM(OFFSET(Start,$A95,18):OFFSET(Start,$A95,37)),0)","v":0},{"$f":"IF(TODAY()-N$2>0,SUM(OFFSET(Start,$A95,18):OFFSET(Start,$A95,37)),0)","v":0},{"$f":"IF(TODAY()-O$2>0,SUM(OFFSET(Start,$A95,18):OFFSET(Start,$A95,37)),0)","v":0},{"$f":"IF(TODAY()-P$2>0,SUM(OFFSET(Start,$A95,18):OFFSET(Start,$A95,37)),0)","v":0},{"$f":"IF(TODAY()-Q$2>0,SUM(OFFSET(Start,$A95,18):OFFSET(Start,$A95,37)),0)","v":0},{"$f":"IF(TODAY()-R$2>0,SUM(OFFSET(Start,$A95,18):OFFSET(Start,$A95,37)),0)","v":0},{"$f":"IF(TODAY()-S$2>0,SUM(OFFSET(Start,$A95,18):OFFSET(Start,$A95,37)),0)","v":0},{"$f":"IF(TODAY()-T$2>0,SUM(OFFSET(Start,$A95,18):OFFSET(Start,$A95,37)),0)","v":0},{"$f":"IF(TODAY()-U$2>0,SUM(OFFSET(Start,$A95,18):OFFSET(Start,$A95,37)),0)","v":0},{"$f":"IF(TODAY()-V$2>0,SUM(OFFSET(Start,$A95,18):OFFSET(Start,$A95,37)),0)","v":0},{"$f":"IF(TODAY()-W$2>0,SUM(OFFSET(Start,$A95,18):OFFSET(Start,$A95,37)),0)","v":0},{"$f":"IF(TODAY()-X$2>0,SUM(OFFSET(Start,$A95,18):OFFSET(Start,$A95,37)),0)","v":0},{"$f":"IF(TODAY()-Y$2>0,SUM(OFFSET(Start,$A95,18):OFFSET(Start,$A95,37)),0)","v":0},{"$f":"IF(TODAY()-Z$2>0,SUM(OFFSET(Start,$A95,18):OFFSET(Start,$A95,37)),0)","v":0},{"$f":"IF(TODAY()-AA$2>0,SUM(OFFSET(Start,$A95,18):OFFSET(Start,$A95,37)),0)","v":0},{"$f":"IF(TODAY()-AB$2>0,SUM(OFFSET(Start,$A95,18):OFFSET(Start,$A95,37)),0)","v":0},{"$f":"IF(TODAY()-AC$2>0,SUM(OFFSET(Start,$A95,18):OFFSET(Start,$A95,37)),0)","v":0},{"$f":"IF(TODAY()-AD$2>0,SUM(OFFSET(Start,$A95,18):OFFSET(Start,$A95,37)),0)","v":0},{"$f":"IF(TODAY()-AE$2>0,SUM(OFFSET(Start,$A95,18):OFFSET(Start,$A95,37)),0)","v":0},{"$f":"IF(TODAY()-AF$2>0,SUM(OFFSET(Start,$A95,18):OFFSET(Start,$A95,37)),0)","v":0},{"$f":"IF(TODAY()-AG$2>0,SUM(OFFSET(Start,$A95,18):OFFSET(Start,$A95,37)),0)","v":0},{"$f":"IF(TODAY()-AH$2>0,SUM(OFFSET(Start,$A95,18):OFFSET(Start,$A95,37)),0)","v":0},{"$f":"IF(TODAY()-AI$2>0,SUM(OFFSET(Start,$A95,18):OFFSET(Start,$A95,37)),0)","v":0},{"$f":"IF(TODAY()-AJ$2>0,SUM(OFFSET(Start,$A95,18):OFFSET(Start,$A95,37)),0)","v":0},{"$f":"IF(TODAY()-AK$2>0,SUM(OFFSET(Start,$A95,18):OFFSET(Start,$A95,37)),0)","v":0},{"$f":"IF(TODAY()-AL$2>0,SUM(OFFSET(Start,$A95,18):OFFSET(Start,$A95,37)),0)","v":0},0,0,0]
[95,{"$f":"OFFSET(Start,'Mellomlagring - antall besøk'!A96,0)","v":0},{"$f":"IF(TODAY()-C$2>0,SUM(OFFSET(Start,$A96,18):OFFSET(Start,$A96,37)),0)","v":0},{"$f":"IF(TODAY()-D$2>0,SUM(OFFSET(Start,$A96,18):OFFSET(Start,$A96,37)),0)","v":0},{"$f":"IF(TODAY()-E$2>0,SUM(OFFSET(Start,$A96,18):OFFSET(Start,$A96,37)),0)","v":0},{"$f":"IF(TODAY()-F$2>0,SUM(OFFSET(Start,$A96,18):OFFSET(Start,$A96,37)),0)","v":0},{"$f":"IF(TODAY()-G$2>0,SUM(OFFSET(Start,$A96,18):OFFSET(Start,$A96,37)),0)","v":0},{"$f":"IF(TODAY()-H$2>0,SUM(OFFSET(Start,$A96,18):OFFSET(Start,$A96,37)),0)","v":0},{"$f":"IF(TODAY()-I$2>0,SUM(OFFSET(Start,$A96,18):OFFSET(Start,$A96,37)),0)","v":0},{"$f":"IF(TODAY()-J$2>0,SUM(OFFSET(Start,$A96,18):OFFSET(Start,$A96,37)),0)","v":0},{"$f":"IF(TODAY()-K$2>0,SUM(OFFSET(Start,$A96,18):OFFSET(Start,$A96,37)),0)","v":0},{"$f":"IF(TODAY()-L$2>0,SUM(OFFSET(Start,$A96,18):OFFSET(Start,$A96,37)),0)","v":0},{"$f":"IF(TODAY()-M$2>0,SUM(OFFSET(Start,$A96,18):OFFSET(Start,$A96,37)),0)","v":0},{"$f":"IF(TODAY()-N$2>0,SUM(OFFSET(Start,$A96,18):OFFSET(Start,$A96,37)),0)","v":0},{"$f":"IF(TODAY()-O$2>0,SUM(OFFSET(Start,$A96,18):OFFSET(Start,$A96,37)),0)","v":0},{"$f":"IF(TODAY()-P$2>0,SUM(OFFSET(Start,$A96,18):OFFSET(Start,$A96,37)),0)","v":0},{"$f":"IF(TODAY()-Q$2>0,SUM(OFFSET(Start,$A96,18):OFFSET(Start,$A96,37)),0)","v":0},{"$f":"IF(TODAY()-R$2>0,SUM(OFFSET(Start,$A96,18):OFFSET(Start,$A96,37)),0)","v":0},{"$f":"IF(TODAY()-S$2>0,SUM(OFFSET(Start,$A96,18):OFFSET(Start,$A96,37)),0)","v":0},{"$f":"IF(TODAY()-T$2>0,SUM(OFFSET(Start,$A96,18):OFFSET(Start,$A96,37)),0)","v":0},{"$f":"IF(TODAY()-U$2>0,SUM(OFFSET(Start,$A96,18):OFFSET(Start,$A96,37)),0)","v":0},{"$f":"IF(TODAY()-V$2>0,SUM(OFFSET(Start,$A96,18):OFFSET(Start,$A96,37)),0)","v":0},{"$f":"IF(TODAY()-W$2>0,SUM(OFFSET(Start,$A96,18):OFFSET(Start,$A96,37)),0)","v":0},{"$f":"IF(TODAY()-X$2>0,SUM(OFFSET(Start,$A96,18):OFFSET(Start,$A96,37)),0)","v":0},{"$f":"IF(TODAY()-Y$2>0,SUM(OFFSET(Start,$A96,18):OFFSET(Start,$A96,37)),0)","v":0},{"$f":"IF(TODAY()-Z$2>0,SUM(OFFSET(Start,$A96,18):OFFSET(Start,$A96,37)),0)","v":0},{"$f":"IF(TODAY()-AA$2>0,SUM(OFFSET(Start,$A96,18):OFFSET(Start,$A96,37)),0)","v":0},{"$f":"IF(TODAY()-AB$2>0,SUM(OFFSET(Start,$A96,18):OFFSET(Start,$A96,37)),0)","v":0},{"$f":"IF(TODAY()-AC$2>0,SUM(OFFSET(Start,$A96,18):OFFSET(Start,$A96,37)),0)","v":0},{"$f":"IF(TODAY()-AD$2>0,SUM(OFFSET(Start,$A96,18):OFFSET(Start,$A96,37)),0)","v":0},{"$f":"IF(TODAY()-AE$2>0,SUM(OFFSET(Start,$A96,18):OFFSET(Start,$A96,37)),0)","v":0},{"$f":"IF(TODAY()-AF$2>0,SUM(OFFSET(Start,$A96,18):OFFSET(Start,$A96,37)),0)","v":0},{"$f":"IF(TODAY()-AG$2>0,SUM(OFFSET(Start,$A96,18):OFFSET(Start,$A96,37)),0)","v":0},{"$f":"IF(TODAY()-AH$2>0,SUM(OFFSET(Start,$A96,18):OFFSET(Start,$A96,37)),0)","v":0},{"$f":"IF(TODAY()-AI$2>0,SUM(OFFSET(Start,$A96,18):OFFSET(Start,$A96,37)),0)","v":0},{"$f":"IF(TODAY()-AJ$2>0,SUM(OFFSET(Start,$A96,18):OFFSET(Start,$A96,37)),0)","v":0},{"$f":"IF(TODAY()-AK$2>0,SUM(OFFSET(Start,$A96,18):OFFSET(Start,$A96,37)),0)","v":0},{"$f":"IF(TODAY()-AL$2>0,SUM(OFFSET(Start,$A96,18):OFFSET(Start,$A96,37)),0)","v":0},0,0,0]
[96,{"$f":"OFFSET(Start,'Mellomlagring - antall besøk'!A97,0)","v":0},{"$f":"IF(TODAY()-C$2>0,SUM(OFFSET(Start,$A97,18):OFFSET(Start,$A97,37)),0)","v":0},{"$f":"IF(TODAY()-D$2>0,SUM(OFFSET(Start,$A97,18):OFFSET(Start,$A97,37)),0)","v":0},{"$f":"IF(TODAY()-E$2>0,SUM(OFFSET(Start,$A97,18):OFFSET(Start,$A97,37)),0)","v":0},{"$f":"IF(TODAY()-F$2>0,SUM(OFFSET(Start,$A97,18):OFFSET(Start,$A97,37)),0)","v":0},{"$f":"IF(TODAY()-G$2>0,SUM(OFFSET(Start,$A97,18):OFFSET(Start,$A97,37)),0)","v":0},{"$f":"IF(TODAY()-H$2>0,SUM(OFFSET(Start,$A97,18):OFFSET(Start,$A97,37)),0)","v":0},{"$f":"IF(TODAY()-I$2>0,SUM(OFFSET(Start,$A97,18):OFFSET(Start,$A97,37)),0)","v":0},{"$f":"IF(TODAY()-J$2>0,SUM(OFFSET(Start,$A97,18):OFFSET(Start,$A97,37)),0)","v":0},{"$f":"IF(TODAY()-K$2>0,SUM(OFFSET(Start,$A97,18):OFFSET(Start,$A97,37)),0)","v":0},{"$f":"IF(TODAY()-L$2>0,SUM(OFFSET(Start,$A97,18):OFFSET(Start,$A97,37)),0)","v":0},{"$f":"IF(TODAY()-M$2>0,SUM(OFFSET(Start,$A97,18):OFFSET(Start,$A97,37)),0)","v":0},{"$f":"IF(TODAY()-N$2>0,SUM(OFFSET(Start,$A97,18):OFFSET(Start,$A97,37)),0)","v":0},{"$f":"IF(TODAY()-O$2>0,SUM(OFFSET(Start,$A97,18):OFFSET(Start,$A97,37)),0)","v":0},{"$f":"IF(TODAY()-P$2>0,SUM(OFFSET(Start,$A97,18):OFFSET(Start,$A97,37)),0)","v":0},{"$f":"IF(TODAY()-Q$2>0,SUM(OFFSET(Start,$A97,18):OFFSET(Start,$A97,37)),0)","v":0},{"$f":"IF(TODAY()-R$2>0,SUM(OFFSET(Start,$A97,18):OFFSET(Start,$A97,37)),0)","v":0},{"$f":"IF(TODAY()-S$2>0,SUM(OFFSET(Start,$A97,18):OFFSET(Start,$A97,37)),0)","v":0},{"$f":"IF(TODAY()-T$2>0,SUM(OFFSET(Start,$A97,18):OFFSET(Start,$A97,37)),0)","v":0},{"$f":"IF(TODAY()-U$2>0,SUM(OFFSET(Start,$A97,18):OFFSET(Start,$A97,37)),0)","v":0},{"$f":"IF(TODAY()-V$2>0,SUM(OFFSET(Start,$A97,18):OFFSET(Start,$A97,37)),0)","v":0},{"$f":"IF(TODAY()-W$2>0,SUM(OFFSET(Start,$A97,18):OFFSET(Start,$A97,37)),0)","v":0},{"$f":"IF(TODAY()-X$2>0,SUM(OFFSET(Start,$A97,18):OFFSET(Start,$A97,37)),0)","v":0},{"$f":"IF(TODAY()-Y$2>0,SUM(OFFSET(Start,$A97,18):OFFSET(Start,$A97,37)),0)","v":0},{"$f":"IF(TODAY()-Z$2>0,SUM(OFFSET(Start,$A97,18):OFFSET(Start,$A97,37)),0)","v":0},{"$f":"IF(TODAY()-AA$2>0,SUM(OFFSET(Start,$A97,18):OFFSET(Start,$A97,37)),0)","v":0},{"$f":"IF(TODAY()-AB$2>0,SUM(OFFSET(Start,$A97,18):OFFSET(Start,$A97,37)),0)","v":0},{"$f":"IF(TODAY()-AC$2>0,SUM(OFFSET(Start,$A97,18):OFFSET(Start,$A97,37)),0)","v":0},{"$f":"IF(TODAY()-AD$2>0,SUM(OFFSET(Start,$A97,18):OFFSET(Start,$A97,37)),0)","v":0},{"$f":"IF(TODAY()-AE$2>0,SUM(OFFSET(Start,$A97,18):OFFSET(Start,$A97,37)),0)","v":0},{"$f":"IF(TODAY()-AF$2>0,SUM(OFFSET(Start,$A97,18):OFFSET(Start,$A97,37)),0)","v":0},{"$f":"IF(TODAY()-AG$2>0,SUM(OFFSET(Start,$A97,18):OFFSET(Start,$A97,37)),0)","v":0},{"$f":"IF(TODAY()-AH$2>0,SUM(OFFSET(Start,$A97,18):OFFSET(Start,$A97,37)),0)","v":0},{"$f":"IF(TODAY()-AI$2>0,SUM(OFFSET(Start,$A97,18):OFFSET(Start,$A97,37)),0)","v":0},{"$f":"IF(TODAY()-AJ$2>0,SUM(OFFSET(Start,$A97,18):OFFSET(Start,$A97,37)),0)","v":0},{"$f":"IF(TODAY()-AK$2>0,SUM(OFFSET(Start,$A97,18):OFFSET(Start,$A97,37)),0)","v":0},{"$f":"IF(TODAY()-AL$2>0,SUM(OFFSET(Start,$A97,18):OFFSET(Start,$A97,37)),0)","v":0},0,0,0]
[97,{"$f":"OFFSET(Start,'Mellomlagring - antall besøk'!A98,0)","v":0},{"$f":"IF(TODAY()-C$2>0,SUM(OFFSET(Start,$A98,18):OFFSET(Start,$A98,37)),0)","v":0},{"$f":"IF(TODAY()-D$2>0,SUM(OFFSET(Start,$A98,18):OFFSET(Start,$A98,37)),0)","v":0},{"$f":"IF(TODAY()-E$2>0,SUM(OFFSET(Start,$A98,18):OFFSET(Start,$A98,37)),0)","v":0},{"$f":"IF(TODAY()-F$2>0,SUM(OFFSET(Start,$A98,18):OFFSET(Start,$A98,37)),0)","v":0},{"$f":"IF(TODAY()-G$2>0,SUM(OFFSET(Start,$A98,18):OFFSET(Start,$A98,37)),0)","v":0},{"$f":"IF(TODAY()-H$2>0,SUM(OFFSET(Start,$A98,18):OFFSET(Start,$A98,37)),0)","v":0},{"$f":"IF(TODAY()-I$2>0,SUM(OFFSET(Start,$A98,18):OFFSET(Start,$A98,37)),0)","v":0},{"$f":"IF(TODAY()-J$2>0,SUM(OFFSET(Start,$A98,18):OFFSET(Start,$A98,37)),0)","v":0},{"$f":"IF(TODAY()-K$2>0,SUM(OFFSET(Start,$A98,18):OFFSET(Start,$A98,37)),0)","v":0},{"$f":"IF(TODAY()-L$2>0,SUM(OFFSET(Start,$A98,18):OFFSET(Start,$A98,37)),0)","v":0},{"$f":"IF(TODAY()-M$2>0,SUM(OFFSET(Start,$A98,18):OFFSET(Start,$A98,37)),0)","v":0},{"$f":"IF(TODAY()-N$2>0,SUM(OFFSET(Start,$A98,18):OFFSET(Start,$A98,37)),0)","v":0},{"$f":"IF(TODAY()-O$2>0,SUM(OFFSET(Start,$A98,18):OFFSET(Start,$A98,37)),0)","v":0},{"$f":"IF(TODAY()-P$2>0,SUM(OFFSET(Start,$A98,18):OFFSET(Start,$A98,37)),0)","v":0},{"$f":"IF(TODAY()-Q$2>0,SUM(OFFSET(Start,$A98,18):OFFSET(Start,$A98,37)),0)","v":0},{"$f":"IF(TODAY()-R$2>0,SUM(OFFSET(Start,$A98,18):OFFSET(Start,$A98,37)),0)","v":0},{"$f":"IF(TODAY()-S$2>0,SUM(OFFSET(Start,$A98,18):OFFSET(Start,$A98,37)),0)","v":0},{"$f":"IF(TODAY()-T$2>0,SUM(OFFSET(Start,$A98,18):OFFSET(Start,$A98,37)),0)","v":0},{"$f":"IF(TODAY()-U$2>0,SUM(OFFSET(Start,$A98,18):OFFSET(Start,$A98,37)),0)","v":0},{"$f":"IF(TODAY()-V$2>0,SUM(OFFSET(Start,$A98,18):OFFSET(Start,$A98,37)),0)","v":0},{"$f":"IF(TODAY()-W$2>0,SUM(OFFSET(Start,$A98,18):OFFSET(Start,$A98,37)),0)","v":0},{"$f":"IF(TODAY()-X$2>0,SUM(OFFSET(Start,$A98,18):OFFSET(Start,$A98,37)),0)","v":0},{"$f":"IF(TODAY()-Y$2>0,SUM(OFFSET(Start,$A98,18):OFFSET(Start,$A98,37)),0)","v":0},{"$f":"IF(TODAY()-Z$2>0,SUM(OFFSET(Start,$A98,18):OFFSET(Start,$A98,37)),0)","v":0},{"$f":"IF(TODAY()-AA$2>0,SUM(OFFSET(Start,$A98,18):OFFSET(Start,$A98,37)),0)","v":0},{"$f":"IF(TODAY()-AB$2>0,SUM(OFFSET(Start,$A98,18):OFFSET(Start,$A98,37)),0)","v":0},{"$f":"IF(TODAY()-AC$2>0,SUM(OFFSET(Start,$A98,18):OFFSET(Start,$A98,37)),0)","v":0},{"$f":"IF(TODAY()-AD$2>0,SUM(OFFSET(Start,$A98,18):OFFSET(Start,$A98,37)),0)","v":0},{"$f":"IF(TODAY()-AE$2>0,SUM(OFFSET(Start,$A98,18):OFFSET(Start,$A98,37)),0)","v":0},{"$f":"IF(TODAY()-AF$2>0,SUM(OFFSET(Start,$A98,18):OFFSET(Start,$A98,37)),0)","v":0},{"$f":"IF(TODAY()-AG$2>0,SUM(OFFSET(Start,$A98,18):OFFSET(Start,$A98,37)),0)","v":0},{"$f":"IF(TODAY()-AH$2>0,SUM(OFFSET(Start,$A98,18):OFFSET(Start,$A98,37)),0)","v":0},{"$f":"IF(TODAY()-AI$2>0,SUM(OFFSET(Start,$A98,18):OFFSET(Start,$A98,37)),0)","v":0},{"$f":"IF(TODAY()-AJ$2>0,SUM(OFFSET(Start,$A98,18):OFFSET(Start,$A98,37)),0)","v":0},{"$f":"IF(TODAY()-AK$2>0,SUM(OFFSET(Start,$A98,18):OFFSET(Start,$A98,37)),0)","v":0},{"$f":"IF(TODAY()-AL$2>0,SUM(OFFSET(Start,$A98,18):OFFSET(Start,$A98,37)),0)","v":0},0,0,0]
[98,{"$f":"OFFSET(Start,'Mellomlagring - antall besøk'!A99,0)","v":0},{"$f":"IF(TODAY()-C$2>0,SUM(OFFSET(Start,$A99,18):OFFSET(Start,$A99,37)),0)","v":0},{"$f":"IF(TODAY()-D$2>0,SUM(OFFSET(Start,$A99,18):OFFSET(Start,$A99,37)),0)","v":0},{"$f":"IF(TODAY()-E$2>0,SUM(OFFSET(Start,$A99,18):OFFSET(Start,$A99,37)),0)","v":0},{"$f":"IF(TODAY()-F$2>0,SUM(OFFSET(Start,$A99,18):OFFSET(Start,$A99,37)),0)","v":0},{"$f":"IF(TODAY()-G$2>0,SUM(OFFSET(Start,$A99,18):OFFSET(Start,$A99,37)),0)","v":0},{"$f":"IF(TODAY()-H$2>0,SUM(OFFSET(Start,$A99,18):OFFSET(Start,$A99,37)),0)","v":0},{"$f":"IF(TODAY()-I$2>0,SUM(OFFSET(Start,$A99,18):OFFSET(Start,$A99,37)),0)","v":0},{"$f":"IF(TODAY()-J$2>0,SUM(OFFSET(Start,$A99,18):OFFSET(Start,$A99,37)),0)","v":0},{"$f":"IF(TODAY()-K$2>0,SUM(OFFSET(Start,$A99,18):OFFSET(Start,$A99,37)),0)","v":0},{"$f":"IF(TODAY()-L$2>0,SUM(OFFSET(Start,$A99,18):OFFSET(Start,$A99,37)),0)","v":0},{"$f":"IF(TODAY()-M$2>0,SUM(OFFSET(Start,$A99,18):OFFSET(Start,$A99,37)),0)","v":0},{"$f":"IF(TODAY()-N$2>0,SUM(OFFSET(Start,$A99,18):OFFSET(Start,$A99,37)),0)","v":0},{"$f":"IF(TODAY()-O$2>0,SUM(OFFSET(Start,$A99,18):OFFSET(Start,$A99,37)),0)","v":0},{"$f":"IF(TODAY()-P$2>0,SUM(OFFSET(Start,$A99,18):OFFSET(Start,$A99,37)),0)","v":0},{"$f":"IF(TODAY()-Q$2>0,SUM(OFFSET(Start,$A99,18):OFFSET(Start,$A99,37)),0)","v":0},{"$f":"IF(TODAY()-R$2>0,SUM(OFFSET(Start,$A99,18):OFFSET(Start,$A99,37)),0)","v":0},{"$f":"IF(TODAY()-S$2>0,SUM(OFFSET(Start,$A99,18):OFFSET(Start,$A99,37)),0)","v":0},{"$f":"IF(TODAY()-T$2>0,SUM(OFFSET(Start,$A99,18):OFFSET(Start,$A99,37)),0)","v":0},{"$f":"IF(TODAY()-U$2>0,SUM(OFFSET(Start,$A99,18):OFFSET(Start,$A99,37)),0)","v":0},{"$f":"IF(TODAY()-V$2>0,SUM(OFFSET(Start,$A99,18):OFFSET(Start,$A99,37)),0)","v":0},{"$f":"IF(TODAY()-W$2>0,SUM(OFFSET(Start,$A99,18):OFFSET(Start,$A99,37)),0)","v":0},{"$f":"IF(TODAY()-X$2>0,SUM(OFFSET(Start,$A99,18):OFFSET(Start,$A99,37)),0)","v":0},{"$f":"IF(TODAY()-Y$2>0,SUM(OFFSET(Start,$A99,18):OFFSET(Start,$A99,37)),0)","v":0},{"$f":"IF(TODAY()-Z$2>0,SUM(OFFSET(Start,$A99,18):OFFSET(Start,$A99,37)),0)","v":0},{"$f":"IF(TODAY()-AA$2>0,SUM(OFFSET(Start,$A99,18):OFFSET(Start,$A99,37)),0)","v":0},{"$f":"IF(TODAY()-AB$2>0,SUM(OFFSET(Start,$A99,18):OFFSET(Start,$A99,37)),0)","v":0},{"$f":"IF(TODAY()-AC$2>0,SUM(OFFSET(Start,$A99,18):OFFSET(Start,$A99,37)),0)","v":0},{"$f":"IF(TODAY()-AD$2>0,SUM(OFFSET(Start,$A99,18):OFFSET(Start,$A99,37)),0)","v":0},{"$f":"IF(TODAY()-AE$2>0,SUM(OFFSET(Start,$A99,18):OFFSET(Start,$A99,37)),0)","v":0},{"$f":"IF(TODAY()-AF$2>0,SUM(OFFSET(Start,$A99,18):OFFSET(Start,$A99,37)),0)","v":0},{"$f":"IF(TODAY()-AG$2>0,SUM(OFFSET(Start,$A99,18):OFFSET(Start,$A99,37)),0)","v":0},{"$f":"IF(TODAY()-AH$2>0,SUM(OFFSET(Start,$A99,18):OFFSET(Start,$A99,37)),0)","v":0},{"$f":"IF(TODAY()-AI$2>0,SUM(OFFSET(Start,$A99,18):OFFSET(Start,$A99,37)),0)","v":0},{"$f":"IF(TODAY()-AJ$2>0,SUM(OFFSET(Start,$A99,18):OFFSET(Start,$A99,37)),0)","v":0},{"$f":"IF(TODAY()-AK$2>0,SUM(OFFSET(Start,$A99,18):OFFSET(Start,$A99,37)),0)","v":0},{"$f":"IF(TODAY()-AL$2>0,SUM(OFFSET(Start,$A99,18):OFFSET(Start,$A99,37)),0)","v":0},0,0,0]
[99,{"$f":"OFFSET(Start,'Mellomlagring - antall besøk'!A100,0)","v":0},{"$f":"IF(TODAY()-C$2>0,SUM(OFFSET(Start,$A100,18):OFFSET(Start,$A100,37)),0)","v":0},{"$f":"IF(TODAY()-D$2>0,SUM(OFFSET(Start,$A100,18):OFFSET(Start,$A100,37)),0)","v":0},{"$f":"IF(TODAY()-E$2>0,SUM(OFFSET(Start,$A100,18):OFFSET(Start,$A100,37)),0)","v":0},{"$f":"IF(TODAY()-F$2>0,SUM(OFFSET(Start,$A100,18):OFFSET(Start,$A100,37)),0)","v":0},{"$f":"IF(TODAY()-G$2>0,SUM(OFFSET(Start,$A100,18):OFFSET(Start,$A100,37)),0)","v":0},{"$f":"IF(TODAY()-H$2>0,SUM(OFFSET(Start,$A100,18):OFFSET(Start,$A100,37)),0)","v":0},{"$f":"IF(TODAY()-I$2>0,SUM(OFFSET(Start,$A100,18):OFFSET(Start,$A100,37)),0)","v":0},{"$f":"IF(TODAY()-J$2>0,SUM(OFFSET(Start,$A100,18):OFFSET(Start,$A100,37)),0)","v":0},{"$f":"IF(TODAY()-K$2>0,SUM(OFFSET(Start,$A100,18):OFFSET(Start,$A100,37)),0)","v":0},{"$f":"IF(TODAY()-L$2>0,SUM(OFFSET(Start,$A100,18):OFFSET(Start,$A100,37)),0)","v":0},{"$f":"IF(TODAY()-M$2>0,SUM(OFFSET(Start,$A100,18):OFFSET(Start,$A100,37)),0)","v":0},{"$f":"IF(TODAY()-N$2>0,SUM(OFFSET(Start,$A100,18):OFFSET(Start,$A100,37)),0)","v":0},{"$f":"IF(TODAY()-O$2>0,SUM(OFFSET(Start,$A100,18):OFFSET(Start,$A100,37)),0)","v":0},{"$f":"IF(TODAY()-P$2>0,SUM(OFFSET(Start,$A100,18):OFFSET(Start,$A100,37)),0)","v":0},{"$f":"IF(TODAY()-Q$2>0,SUM(OFFSET(Start,$A100,18):OFFSET(Start,$A100,37)),0)","v":0},{"$f":"IF(TODAY()-R$2>0,SUM(OFFSET(Start,$A100,18):OFFSET(Start,$A100,37)),0)","v":0},{"$f":"IF(TODAY()-S$2>0,SUM(OFFSET(Start,$A100,18):OFFSET(Start,$A100,37)),0)","v":0},{"$f":"IF(TODAY()-T$2>0,SUM(OFFSET(Start,$A100,18):OFFSET(Start,$A100,37)),0)","v":0},{"$f":"IF(TODAY()-U$2>0,SUM(OFFSET(Start,$A100,18):OFFSET(Start,$A100,37)),0)","v":0},{"$f":"IF(TODAY()-V$2>0,SUM(OFFSET(Start,$A100,18):OFFSET(Start,$A100,37)),0)","v":0},{"$f":"IF(TODAY()-W$2>0,SUM(OFFSET(Start,$A100,18):OFFSET(Start,$A100,37)),0)","v":0},{"$f":"IF(TODAY()-X$2>0,SUM(OFFSET(Start,$A100,18):OFFSET(Start,$A100,37)),0)","v":0},{"$f":"IF(TODAY()-Y$2>0,SUM(OFFSET(Start,$A100,18):OFFSET(Start,$A100,37)),0)","v":0},{"$f":"IF(TODAY()-Z$2>0,SUM(OFFSET(Start,$A100,18):OFFSET(Start,$A100,37)),0)","v":0},{"$f":"IF(TODAY()-AA$2>0,SUM(OFFSET(Start,$A100,18):OFFSET(Start,$A100,37)),0)","v":0},{"$f":"IF(TODAY()-AB$2>0,SUM(OFFSET(Start,$A100,18):OFFSET(Start,$A100,37)),0)","v":0},{"$f":"IF(TODAY()-AC$2>0,SUM(OFFSET(Start,$A100,18):OFFSET(Start,$A100,37)),0)","v":0},{"$f":"IF(TODAY()-AD$2>0,SUM(OFFSET(Start,$A100,18):OFFSET(Start,$A100,37)),0)","v":0},{"$f":"IF(TODAY()-AE$2>0,SUM(OFFSET(Start,$A100,18):OFFSET(Start,$A100,37)),0)","v":0},{"$f":"IF(TODAY()-AF$2>0,SUM(OFFSET(Start,$A100,18):OFFSET(Start,$A100,37)),0)","v":0},{"$f":"IF(TODAY()-AG$2>0,SUM(OFFSET(Start,$A100,18):OFFSET(Start,$A100,37)),0)","v":0},{"$f":"IF(TODAY()-AH$2>0,SUM(OFFSET(Start,$A100,18):OFFSET(Start,$A100,37)),0)","v":0},{"$f":"IF(TODAY()-AI$2>0,SUM(OFFSET(Start,$A100,18):OFFSET(Start,$A100,37)),0)","v":0},{"$f":"IF(TODAY()-AJ$2>0,SUM(OFFSET(Start,$A100,18):OFFSET(Start,$A100,37)),0)","v":0},{"$f":"IF(TODAY()-AK$2>0,SUM(OFFSET(Start,$A100,18):OFFSET(Start,$A100,37)),0)","v":0},{"$f":"IF(TODAY()-AL$2>0,SUM(OFFSET(Start,$A100,18):OFFSET(Start,$A100,37)),0)","v":0},0,0,0]
[100,{"$f":"OFFSET(Start,'Mellomlagring - antall besøk'!A101,0)","v":0},{"$f":"IF(TODAY()-C$2>0,SUM(OFFSET(Start,$A101,18):OFFSET(Start,$A101,37)),0)","v":0},{"$f":"IF(TODAY()-D$2>0,SUM(OFFSET(Start,$A101,18):OFFSET(Start,$A101,37)),0)","v":0},{"$f":"IF(TODAY()-E$2>0,SUM(OFFSET(Start,$A101,18):OFFSET(Start,$A101,37)),0)","v":0},{"$f":"IF(TODAY()-F$2>0,SUM(OFFSET(Start,$A101,18):OFFSET(Start,$A101,37)),0)","v":0},{"$f":"IF(TODAY()-G$2>0,SUM(OFFSET(Start,$A101,18):OFFSET(Start,$A101,37)),0)","v":0},{"$f":"IF(TODAY()-H$2>0,SUM(OFFSET(Start,$A101,18):OFFSET(Start,$A101,37)),0)","v":0},{"$f":"IF(TODAY()-I$2>0,SUM(OFFSET(Start,$A101,18):OFFSET(Start,$A101,37)),0)","v":0},{"$f":"IF(TODAY()-J$2>0,SUM(OFFSET(Start,$A101,18):OFFSET(Start,$A101,37)),0)","v":0},{"$f":"IF(TODAY()-K$2>0,SUM(OFFSET(Start,$A101,18):OFFSET(Start,$A101,37)),0)","v":0},{"$f":"IF(TODAY()-L$2>0,SUM(OFFSET(Start,$A101,18):OFFSET(Start,$A101,37)),0)","v":0},{"$f":"IF(TODAY()-M$2>0,SUM(OFFSET(Start,$A101,18):OFFSET(Start,$A101,37)),0)","v":0},{"$f":"IF(TODAY()-N$2>0,SUM(OFFSET(Start,$A101,18):OFFSET(Start,$A101,37)),0)","v":0},{"$f":"IF(TODAY()-O$2>0,SUM(OFFSET(Start,$A101,18):OFFSET(Start,$A101,37)),0)","v":0},{"$f":"IF(TODAY()-P$2>0,SUM(OFFSET(Start,$A101,18):OFFSET(Start,$A101,37)),0)","v":0},{"$f":"IF(TODAY()-Q$2>0,SUM(OFFSET(Start,$A101,18):OFFSET(Start,$A101,37)),0)","v":0},{"$f":"IF(TODAY()-R$2>0,SUM(OFFSET(Start,$A101,18):OFFSET(Start,$A101,37)),0)","v":0},{"$f":"IF(TODAY()-S$2>0,SUM(OFFSET(Start,$A101,18):OFFSET(Start,$A101,37)),0)","v":0},{"$f":"IF(TODAY()-T$2>0,SUM(OFFSET(Start,$A101,18):OFFSET(Start,$A101,37)),0)","v":0},{"$f":"IF(TODAY()-U$2>0,SUM(OFFSET(Start,$A101,18):OFFSET(Start,$A101,37)),0)","v":0},{"$f":"IF(TODAY()-V$2>0,SUM(OFFSET(Start,$A101,18):OFFSET(Start,$A101,37)),0)","v":0},{"$f":"IF(TODAY()-W$2>0,SUM(OFFSET(Start,$A101,18):OFFSET(Start,$A101,37)),0)","v":0},{"$f":"IF(TODAY()-X$2>0,SUM(OFFSET(Start,$A101,18):OFFSET(Start,$A101,37)),0)","v":0},{"$f":"IF(TODAY()-Y$2>0,SUM(OFFSET(Start,$A101,18):OFFSET(Start,$A101,37)),0)","v":0},{"$f":"IF(TODAY()-Z$2>0,SUM(OFFSET(Start,$A101,18):OFFSET(Start,$A101,37)),0)","v":0},{"$f":"IF(TODAY()-AA$2>0,SUM(OFFSET(Start,$A101,18):OFFSET(Start,$A101,37)),0)","v":0},{"$f":"IF(TODAY()-AB$2>0,SUM(OFFSET(Start,$A101,18):OFFSET(Start,$A101,37)),0)","v":0},{"$f":"IF(TODAY()-AC$2>0,SUM(OFFSET(Start,$A101,18):OFFSET(Start,$A101,37)),0)","v":0},{"$f":"IF(TODAY()-AD$2>0,SUM(OFFSET(Start,$A101,18):OFFSET(Start,$A101,37)),0)","v":0},{"$f":"IF(TODAY()-AE$2>0,SUM(OFFSET(Start,$A101,18):OFFSET(Start,$A101,37)),0)","v":0},{"$f":"IF(TODAY()-AF$2>0,SUM(OFFSET(Start,$A101,18):OFFSET(Start,$A101,37)),0)","v":0},{"$f":"IF(TODAY()-AG$2>0,SUM(OFFSET(Start,$A101,18):OFFSET(Start,$A101,37)),0)","v":0},{"$f":"IF(TODAY()-AH$2>0,SUM(OFFSET(Start,$A101,18):OFFSET(Start,$A101,37)),0)","v":0},{"$f":"IF(TODAY()-AI$2>0,SUM(OFFSET(Start,$A101,18):OFFSET(Start,$A101,37)),0)","v":0},{"$f":"IF(TODAY()-AJ$2>0,SUM(OFFSET(Start,$A101,18):OFFSET(Start,$A101,37)),0)","v":0},{"$f":"IF(TODAY()-AK$2>0,SUM(OFFSET(Start,$A101,18):OFFSET(Start,$A101,37)),0)","v":0},{"$f":"IF(TODAY()-AL$2>0,SUM(OFFSET(Start,$A101,18):OFFSET(Start,$A101,37)),0)","v":0},0,0,0]
[101,{"$f":"OFFSET(Start,'Mellomlagring - antall besøk'!A102,0)","v":0},{"$f":"IF(TODAY()-C$2>0,SUM(OFFSET(Start,$A102,18):OFFSET(Start,$A102,37)),0)","v":0},{"$f":"IF(TODAY()-D$2>0,SUM(OFFSET(Start,$A102,18):OFFSET(Start,$A102,37)),0)","v":0},{"$f":"IF(TODAY()-E$2>0,SUM(OFFSET(Start,$A102,18):OFFSET(Start,$A102,37)),0)","v":0},{"$f":"IF(TODAY()-F$2>0,SUM(OFFSET(Start,$A102,18):OFFSET(Start,$A102,37)),0)","v":0},{"$f":"IF(TODAY()-G$2>0,SUM(OFFSET(Start,$A102,18):OFFSET(Start,$A102,37)),0)","v":0},{"$f":"IF(TODAY()-H$2>0,SUM(OFFSET(Start,$A102,18):OFFSET(Start,$A102,37)),0)","v":0},{"$f":"IF(TODAY()-I$2>0,SUM(OFFSET(Start,$A102,18):OFFSET(Start,$A102,37)),0)","v":0},{"$f":"IF(TODAY()-J$2>0,SUM(OFFSET(Start,$A102,18):OFFSET(Start,$A102,37)),0)","v":0},{"$f":"IF(TODAY()-K$2>0,SUM(OFFSET(Start,$A102,18):OFFSET(Start,$A102,37)),0)","v":0},{"$f":"IF(TODAY()-L$2>0,SUM(OFFSET(Start,$A102,18):OFFSET(Start,$A102,37)),0)","v":0},{"$f":"IF(TODAY()-M$2>0,SUM(OFFSET(Start,$A102,18):OFFSET(Start,$A102,37)),0)","v":0},{"$f":"IF(TODAY()-N$2>0,SUM(OFFSET(Start,$A102,18):OFFSET(Start,$A102,37)),0)","v":0},{"$f":"IF(TODAY()-O$2>0,SUM(OFFSET(Start,$A102,18):OFFSET(Start,$A102,37)),0)","v":0},{"$f":"IF(TODAY()-P$2>0,SUM(OFFSET(Start,$A102,18):OFFSET(Start,$A102,37)),0)","v":0},{"$f":"IF(TODAY()-Q$2>0,SUM(OFFSET(Start,$A102,18):OFFSET(Start,$A102,37)),0)","v":0},{"$f":"IF(TODAY()-R$2>0,SUM(OFFSET(Start,$A102,18):OFFSET(Start,$A102,37)),0)","v":0},{"$f":"IF(TODAY()-S$2>0,SUM(OFFSET(Start,$A102,18):OFFSET(Start,$A102,37)),0)","v":0},{"$f":"IF(TODAY()-T$2>0,SUM(OFFSET(Start,$A102,18):OFFSET(Start,$A102,37)),0)","v":0},{"$f":"IF(TODAY()-U$2>0,SUM(OFFSET(Start,$A102,18):OFFSET(Start,$A102,37)),0)","v":0},{"$f":"IF(TODAY()-V$2>0,SUM(OFFSET(Start,$A102,18):OFFSET(Start,$A102,37)),0)","v":0},{"$f":"IF(TODAY()-W$2>0,SUM(OFFSET(Start,$A102,18):OFFSET(Start,$A102,37)),0)","v":0},{"$f":"IF(TODAY()-X$2>0,SUM(OFFSET(Start,$A102,18):OFFSET(Start,$A102,37)),0)","v":0},{"$f":"IF(TODAY()-Y$2>0,SUM(OFFSET(Start,$A102,18):OFFSET(Start,$A102,37)),0)","v":0},{"$f":"IF(TODAY()-Z$2>0,SUM(OFFSET(Start,$A102,18):OFFSET(Start,$A102,37)),0)","v":0},{"$f":"IF(TODAY()-AA$2>0,SUM(OFFSET(Start,$A102,18):OFFSET(Start,$A102,37)),0)","v":0},{"$f":"IF(TODAY()-AB$2>0,SUM(OFFSET(Start,$A102,18):OFFSET(Start,$A102,37)),0)","v":0},{"$f":"IF(TODAY()-AC$2>0,SUM(OFFSET(Start,$A102,18):OFFSET(Start,$A102,37)),0)","v":0},{"$f":"IF(TODAY()-AD$2>0,SUM(OFFSET(Start,$A102,18):OFFSET(Start,$A102,37)),0)","v":0},{"$f":"IF(TODAY()-AE$2>0,SUM(OFFSET(Start,$A102,18):OFFSET(Start,$A102,37)),0)","v":0},{"$f":"IF(TODAY()-AF$2>0,SUM(OFFSET(Start,$A102,18):OFFSET(Start,$A102,37)),0)","v":0},{"$f":"IF(TODAY()-AG$2>0,SUM(OFFSET(Start,$A102,18):OFFSET(Start,$A102,37)),0)","v":0},{"$f":"IF(TODAY()-AH$2>0,SUM(OFFSET(Start,$A102,18):OFFSET(Start,$A102,37)),0)","v":0},{"$f":"IF(TODAY()-AI$2>0,SUM(OFFSET(Start,$A102,18):OFFSET(Start,$A102,37)),0)","v":0},{"$f":"IF(TODAY()-AJ$2>0,SUM(OFFSET(Start,$A102,18):OFFSET(Start,$A102,37)),0)","v":0},{"$f":"IF(TODAY()-AK$2>0,SUM(OFFSET(Start,$A102,18):OFFSET(Start,$A102,37)),0)","v":0},{"$f":"IF(TODAY()-AL$2>0,SUM(OFFSET(Start,$A102,18):OFFSET(Start,$A102,37)),0)","v":0},0,0,0]
[null,"Sum timer per måned",{"$f":"SUM(C3:C102)","v":531.34},{"$f":"SUM(D3:D102)","v":531.34},531.34,531.34,531.34,531.34,0,0,0,0,0,0,0,0,0,0,0,0,0,0,0,0,0,0,0,0,0,0,0,0,0,0,0,0,0,0]

{"sheet":"Mellomlagring - antall besøk","index":6,"n_rows":102,"n_cols":38,"rows_kept":102,"cut":false,"hidden":true,"merged":[]}
[null,null,39,{"$f":"C1+3","v":42},{"$f":"D1+3","v":45},48,51,54,57,60,63,66,69,72,75,78,81,84,87,90,93,96,99,102,105,108,111,114,117,120,123,126,129,132,135,138,141,144]
["Nummer","Bruker ID",{"$f":"OFFSET('Månedlig registrering'!$AN$6,0,COLUMN(C:C)*3-9)","v":"2018-01-01"},{"$f":"OFFSET('Månedlig registrering'!$AN$6,0,COLUMN(D:D)*3-9)","v":"2018-02-01"},{"$f":"OFFSET('Månedlig registrering'!$AN$6,0,COLUMN(E:E)*3-9)","v":"2018-03-01"},{"$f":"OFFSET('Månedlig registrering'!$AN$6,0,COLUMN(F:F)*3-9)","v":"2018-04-01"},{"$f":"OFFSET('Månedlig registrering'!$AN$6,0,COLUMN(G:G)*3-9)","v":"2018-05-01"},{"$f":"OFFSET('Månedlig registrering'!$AN$6,0,COLUMN(H:H)*3-9)","v":"2018-06-01"},{"$f":"OFFSET('Månedlig registrering'!$AN$6,0,COLUMN(I:I)*3-9)","v":"2018-07-01"},{"$f":"OFFSET('Månedlig registrering'!$AN$6,0,COLUMN(J:J)*3-9)","v":"2018-08-01"},{"$f":"OFFSET('Månedlig registrering'!$AN$6,0,COLUMN(K:K)*3-9)","v":"2018-09-01"},{"$f":"OFFSET('Månedlig registrering'!$AN$6,0,COLUMN(L:L)*3-9)","v":"2018-10-01"},{"$f":"OFFSET('Månedlig registrering'!$AN$6,0,COLUMN(M:M)*3-9)","v":"2018-11-01"},{"$f":"OFFSET('Månedlig registrering'!$AN$6,0,COLUMN(N:N)*3-9)","v":"2018-12-01"},{"$f":"OFFSET('Månedlig registrering'!$AN$6,0,COLUMN(O:O)*3-9)","v":"2019-01-01"},{"$f":"OFFSET('Månedlig registrering'!$AN$6,0,COLUMN(P:P)*3-9)","v":"2019-02-01"},{"$f":"OFFSET('Månedlig registrering'!$AN$6,0,COLUMN(Q:Q)*3-9)","v":"2019-03-01"},{"$f":"OFFSET('Månedlig registrering'!$AN$6,0,COLUMN(R:R)*3-9)","v":"2019-04-01"},{"$f":"OFFSET('Månedlig registrering'!$AN$6,0,COLUMN(S:S)*3-9)","v":"2019-05-01"},{"$f":"OFFSET('Månedlig registrering'!$AN$6,0,COLUMN(T:T)*3-9)","v":"2019-06-01"},{"$f":"OFFSET('Månedlig registrering'!$AN$6,0,COLUMN(U:U)*3-9)","v":"2019-07-01"},{"$f":"OFFSET('Månedlig registrering'!$AN$6,0,COLUMN(V:V)*3-9)","v":"2019-08-01"},{"$f":"OFFSET('Månedlig registrering'!$AN$6,0,COLUMN(W:W)*3-9)","v":"2019-09-01"},{"$f":"OFFSET('Månedlig registrering'!$AN$6,0,COLUMN(X:X)*3-9)","v":"2019-10-01"},{"$f":"OFFSET('Månedlig registrering'!$AN$6,0,COLUMN(Y:Y)*3-9)","v":"2019-11-01"},{"$f":"OFFSET('Månedlig registrering'!$AN$6,0,COLUMN(Z:Z)*3-9)","v":"2019-12-01"},{"$f":"OFFSET('Månedlig registrering'!$AN$6,0,COLUMN(AA:AA)*3-9)","v":"2020-01-01"},{"$f":"OFFSET('Månedlig registrering'!$AN$6,0,COLUMN(AB:AB)*3-9)","v":"2020-02-01"},{"$f":"OFFSET('Månedlig registrering'!$AN$6,0,COLUMN(AC:AC)*3-9)","v":"2020-03-01"},{"$f":"OFFSET('Månedlig registrering'!$AN$6,0,COLUMN(AD:AD)*3-9)","v":"2020-04-01"},{"$f":"OFFSET('Månedlig registrering'!$AN$6,0,COLUMN(AE:AE)*3-9)","v":"2020-05-01"},{"$f":"OFFSET('Månedlig registrering'!$AN$6,0,COLUMN(AF:AF)*3-9)","v":"2020-06-01"},{"$f":"OFFSET('Månedlig registrering'!$AN$6,0,COLUMN(AG:AG)*3-9)","v":"2020-07-01"},{"$f":"OFFSET('Månedlig registrering'!$AN$6,0,COLUMN(AH:AH)*3-9)","v":"2020-08-01"},{"$f":"OFFSET('Månedlig registrering'!$AN$6,0,COLUMN(AI:AI)*3-9)","v":"2020-09-01"},{"$f":"OFFSET('Månedlig registrering'!$AN$6,0,COLUMN(AJ:AJ)*3-9)","v":"2020-10-01"},{"$f":"OFFSET('Månedlig registrering'!$AN$6,0,COLUMN(AK:AK)*3-9)","v":"2020-11-01"},{"$f":"OFFSET('Månedlig registrering'!$AN$6,0,COLUMN(AL:AL)*3-9)","v":"2020-12-01"}]
[2,{"$f":"OFFSET(Start,'Mellomlagring - antall besøk'!A3,0)","v":1001},{"$f":"OFFSET(Start,$A3,C$1)","v":90},{"$f":"OFFSET(Start,$A3,D$1)","v":10},10,10,10,0,0,0,0,0,0,0,0,0,0,0,0,0,0,0,0,0,0,0,0,0,0,0,0,0,0,0,0,0,0,0]
[{"$f":"+A3+1","v":3},{"$f":"OFFSET(Start,'Mellomlagring - antall besøk'!A4,0)","v":1002},{"$f":"OFFSET(Start,$A4,C$1)","v":0},0,30,2,2,0,0,0,0,0,0,0,0,0,0,0,0,0,0,0,0,0,0,0,0,0,0,0,0,0,0,0,0,0,0,0]
[{"$f":"+A4+1","v":4},{"$f":"OFFSET(Start,'Mellomlagring - antall besøk'!A5,0)","v":1003},0,0,0,0,0,0,0,0,0,0,0,0,0,0,0,0,0,0,0,0,0,0,0,0,0,0,0,0,0,0,0,0,0,0,0,0]
[5,{"$f":"OFFSET(Start,'Mellomlagring - antall besøk'!A6,0)","v":0},0,0,0,0,0,0,0,0,0,0,0,0,0,0,0,0,0,0,0,0,0,0,0,0,0,0,0,0,0,0,0,0,0,0,0,0]
[6,{"$f":"OFFSET(Start,'Mellomlagring - antall besøk'!A7,0)","v":0},0,0,0,0,0,0,0,0,0,0,0,0,0,0,0,0,0,0,0,0,0,0,0,0,0,0,0,0,0,0,0,0,0,0,0,0]
[7,{"$f":"OFFSET(Start,'Mellomlagring - antall besøk'!A8,0)","v":0},0,0,0,0,0,0,0,0,0,0,0,0,0,0,0,0,0,0,0,0,0,0,0,0,0,0,0,0,0,0,0,0,0,0,0,0]
[8,{"$f":"OFFSET(Start,'Mellomlagring - antall besøk'!A9,0)","v":0},0,0,0,0,0,0,0,0,0,0,0,0,0,0,0,0,{"$f":"OFFSET(Start,$A9,S$1)","v":0},0,0,0,0,0,0,0,0,0,0,0,0,0,0,0,{"$f":"OFFSET(Start,$A9,AI$1)","v":0},0,0,0]
[9,{"$f":"OFFSET(Start,'Mellomlagring - antall besøk'!A10,0)","v":0},0,0,0,0,0,0,0,0,0,0,0,0,0,0,0,0,0,0,0,0,0,0,0,0,0,0,0,0,0,0,0,0,0,0,0,0]
[10,{"$f":"OFFSET(Start,'Mellomlagring - antall besøk'!A11,0)","v":0},0,0,0,0,0,0,0,0,0,0,0,0,0,0,0,0,0,0,0,0,0,0,0,0,0,0,0,0,0,0,0,0,0,0,0,0]
[11,{"$f":"OFFSET(Start,'Mellomlagring - antall besøk'!A12,0)","v":0},0,0,0,0,0,0,0,0,0,0,0,0,0,0,0,0,0,0,0,0,0,0,0,0,0,0,0,0,0,0,0,0,0,0,0,0]
[12,{"$f":"OFFSET(Start,'Mellomlagring - antall besøk'!A13,0)","v":0},0,0,0,0,0,0,0,0,0,0,0,0,0,0,0,0,0,0,0,0,0,0,0,0,0,0,0,0,0,0,0,0,0,0,0,0]
[13,{"$f":"OFFSET(Start,'Mellomlagring - antall besøk'!A14,0)","v":0},0,0,0,0,0,0,0,0,0,0,0,0,0,0,0,0,0,0,0,0,0,0,0,0,0,0,0,0,0,0,0,0,0,0,0,0]
[14,{"$f":"OFFSET(Start,'Mellomlagring - antall besøk'!A15,0)","v":0},0,0,0,0,0,0,0,0,0,0,0,0,0,0,0,0,0,0,0,0,0,0,0,0,0,0,0,0,0,0,0,0,0,0,0,0]
[15,{"$f":"OFFSET(Start,'Mellomlagring - antall besøk'!A16,0)","v":0},0,0,0,0,0,0,0,0,0,0,0,0,0,0,0,0,0,0,0,0,0,0,0,0,0,0,0,0,0,0,0,0,0,0,0,0]
[16,{"$f":"OFFSET(Start,'Mellomlagring - antall besøk'!A17,0)","v":0},0,0,0,0,0,0,0,0,0,0,0,0,0,0,0,0,0,0,0,0,0,0,0,0,0,0,0,0,0,0,0,0,0,0,0,0]
[17,{"$f":"OFFSET(Start,'Mellomlagring - antall besøk'!A18,0)","v":0},0,0,0,0,0,0,0,0,0,0,0,0,0,0,0,0,0,0,0,0,0,0,0,0,0,0,0,0,0,0,0,0,0,0,0,0]
[18,{"$f":"OFFSET(Start,'Mellomlagring - antall besøk'!A19,0)","v":0},0,0,0,0,0,0,0,0,0,0,0,0,0,0,0,0,0,0,0,0,0,0,0,0,0,0,0,0,0,0,0,0,0,0,0,0]
[19,{"$f":"OFFSET(Start,'Mellomlagring - antall besøk'!A20,0)","v":0},0,0,0,0,0,0,0,0,0,0,0,0,0,0,0,0,0,0,0,0,0,0,0,0,0,0,0,0,0,0,0,0,0,0,0,0]
[20,{"$f":"OFFSET(Start,'Mellomlagring - antall besøk'!A21,0)","v":0},0,0,0,0,0,0,0,0,0,0,0,0,0,0,0,0,0,0,0,0,0,0,0,0,0,0,0,0,0,0,0,0,0,0,0,0]
[21,{"$f":"OFFSET(Start,'Mellomlagring - antall besøk'!A22,0)","v":0},0,0,0,0,0,0,0,0,0,0,0,0,0,0,0,0,0,0,0,0,0,0,0,0,0,0,0,0,0,0,0,0,0,0,0,0]
[22,{"$f":"OFFSET(Start,'Mellomlagring - antall besøk'!A23,0)","v":0},0,0,0,0,0,0,0,0,0,0,0,0,0,0,0,0,0,0,0,0,0,0,0,0,0,0,0,0,0,0,0,0,0,0,0,0]
[23,{"$f":"OFFSET(Start,'Mellomlagring - antall besøk'!A24,0)","v":0},0,0,0,0,0,0,0,0,0,0,0,0,0,0,0,0,0,0,0,0,0,0,0,0,0,0,0,0,0,0,0,{"$f":"OFFSET(Start,$A24,AH$1)","v":0},0,0,0,0]
[24,{"$f":"OFFSET(Start,'Mellomlagring - antall besøk'!A25,0)","v":0},0,0,0,0,0,0,0,0,0,{"$f":"OFFSET(Start,$A25,L$1)","v":0},0,0,0,0,0,0,0,0,0,0,0,0,0,0,0,{"$f":"OFFSET(Start,$A25,AB$1)","v":0},0,0,0,0,0,0,0,0,0,0]
[25,{"$f":"OFFSET(Start,'Mellomlagring - antall besøk'!A26,0)","v":0},{"$f":"OFFSET(Start,$A26,C$1)","v":0},0,0,0,0,0,0,0,0,0,0,0,0,0,0,0,0,0,0,0,0,0,0,0,0,0,0,0,0,0,0,0,0,0,0,0]
[26,{"$f":"OFFSET(Start,'Mellomlagring - antall besøk'!A27,0)","v":0},0,0,0,0,0,0,0,0,0,0,0,0,0,0,0,0,0,0,0,0,0,0,0,0,0,0,0,0,0,0,0,0,0,0,0,0]
[27,{"$f":"OFFSET(Start,'Mellomlagring - antall besøk'!A28,0)","v":0},0,0,0,0,0,0,0,0,0,0,0,0,0,0,0,0,0,0,0,0,0,0,0,0,0,0,0,0,0,0,0,0,0,0,0,0]
[28,{"$f":"OFFSET(Start,'Mellomlagring - antall besøk'!A29,0)","v":0},0,0,0,0,0,0,0,0,0,0,0,0,0,0,0,0,0,0,0,0,0,0,0,0,0,0,0,0,0,0,0,0,0,0,0,0]
[29,{"$f":"OFFSET(Start,'Mellomlagring - antall besøk'!A30,0)","v":0},0,0,0,0,0,0,0,0,0,0,0,0,0,0,0,0,0,0,0,0,0,0,0,0,0,0,0,0,0,0,0,0,0,0,0,0]
[30,{"$f":"OFFSET(Start,'Mellomlagring - antall besøk'!A31,0)","v":0},0,0,0,0,0,0,0,0,0,0,0,0,0,0,0,0,0,0,0,0,0,0,0,0,0,0,0,0,0,0,0,0,0,0,0,0]
[31,{"$f":"OFFSET(Start,'Mellomlagring - antall besøk'!A32,0)","v":0},0,0,0,0,0,0,0,0,0,0,0,0,0,0,0,0,0,0,0,0,0,0,0,0,0,0,0,0,0,0,0,0,0,0,0,0]
[32,{"$f":"OFFSET(Start,'Mellomlagring - antall besøk'!A33,0)","v":0},0,0,0,0,0,0,0,0,0,0,0,0,0,0,0,0,0,0,0,0,0,0,0,0,0,0,0,0,0,0,0,0,0,0,0,0]
[33,{"$f":"OFFSET(Start,'Mellomlagring - antall besøk'!A34,0)","v":0},0,0,0,0,0,0,0,0,0,0,0,0,0,0,0,0,0,0,0,0,0,0,0,0,0,0,0,0,0,0,0,0,0,0,0,0]
[34,{"$f":"OFFSET(Start,'Mellomlagring - antall besøk'!A35,0)","v":0},0,0,0,0,0,0,0,0,0,0,0,0,0,0,0,0,0,0,0,0,0,0,0,0,0,0,0,0,0,0,0,0,0,0,0,0]
[35,{"$f":"OFFSET(Start,'Mellomlagring - antall besøk'!A36,0)","v":0},0,0,0,0,0,0,0,0,0,0,0,0,0,0,0,0,0,0,0,0,0,0,0,0,0,0,0,0,0,0,0,0,0,0,0,0]
[36,{"$f":"OFFSET(Start,'Mellomlagring - antall besøk'!A37,0)","v":0},0,0,0,0,0,0,0,0,0,0,0,0,0,0,0,0,0,0,0,0,0,0,0,0,0,0,0,0,0,0,0,0,0,0,0,0]
[37,{"$f":"OFFSET(Start,'Mellomlagring - antall besøk'!A38,0)","v":0},0,0,0,0,0,0,0,0,0,0,0,0,0,0,0,0,0,0,0,0,0,0,0,0,0,0,0,0,0,0,0,0,0,0,0,0]
[38,{"$f":"OFFSET(Start,'Mellomlagring - antall besøk'!A39,0)","v":0},0,0,0,0,0,0,0,0,0,0,0,0,0,0,0,0,0,0,0,0,0,0,0,0,0,0,0,0,0,0,0,0,0,0,0,0]
[39,{"$f":"OFFSET(Start,'Mellomlagring - antall besøk'!A40,0)","v":0},0,0,0,0,0,0,0,0,0,0,0,0,0,0,0,0,0,0,0,0,0,0,0,0,0,0,0,0,0,0,0,0,0,0,0,0]
[40,{"$f":"OFFSET(Start,'Mellomlagring - antall besøk'!A41,0)","v":0},0,{"$f":"OFFSET(Start,$A41,D$1)","v":0},0,0,0,0,0,0,0,0,0,0,0,0,0,0,0,0,0,0,0,0,0,0,0,0,0,0,0,0,0,0,0,0,0,0]
[41,{"$f":"OFFSET(Start,'Mellomlagring - antall besøk'!A42,0)","v":0},0,0,0,0,0,0,0,0,0,0,0,0,0,0,0,0,0,0,0,0,0,0,0,0,0,0,0,0,0,0,0,0,0,0,0,0]
[42,{"$f":"OFFSET(Start,'Mellomlagring - antall besøk'!A43,0)","v":0},0,0,0,0,0,0,0,0,0,0,0,0,0,0,0,0,0,0,0,0,0,0,0,0,0,0,0,0,0,0,0,0,0,0,0,0]
[43,{"$f":"OFFSET(Start,'Mellomlagring - antall besøk'!A44,0)","v":0},0,0,0,0,0,0,0,0,0,0,0,0,0,0,0,0,0,0,0,0,0,0,0,0,0,0,0,0,0,0,0,0,0,0,0,0]
[44,{"$f":"OFFSET(Start,'Mellomlagring - antall besøk'!A45,0)","v":0},0,0,0,0,0,0,0,0,0,0,0,0,0,0,0,0,0,0,0,0,0,0,0,0,0,0,0,0,0,0,0,0,0,0,0,0]
[45,{"$f":"OFFSET(Start,'Mellomlagring - antall besøk'!A46,0)","v":0},0,0,0,0,0,0,0,0,0,0,0,0,0,0,0,0,0,0,0,0,0,0,0,0,0,0,0,0,0,0,0,0,0,0,0,0]
[46,{"$f":"OFFSET(Start,'Mellomlagring - antall besøk'!A47,0)","v":0},0,0,0,0,0,0,0,0,0,0,0,0,0,0,0,{"$f":"OFFSET(Start,$A47,R$1)","v":0},0,0,0,0,0,0,0,0,0,0,0,0,0,0,0,{"$f":"OFFSET(Start,$A47,AH$1)","v":0},0,0,0,0]
[47,{"$f":"OFFSET(Start,'Mellomlagring - antall besøk'!A48,0)","v":0},0,0,0,0,0,0,0,0,{"$f":"OFFSET(Start,$A48,K$1)","v":0},0,0,0,0,0,0,0,0,0,0,0,0,0,0,0,0,0,0,0,0,0,0,0,0,0,0,0]
[48,{"$f":"OFFSET(Start,'Mellomlagring - antall besøk'!A49,0)","v":0},{"$f":"OFFSET(Start,$A49,C$1)","v":0},0,0,0,0,0,0,0,0,0,0,0,0,0,0,0,0,0,0,0,0,0,0,0,0,0,0,0,0,0,0,0,0,0,0,0]
[49,{"$f":"OFFSET(Start,'Mellomlagring - antall besøk'!A50,0)","v":0},0,0,0,0,0,0,0,0,0,0,0,0,0,0,0,0,0,0,0,0,0,0,0,0,0,0,0,0,0,0,0,0,0,0,0,0]
[50,{"$f":"OFFSET(Start,'Mellomlagring - antall besøk'!A51,0)","v":0},0,0,0,0,0,0,0,0,0,0,0,0,0,0,0,0,0,0,0,0,0,0,0,0,0,0,0,0,0,0,0,0,0,0,0,0]
[51,{"$f":"OFFSET(Start,'Mellomlagring - antall besøk'!A52,0)","v":0},0,0,0,0,0,0,0,0,0,0,0,0,0,0,0,0,0,0,0,0,0,0,0,0,0,0,0,0,0,0,0,0,0,0,0,0]
[52,{"$f":"OFFSET(Start,'Mellomlagring - antall besøk'!A53,0)","v":0},0,0,0,0,0,0,0,0,0,0,0,0,0,0,0,0,0,0,0,0,0,0,0,0,0,0,0,0,0,0,0,0,0,0,0,0]
[53,{"$f":"OFFSET(Start,'Mellomlagring - antall besøk'!A54,0)","v":0},0,0,0,0,0,0,0,0,0,0,0,0,0,0,0,0,0,0,0,0,0,0,0,0,0,0,0,0,0,0,0,0,0,0,0,0]
[54,{"$f":"OFFSET(Start,'Mellomlagring - antall besøk'!A55,0)","v":0},0,0,0,0,0,0,0,0,0,0,0,0,0,0,0,0,0,0,0,0,0,0,0,0,0,0,0,0,0,0,0,0,0,0,0,0]
[55,{"$f":"OFFSET(Start,'Mellomlagring - antall besøk'!A56,0)","v":0},0,0,0,0,0,0,0,0,0,0,0,0,0,0,0,0,0,0,0,0,0,0,0,0,0,0,0,0,0,0,0,0,0,0,0,0]
[56,{"$f":"OFFSET(Start,'Mellomlagring - antall besøk'!A57,0)","v":0},0,0,0,0,0,0,0,0,0,0,0,0,0,0,0,0,0,0,0,0,0,0,0,0,0,0,0,0,0,0,0,0,0,0,0,0]
[57,{"$f":"OFFSET(Start,'Mellomlagring - antall besøk'!A58,0)","v":0},0,0,0,0,0,0,0,0,0,0,0,0,0,0,0,0,0,0,0,0,0,0,0,0,0,0,0,0,0,0,0,0,0,0,0,0]
[58,{"$f":"OFFSET(Start,'Mellomlagring - antall besøk'!A59,0)","v":0},0,0,0,0,0,0,0,0,0,0,0,0,0,0,0,0,0,0,0,0,0,0,0,0,0,0,0,0,0,0,0,0,0,0,0,0]
[59,{"$f":"OFFSET(Start,'Mellomlagring - antall besøk'!A60,0)","v":0},0,0,0,0,0,0,0,0,0,0,0,0,0,0,0,0,0,0,0,0,0,0,0,0,0,0,0,0,0,0,0,0,0,0,0,0]
[60,{"$f":"OFFSET(Start,'Mellomlagring - antall besøk'!A61,0)","v":0},0,0,0,0,0,0,0,0,0,0,0,0,0,0,0,0,0,0,0,0,0,0,0,0,0,0,0,0,0,0,0,0,0,0,0,0]
[61,{"$f":"OFFSET(Start,'Mellomlagring - antall besøk'!A62,0)","v":0},0,0,0,0,0,0,0,0,0,0,0,0,0,0,0,0,0,0,0,0,0,0,0,0,0,0,0,0,0,0,0,0,0,0,0,0]
[62,{"$f":"OFFSET(Start,'Mellomlagring - antall besøk'!A63,0)","v":0},0,0,0,0,0,0,0,0,0,0,0,0,0,0,0,0,0,0,0,0,0,0,0,0,0,0,0,0,0,0,0,0,0,0,0,0]
[63,{"$f":"OFFSET(Start,'Mellomlagring - antall besøk'!A64,0)","v":0},0,0,0,0,0,0,0,0,0,0,0,0,0,0,0,{"$f":"OFFSET(Start,$A64,R$1)","v":0},0,0,0,0,0,0,0,0,0,0,0,0,0,0,0,0,0,0,0,0]
[64,{"$f":"OFFSET(Start,'Mellomlagring - antall besøk'!A65,0)","v":0},{"$f":"OFFSET(Start,$A65,C$1)","v":0},0,0,0,0,0,0,0,0,0,0,0,0,0,0,0,0,0,0,0,0,0,0,0,0,0,0,0,0,0,0,0,0,0,0,0]
[65,{"$f":"OFFSET(Start,'Mellomlagring - antall besøk'!A66,0)","v":0},0,0,0,0,0,0,0,0,0,0,0,0,0,0,0,0,0,0,0,0,0,0,0,0,0,0,0,0,0,0,0,0,0,0,0,0]
[66,{"$f":"OFFSET(Start,'Mellomlagring - antall besøk'!A67,0)","v":0},0,0,0,0,0,0,0,0,0,0,0,0,0,0,0,0,0,0,0,0,0,0,0,0,0,0,0,0,0,0,0,0,0,0,0,0]
[67,{"$f":"OFFSET(Start,'Mellomlagring - antall besøk'!A68,0)","v":0},0,0,0,0,0,0,0,0,0,0,0,0,0,0,0,0,0,0,0,0,0,0,0,0,0,0,0,0,0,0,0,0,0,0,0,0]
[{"$f":"+A68+1","v":68},{"$f":"OFFSET(Start,'Mellomlagring - antall besøk'!A69,0)","v":0},0,0,0,0,0,0,0,0,0,0,0,0,0,0,0,0,0,0,0,0,0,0,0,0,0,0,0,0,0,0,0,0,0,0,0,0]
[69,{"$f":"OFFSET(Start,'Mellomlagring - antall besøk'!A70,0)","v":0},0,0,0,0,0,0,0,0,0,0,0,0,0,0,0,0,0,0,0,0,0,0,0,0,0,0,0,0,0,0,0,0,0,0,0,0]
[70,{"$f":"OFFSET(Start,'Mellomlagring - antall besøk'!A71,0)","v":0},0,0,0,0,0,0,0,0,0,0,0,0,0,0,0,0,0,0,0,0,0,0,0,0,0,0,0,0,0,0,0,0,0,0,0,0]
[71,{"$f":"OFFSET(Start,'Mellomlagring - antall besøk'!A72,0)","v":0},0,0,0,0,0,0,0,0,0,0,0,0,0,0,0,0,0,0,0,0,0,0,0,0,0,0,0,0,0,0,0,0,0,0,0,0]
[72,{"$f":"OFFSET(Start,'Mellomlagring - antall besøk'!A73,0)","v":0},0,0,0,0,0,0,0,0,0,0,0,0,0,0,0,0,0,0,0,0,0,0,0,0,0,0,0,0,0,0,0,{"$f":"OFFSET(Start,$A73,AH$1)","v":0},0,0,0,0]
[73,{"$f":"OFFSET(Start,'Mellomlagring - antall besøk'!A74,0)","v":0},0,0,0,0,0,0,0,0,0,0,0,0,0,0,0,0,0,0,0,0,0,0,0,0,0,0,0,0,0,0,0,0,0,0,0,0]
[74,{"$f":"OFFSET(Start,'Mellomlagring - antall besøk'!A75,0)","v":0},0,0,0,0,0,0,0,0,0,0,0,0,0,0,0,0,0,0,0,0,0,0,0,0,0,0,0,0,0,0,0,0,0,0,0,0]
[75,{"$f":"OFFSET(Start,'Mellomlagring - antall besøk'!A76,0)","v":0},0,0,0,0,0,0,0,0,0,0,0,0,0,0,0,0,0,0,0,0,0,0,0,0,0,0,0,0,0,0,0,0,0,0,0,0]
[76,{"$f":"OFFSET(Start,'Mellomlagring - antall besøk'!A77,0)","v":0},0,0,0,0,0,0,0,0,0,0,0,0,0,0,0,0,0,0,0,0,0,0,0,0,0,0,0,0,0,0,0,0,0,0,0,0]
[77,{"$f":"OFFSET(Start,'Mellomlagring - antall besøk'!A78,0)","v":0},0,0,0,0,0,0,0,0,0,0,0,0,0,0,0,0,0,0,0,0,0,0,0,0,0,0,0,0,0,0,0,0,0,0,0,0]
[78,{"$f":"OFFSET(Start,'Mellomlagring - antall besøk'!A79,0)","v":0},0,0,0,0,0,0,0,0,0,0,0,0,0,0,0,0,0,0,0,0,0,0,0,0,0,0,0,0,0,0,0,0,0,0,0,0]
[79,{"$f":"OFFSET(Start,'Mellomlagring - antall besøk'!A80,0)","v":0},0,0,0,0,0,0,0,0,0,0,0,0,0,0,0,{"$f":"OFFSET(Start,$A80,R$1)","v":0},0,0,0,0,0,0,0,0,0,0,0,0,0,0,0,0,0,0,0,0]
[80,{"$f":"OFFSET(Start,'Mellomlagring - antall besøk'!A81,0)","v":0},{"$f":"OFFSET(Start,$A81,C$1)","v":0},0,0,0,0,0,0,0,0,0,0,0,0,0,0,0,0,0,0,0,0,0,0,0,0,0,0,0,0,0,0,0,0,0,0,0]
[81,{"$f":"OFFSET(Start,'Mellomlagring - antall besøk'!A82,0)","v":0},0,0,0,0,0,0,0,0,0,0,0,0,0,0,0,0,0,0,0,0,0,0,0,0,0,0,0,0,0,0,0,0,0,0,0,0]
[82,{"$f":"OFFSET(Start,'Mellomlagring - antall besøk'!A83,0)","v":0},0,0,0,0,0,0,0,0,0,0,0,0,0,0,0,0,0,0,0,0,0,0,0,0,0,0,0,0,0,0,0,0,0,0,0,0]
[83,{"$f":"OFFSET(Start,'Mellomlagring - antall besøk'!A84,0)","v":0},0,0,0,0,0,0,0,0,0,0,0,0,0,0,0,0,0,0,0,0,0,0,0,0,0,0,0,0,0,0,0,0,0,0,0,0]
[84,{"$f":"OFFSET(Start,'Mellomlagring - antall besøk'!A85,0)","v":0},0,0,0,0,0,0,0,0,0,0,0,0,0,0,0,0,0,0,0,0,0,0,0,0,0,0,0,0,0,0,0,0,0,0,0,0]
[85,{"$f":"OFFSET(Start,'Mellomlagring - antall besøk'!A86,0)","v":0},0,0,0,0,0,0,0,0,0,0,0,0,0,0,0,0,0,0,0,0,0,0,0,0,0,0,0,0,0,0,0,0,0,0,0,0]
[86,{"$f":"OFFSET(Start,'Mellomlagring - antall besøk'!A87,0)","v":0},0,0,0,0,0,0,0,0,0,0,0,0,0,0,0,0,0,0,0,0,0,0,0,0,0,0,0,0,0,0,0,0,0,0,0,0]
[87,{"$f":"OFFSET(Start,'Mellomlagring - antall besøk'!A88,0)","v":0},0,0,0,0,0,0,0,0,0,0,0,0,0,0,0,0,0,0,0,0,0,0,0,0,0,0,0,0,0,0,0,0,0,0,0,0]
[88,{"$f":"OFFSET(Start,'Mellomlagring - antall besøk'!A89,0)","v":0},0,0,0,0,0,0,0,0,0,0,0,0,0,0,0,0,0,0,0,0,0,0,0,0,0,0,0,0,0,0,0,0,0,0,0,0]
[89,{"$f":"OFFSET(Start,'Mellomlagring - antall besøk'!A90,0)","v":0},0,0,0,0,0,0,0,0,0,0,0,0,0,0,0,0,0,0,0,0,0,0,0,0,0,0,0,0,0,0,0,0,0,0,0,0]
[90,{"$f":"OFFSET(Start,'Mellomlagring - antall besøk'!A91,0)","v":0},0,0,0,0,0,0,0,0,0,0,0,0,0,0,0,0,0,0,0,0,0,0,0,0,0,0,0,0,0,0,0,0,0,0,0,0]
[91,{"$f":"OFFSET(Start,'Mellomlagring - antall besøk'!A92,0)","v":0},0,0,0,0,0,0,0,0,0,0,0,0,0,0,0,0,0,0,0,0,0,0,0,0,0,0,0,0,0,0,0,0,0,0,0,0]
[92,{"$f":"OFFSET(Start,'Mellomlagring - antall besøk'!A93,0)","v":0},0,0,0,0,0,0,0,0,0,0,0,0,0,0,0,0,0,0,0,0,0,0,0,0,0,0,0,0,0,0,0,0,0,0,0,0]
[93,{"$f":"OFFSET(Start,'Mellomlagring - antall besøk'!A94,0)","v":0},0,0,0,0,0,0,0,0,0,0,0,0,0,0,0,0,0,0,0,0,0,0,0,0,0,0,0,0,0,0,0,0,0,0,0,0]
[94,{"$f":"OFFSET(Start,'Mellomlagring - antall besøk'!A95,0)","v":0},0,0,0,0,0,0,0,0,0,0,0,0,0,0,0,0,0,0,0,0,0,0,0,0,0,0,0,0,0,0,0,0,0,0,0,0]
[95,{"$f":"OFFSET(Start,'Mellomlagring - antall besøk'!A96,0)","v":0},0,0,0,0,0,0,0,0,0,0,0,0,0,0,0,{"$f":"OFFSET(Start,$A96,R$1)","v":0},0,0,0,0,0,0,0,0,0,0,0,0,0,0,0,0,0,0,0,0]
[96,{"$f":"OFFSET(Start,'Mellomlagring - antall besøk'!A97,0)","v":0},{"$f":"OFFSET(Start,$A97,C$1)","v":0},0,0,0,0,0,0,0,0,0,0,0,0,0,0,0,0,0,0,0,0,0,0,0,0,0,0,0,0,0,0,0,0,0,0,0]
[97,{"$f":"OFFSET(Start,'Mellomlagring - antall besøk'!A98,0)","v":0},0,0,0,0,0,0,0,0,0,0,0,0,0,0,0,0,0,0,0,0,0,0,0,0,0,0,0,0,0,0,0,0,0,0,0,0]
[98,{"$f":"OFFSET(Start,'Mellomlagring - antall besøk'!A99,0)","v":0},0,0,0,0,0,0,0,0,0,0,0,0,0,0,0,0,0,0,0,0,0,0,0,0,0,0,0,0,0,0,0,{"$f":"OFFSET(Start,$A99,AH$1)","v":0},0,0,0,0]
[99,{"$f":"OFFSET(Start,'Mellomlagring - antall besøk'!A100,0)","v":0},0,0,0,0,0,0,0,0,0,0,0,0,0,0,0,0,0,0,0,0,0,0,0,0,0,0,0,0,0,0,0,0,0,0,0,0]
[100,{"$f":"OFFSET(Start,'Mellomlagring - antall besøk'!A101,0)","v":0},0,0,0,0,0,0,0,0,0,0,0,0,0,0,0,0,0,0,0,0,0,0,0,0,0,0,0,0,0,0,0,0,0,0,0,0]
[101,{"$f":"OFFSET(Start,'Mellomlagring - antall besøk'!A102,0)","v":0},0,0,0,0,0,0,0,0,0,0,0,0,0,0,0,0,0,0,0,0,0,0,0,0,0,0,0,0,0,0,0,0,0,0,0,0]

{"sheet":"Mellomlagring - utsatt døgn","index":7,"n_rows":102,"n_cols":38,"rows_kept":102,"cut":false,"hidden":true,"merged":[]}
[null,null,40,{"$f":"C1+3","v":43},{"$f":"D1+3","v":46},49,52,55,58,61,64,67,70,73,76,79,82,85,88,91,94,97,100,103,106,109,112,115,118,121,124,127,130,133,136,139,142,145]
["Nummer","Bruker ID",{"$f":"OFFSET('Månedlig registrering'!$AN$6,0,COLUMN(C:C)*3-9)","v":"2018-01-01"},{"$f":"OFFSET('Månedlig registrering'!$AN$6,0,COLUMN(D:D)*3-9)","v":"2018-02-01"},{"$f":"OFFSET('Månedlig registrering'!$AN$6,0,COLUMN(E:E)*3-9)","v":"2018-03-01"},{"$f":"OFFSET('Månedlig registrering'!$AN$6,0,COLUMN(F:F)*3-9)","v":"2018-04-01"},{"$f":"OFFSET('Månedlig registrering'!$AN$6,0,COLUMN(G:G)*3-9)","v":"2018-05-01"},{"$f":"OFFSET('Månedlig registrering'!$AN$6,0,COLUMN(H:H)*3-9)","v":"2018-06-01"},{"$f":"OFFSET('Månedlig registrering'!$AN$6,0,COLUMN(I:I)*3-9)","v":"2018-07-01"},{"$f":"OFFSET('Månedlig registrering'!$AN$6,0,COLUMN(J:J)*3-9)","v":"2018-08-01"},{"$f":"OFFSET('Månedlig registrering'!$AN$6,0,COLUMN(K:K)*3-9)","v":"2018-09-01"},{"$f":"OFFSET('Månedlig registrering'!$AN$6,0,COLUMN(L:L)*3-9)","v":"2018-10-01"},{"$f":"OFFSET('Månedlig registrering'!$AN$6,0,COLUMN(M:M)*3-9)","v":"2018-11-01"},{"$f":"OFFSET('Månedlig registrering'!$AN$6,0,COLUMN(N:N)*3-9)","v":"2018-12-01"},{"$f":"OFFSET('Månedlig registrering'!$AN$6,0,COLUMN(O:O)*3-9)","v":"2019-01-01"},{"$f":"OFFSET('Månedlig registrering'!$AN$6,0,COLUMN(P:P)*3-9)","v":"2019-02-01"},{"$f":"OFFSET('Månedlig registrering'!$AN$6,0,COLUMN(Q:Q)*3-9)","v":"2019-03-01"},{"$f":"OFFSET('Månedlig registrering'!$AN$6,0,COLUMN(R:R)*3-9)","v":"2019-04-01"},{"$f":"OFFSET('Månedlig registrering'!$AN$6,0,COLUMN(S:S)*3-9)","v":"2019-05-01"},{"$f":"OFFSET('Månedlig registrering'!$AN$6,0,COLUMN(T:T)*3-9)","v":"2019-06-01"},{"$f":"OFFSET('Månedlig registrering'!$AN$6,0,COLUMN(U:U)*3-9)","v":"2019-07-01"},{"$f":"OFFSET('Månedlig registrering'!$AN$6,0,COLUMN(V:V)*3-9)","v":"2019-08-01"},{"$f":"OFFSET('Månedlig registrering'!$AN$6,0,COLUMN(W:W)*3-9)","v":"2019-09-01"},{"$f":"OFFSET('Månedlig registrering'!$AN$6,0,COLUMN(X:X)*3-9)","v":"2019-10-01"},{"$f":"OFFSET('Månedlig registrering'!$AN$6,0,COLUMN(Y:Y)*3-9)","v":"2019-11-01"},{"$f":"OFFSET('Månedlig registrering'!$AN$6,0,COLUMN(Z:Z)*3-9)","v":"2019-12-01"},{"$f":"OFFSET('Månedlig registrering'!$AN$6,0,COLUMN(AA:AA)*3-9)","v":"2020-01-01"},{"$f":"OFFSET('Månedlig registrering'!$AN$6,0,COLUMN(AB:AB)*3-9)","v":"2020-02-01"},{"$f":"OFFSET('Månedlig registrering'!$AN$6,0,COLUMN(AC:AC)*3-9)","v":"2020-03-01"},{"$f":"OFFSET('Månedlig registrering'!$AN$6,0,COLUMN(AD:AD)*3-9)","v":"2020-04-01"},{"$f":"OFFSET('Månedlig registrering'!$AN$6,0,COLUMN(AE:AE)*3-9)","v":"2020-05-01"},{"$f":"OFFSET('Månedlig registrering'!$AN$6,0,COLUMN(AF:AF)*3-9)","v":"2020-06-01"},{"$f":"OFFSET('Månedlig registrering'!$AN$6,0,COLUMN(AG:AG)*3-9)","v":"2020-07-01"},{"$f":"OFFSET('Månedlig registrering'!$AN$6,0,COLUMN(AH:AH)*3-9)","v":"2020-08-01"},{"$f":"OFFSET('Månedlig registrering'!$AN$6,0,COLUMN(AI:AI)*3-9)","v":"2020-09-01"},{"$f":"OFFSET('Månedlig registrering'!$AN$6,0,COLUMN(AJ:AJ)*3-9)","v":"2020-10-01"},{"$f":"OFFSET('Månedlig registrering'!$AN$6,0,COLUMN(AK:AK)*3-9)","v":"2020-11-01"},{"$f":"OFFSET('Månedlig registrering'!$AN$6,0,COLUMN(AL:AL)*3-9)","v":"2020-12-01"}]
[2,{"$f":"OFFSET(Start,'Mellomlagring - antall besøk'!A3,0)","v":1001},{"$f":"OFFSET(Start,$A3,C$1)","v":0},0,0,0,0,0,0,0,0,0,0,0,0,0,0,0,0,0,{"$f":"OFFSET(Start,$A3,U$1)","v":0},0,0,0,0,0,0,0,0,0,0,0,0,0,0,0,0,{"$f":"OFFSET(Start,$A3,AL$1)","v":0}]
[{"$f":"+A3+1","v":3},{"$f":"OFFSET(Start,'Mellomlagring - antall besøk'!A4,0)","v":1002},0,0,0,0,0,0,0,0,0,0,0,0,0,0,0,0,0,0,0,0,0,0,0,0,0,0,0,0,0,0,0,0,0,0,0,0]
[{"$f":"+A4+1","v":4},{"$f":"OFFSET(Start,'Mellomlagring - antall besøk'!A5,0)","v":1003},15,28,31,30,31,0,0,0,0,0,0,0,0,0,0,0,0,0,0,0,0,0,0,0,0,0,0,0,0,0,0,0,0,0,0,0]
[5,{"$f":"OFFSET(Start,'Mellomlagring - antall besøk'!A6,0)","v":0},0,0,0,0,0,0,0,0,0,0,0,0,0,0,0,0,0,0,0,0,0,0,0,0,0,0,0,0,0,0,0,0,0,0,0,0]
[6,{"$f":"OFFSET(Start,'Mellomlagring - antall besøk'!A7,0)","v":0},0,0,0,0,0,0,0,0,0,0,0,0,0,0,0,0,0,0,0,0,0,0,0,0,0,0,0,0,0,0,0,0,0,0,0,0]
[7,{"$f":"OFFSET(Start,'Mellomlagring - antall besøk'!A8,0)","v":0},0,0,0,0,0,0,0,0,0,0,0,0,0,0,0,0,0,0,0,0,0,0,0,0,0,0,0,0,0,0,0,0,0,0,0,0]
[8,{"$f":"OFFSET(Start,'Mellomlagring - antall besøk'!A9,0)","v":0},0,0,0,0,0,0,0,0,0,0,0,0,0,0,0,0,0,0,0,0,0,0,0,0,0,0,0,0,0,0,0,0,0,0,0,0]
[9,{"$f":"OFFSET(Start,'Mellomlagring - antall besøk'!A10,0)","v":0},0,0,0,0,0,0,0,0,0,0,0,0,0,0,0,0,0,0,0,0,0,0,0,0,0,0,0,0,0,0,0,0,0,0,0,0]
[10,{"$f":"OFFSET(Start,'Mellomlagring - antall besøk'!A11,0)","v":0},0,0,0,0,0,0,0,0,0,0,0,0,0,0,0,0,0,0,0,0,0,0,0,0,0,0,0,0,0,0,0,0,0,0,0,0]
[11,{"$f":"OFFSET(Start,'Mellomlagring - antall besøk'!A12,0)","v":0},0,0,0,0,0,0,0,0,0,0,0,0,0,0,0,0,0,0,0,0,0,0,0,0,0,0,0,0,0,0,0,0,0,0,0,0]
[12,{"$f":"OFFSET(Start,'Mellomlagring - antall besøk'!A13,0)","v":0},0,0,0,0,0,0,0,0,0,0,0,0,0,0,0,0,0,0,0,0,0,0,0,0,0,0,0,0,0,0,0,0,0,0,0,0]
[13,{"$f":"OFFSET(Start,'Mellomlagring - antall besøk'!A14,0)","v":0},0,0,0,0,0,0,0,0,0,0,0,0,0,0,0,0,0,0,0,0,{"$f":"OFFSET(Start,$A14,W$1)","v":0},0,0,0,0,0,0,0,0,0,0,0,0,0,0,0]
[14,{"$f":"OFFSET(Start,'Mellomlagring - antall besøk'!A15,0)","v":0},0,0,0,0,0,0,0,0,0,0,0,0,0,0,0,0,0,0,{"$f":"OFFSET(Start,$A15,U$1)","v":0},0,0,0,0,0,0,0,0,0,0,0,0,0,{"$f":"OFFSET(Start,$A15,AI$1)","v":0},0,0,0]
[15,{"$f":"OFFSET(Start,'Mellomlagring - antall besøk'!A16,0)","v":0},0,0,0,0,0,0,0,0,0,0,0,0,0,0,0,0,0,0,0,0,0,0,0,0,0,0,0,0,0,0,0,0,0,0,0,0]
[16,{"$f":"OFFSET(Start,'Mellomlagring - antall besøk'!A17,0)","v":0},0,0,0,{"$f":"OFFSET(Start,$A17,F$1)","v":0},0,0,0,0,0,0,0,0,0,0,0,0,0,0,0,0,0,0,0,0,0,0,0,0,0,0,0,0,0,0,0,0]
[17,{"$f":"OFFSET(Start,'Mellomlagring - antall besøk'!A18,0)","v":0},{"$f":"OFFSET(Start,$A18,C$1)","v":0},0,0,0,0,0,0,0,0,0,0,0,0,0,0,0,0,0,0,0,0,0,0,0,0,0,0,0,0,0,0,0,0,0,0,0]
[18,{"$f":"OFFSET(Start,'Mellomlagring - antall besøk'!A19,0)","v":0},0,0,0,0,0,0,0,0,0,0,0,0,0,0,0,0,0,0,0,0,0,0,0,0,0,0,0,0,0,0,0,0,0,0,0,0]
[19,{"$f":"OFFSET(Start,'Mellomlagring - antall besøk'!A20,0)","v":0},0,0,0,0,0,0,0,0,0,0,0,0,0,0,0,0,0,0,0,0,0,0,0,0,0,0,0,0,0,0,0,0,0,0,0,0]
[20,{"$f":"OFFSET(Start,'Mellomlagring - antall besøk'!A21,0)","v":0},0,0,0,0,0,0,0,0,0,0,0,0,0,0,0,0,0,0,0,0,0,0,0,0,0,0,0,0,0,0,0,0,0,0,0,0]
[21,{"$f":"OFFSET(Start,'Mellomlagring - antall besøk'!A22,0)","v":0},0,0,0,0,0,0,0,0,0,0,0,0,0,0,0,0,0,0,0,0,0,0,0,0,0,0,0,0,0,0,0,0,0,0,0,0]
[22,{"$f":"OFFSET(Start,'Mellomlagring - antall besøk'!A23,0)","v":0},0,0,0,0,0,0,0,0,0,0,0,0,0,0,0,0,0,0,0,0,0,0,0,0,0,0,0,0,0,0,0,0,0,0,0,0]
[23,{"$f":"OFFSET(Start,'Mellomlagring - antall besøk'!A24,0)","v":0},0,0,0,0,0,0,0,0,0,0,0,0,0,0,0,0,0,0,0,0,0,0,0,0,0,0,0,0,0,0,0,0,0,0,0,0]
[24,{"$f":"OFFSET(Start,'Mellomlagring - antall besøk'!A25,0)","v":0},0,0,0,0,0,0,0,0,0,0,0,0,0,0,0,0,0,0,0,0,0,0,0,0,0,0,0,0,0,0,0,0,0,0,0,0]
[25,{"$f":"OFFSET(Start,'Mellomlagring - antall besøk'!A26,0)","v":0},0,0,0,0,0,0,0,0,0,0,0,0,0,0,0,0,0,0,0,0,0,0,0,0,0,0,0,0,0,0,0,0,0,0,0,0]
[26,{"$f":"OFFSET(Start,'Mellomlagring - antall besøk'!A27,0)","v":0},0,0,0,0,0,0,0,0,0,0,0,0,0,0,0,0,0,0,0,0,0,0,0,0,0,0,0,0,0,0,0,0,0,0,0,0]
[27,{"$f":"OFFSET(Start,'Mellomlagring - antall besøk'!A28,0)","v":0},0,0,0,0,0,0,0,0,0,0,0,0,0,0,0,0,0,0,0,0,0,0,0,0,0,0,0,0,0,0,0,0,0,0,0,0]
[28,{"$f":"OFFSET(Start,'Mellomlagring - antall besøk'!A29,0)","v":0},0,0,0,0,0,0,0,0,0,0,0,0,0,0,0,0,0,0,0,0,0,0,0,0,0,0,0,0,0,0,0,0,0,0,0,0]
[29,{"$f":"OFFSET(Start,'Mellomlagring - antall besøk'!A30,0)","v":0},0,0,0,0,0,0,0,0,0,0,0,0,0,0,0,0,0,0,0,0,0,0,0,0,0,0,0,0,0,0,0,0,0,0,0,0]
[30,{"$f":"OFFSET(Start,'Mellomlagring - antall besøk'!A31,0)","v":0},0,0,0,0,0,0,0,0,0,0,0,0,0,0,0,0,0,0,0,0,0,0,0,0,0,0,0,0,0,0,0,0,0,0,0,0]
[31,{"$f":"OFFSET(Start,'Mellomlagring - antall besøk'!A32,0)","v":0},0,0,0,0,0,0,0,0,0,0,0,0,0,0,0,0,0,0,0,0,0,0,0,0,0,0,0,0,0,0,0,0,0,0,0,0]
[32,{"$f":"OFFSET(Start,'Mellomlagring - antall besøk'!A33,0)","v":0},0,0,0,0,0,0,0,0,0,0,0,0,0,0,0,{"$f":"OFFSET(Start,$A33,R$1)","v":0},0,0,0,0,0,0,0,0,0,0,0,0,0,0,0,0,0,0,0,0]
[33,{"$f":"OFFSET(Start,'Mellomlagring - antall besøk'!A34,0)","v":0},{"$f":"OFFSET(Start,$A34,C$1)","v":0},0,0,0,0,0,0,0,0,0,0,0,0,0,0,0,0,0,0,0,0,0,0,0,0,0,0,0,0,0,0,0,0,0,0,0]
[34,{"$f":"OFFSET(Start,'Mellomlagring - antall besøk'!A35,0)","v":0},0,0,0,0,0,0,0,0,0,0,0,0,0,0,0,0,0,0,0,0,0,0,0,0,0,0,0,0,0,0,0,0,0,0,0,0]
[35,{"$f":"OFFSET(Start,'Mellomlagring - antall besøk'!A36,0)","v":0},0,0,0,0,0,0,0,0,0,0,0,0,0,0,0,0,0,0,0,0,0,0,0,0,0,{"$f":"OFFSET(Start,$A36,AB$1)","v":0},0,0,0,0,0,0,0,0,0,0]
[36,{"$f":"OFFSET(Start,'Mellomlagring - antall besøk'!A37,0)","v":0},0,0,0,0,0,0,0,0,0,0,0,0,0,0,0,0,0,0,0,0,0,0,0,0,0,0,0,0,0,0,0,0,0,0,0,0]
[37,{"$f":"OFFSET(Start,'Mellomlagring - antall besøk'!A38,0)","v":0},0,0,0,0,0,0,0,0,0,0,0,0,0,0,0,0,0,0,0,0,0,0,0,0,0,0,0,0,0,0,0,0,0,0,0,0]
[38,{"$f":"OFFSET(Start,'Mellomlagring - antall besøk'!A39,0)","v":0},0,0,0,0,0,0,0,0,0,0,0,0,0,0,0,0,0,0,0,0,0,0,0,0,0,0,0,0,0,0,0,0,0,0,0,0]
[39,{"$f":"OFFSET(Start,'Mellomlagring - antall besøk'!A40,0)","v":0},0,0,0,0,0,0,0,0,0,0,0,0,0,0,0,0,0,0,0,0,0,0,0,0,0,0,0,0,0,0,0,0,0,0,0,0]
[40,{"$f":"OFFSET(Start,'Mellomlagring - antall besøk'!A41,0)","v":0},0,0,0,0,0,0,0,0,0,0,0,0,0,0,0,0,0,0,0,0,0,0,0,0,0,0,0,0,0,0,0,0,0,0,0,0]
[41,{"$f":"OFFSET(Start,'Mellomlagring - antall besøk'!A42,0)","v":0},0,0,0,0,0,0,0,0,0,0,0,0,0,0,0,0,0,0,0,0,{"$f":"OFFSET(Start,$A42,W$1)","v":0},0,0,0,0,0,0,0,0,0,0,0,0,0,0,0]
[42,{"$f":"OFFSET(Start,'Mellomlagring - antall besøk'!A43,0)","v":0},0,0,0,0,0,0,0,0,0,0,0,0,0,0,0,0,0,0,0,{"$f":"OFFSET(Start,$A43,V$1)","v":0},0,0,0,0,0,0,0,0,0,0,0,0,0,0,0,0]
[43,{"$f":"OFFSET(Start,'Mellomlagring - antall besøk'!A44,0)","v":0},0,0,0,0,0,0,0,0,0,0,0,0,0,0,0,0,0,0,0,0,0,0,0,0,0,0,0,0,0,0,0,0,0,0,0,0]
[44,{"$f":"OFFSET(Start,'Mellomlagring - antall besøk'!A45,0)","v":0},0,0,0,0,0,0,0,0,0,0,0,0,0,0,0,0,0,0,0,0,0,0,0,0,0,0,0,0,0,0,0,0,0,0,0,0]
[45,{"$f":"OFFSET(Start,'Mellomlagring - antall besøk'!A46,0)","v":0},0,0,0,0,0,0,0,0,0,0,0,0,0,0,0,0,0,0,0,0,0,0,0,0,0,0,0,0,0,0,0,0,0,0,0,0]
[46,{"$f":"OFFSET(Start,'Mellomlagring - antall besøk'!A47,0)","v":0},0,0,0,0,0,0,0,0,0,0,0,0,0,0,0,0,0,0,0,0,0,0,0,0,0,0,0,0,0,0,0,0,0,0,0,0]
[47,{"$f":"OFFSET(Start,'Mellomlagring - antall besøk'!A48,0)","v":0},0,0,0,0,0,0,0,0,0,0,0,0,0,0,0,0,0,0,0,0,0,0,0,0,0,0,0,0,0,0,0,0,0,0,0,0]
[48,{"$f":"OFFSET(Start,'Mellomlagring - antall besøk'!A49,0)","v":0},0,0,0,0,0,0,0,0,0,0,0,0,0,0,0,{"$f":"OFFSET(Start,$A49,R$1)","v":0},0,0,0,0,0,0,0,0,0,0,0,0,0,0,0,0,0,0,0,0]
[49,{"$f":"OFFSET(Start,'Mellomlagring - antall besøk'!A50,0)","v":0},{"$f":"OFFSET(Start,$A50,C$1)","v":0},0,0,0,0,0,0,0,0,0,0,0,0,0,0,0,0,0,0,0,0,0,0,0,0,0,0,0,0,0,0,0,0,0,0,0]
[50,{"$f":"OFFSET(Start,'Mellomlagring - antall besøk'!A51,0)","v":0},0,0,0,0,0,0,0,0,0,0,0,0,0,0,0,0,0,0,0,0,0,0,0,0,0,0,0,0,0,0,0,0,0,0,0,0]
[51,{"$f":"OFFSET(Start,'Mellomlagring - antall besøk'!A52,0)","v":0},0,0,0,0,0,0,0,0,0,0,0,0,0,0,0,0,0,0,0,0,0,0,0,0,0,0,0,0,0,0,0,0,0,0,0,0]
[52,{"$f":"OFFSET(Start,'Mellomlagring - antall besøk'!A53,0)","v":0},0,0,0,0,0,0,0,0,0,0,0,0,0,0,0,0,0,0,0,0,0,0,0,0,0,0,0,0,0,0,0,0,0,0,0,0]
[53,{"$f":"OFFSET(Start,'Mellomlagring - antall besøk'!A54,0)","v":0},0,0,0,0,0,0,0,0,0,0,0,0,0,0,0,0,0,0,0,0,0,0,0,0,0,0,0,0,0,0,0,0,{"$f":"OFFSET(Start,$A54,AI$1)","v":0},0,0,0]
[54,{"$f":"OFFSET(Start,'Mellomlagring - antall besøk'!A55,0)","v":0},0,0,0,0,0,0,0,0,0,0,0,0,0,0,0,0,0,0,0,{"$f":"OFFSET(Start,$A55,V$1)","v":0},0,0,0,0,0,0,0,0,0,0,0,0,0,0,0,0]
[55,{"$f":"OFFSET(Start,'Mellomlagring - antall besøk'!A56,0)","v":0},0,0,0,0,0,0,0,0,0,0,0,0,0,0,0,0,0,0,0,0,0,0,0,0,0,0,0,0,0,0,0,0,0,0,0,0]
[56,{"$f":"OFFSET(Start,'Mellomlagring - antall besøk'!A57,0)","v":0},0,0,0,0,0,0,0,0,0,0,0,0,0,0,0,0,0,0,0,0,0,0,0,0,0,0,0,0,0,0,0,0,0,0,0,0]
[57,{"$f":"OFFSET(Start,'Mellomlagring - antall besøk'!A58,0)","v":0},0,0,0,0,0,0,0,0,0,0,0,0,0,0,0,0,0,0,0,0,0,0,0,0,0,0,0,0,0,0,0,0,0,0,0,0]
[58,{"$f":"OFFSET(Start,'Mellomlagring - antall besøk'!A59,0)","v":0},0,0,0,0,0,0,0,0,0,0,0,0,0,0,0,0,0,0,0,0,0,0,0,0,0,0,0,0,0,0,0,0,0,0,0,0]
[59,{"$f":"OFFSET(Start,'Mellomlagring - antall besøk'!A60,0)","v":0},0,0,0,0,0,0,0,0,0,0,0,0,0,0,0,0,0,0,0,0,0,0,0,0,0,0,0,0,0,0,0,0,0,0,0,0]
[60,{"$f":"OFFSET(Start,'Mellomlagring - antall besøk'!A61,0)","v":0},0,0,0,0,0,0,0,0,0,0,0,0,0,0,0,0,0,0,0,0,0,0,0,0,0,0,0,0,0,0,0,0,0,0,0,0]
[61,{"$f":"OFFSET(Start,'Mellomlagring - antall besøk'!A62,0)","v":0},0,0,0,0,0,0,0,0,0,0,0,0,0,0,0,0,0,0,0,0,0,0,0,0,0,0,0,0,0,0,0,0,0,0,0,0]
[62,{"$f":"OFFSET(Start,'Mellomlagring - antall besøk'!A63,0)","v":0},0,0,0,0,0,0,0,0,0,0,0,0,0,0,0,0,0,0,0,0,0,0,0,0,0,0,0,0,0,0,0,0,0,0,0,0]
[63,{"$f":"OFFSET(Start,'Mellomlagring - antall besøk'!A64,0)","v":0},0,0,0,0,0,0,0,0,0,0,0,0,0,0,0,0,0,0,0,0,0,0,0,0,0,0,0,0,0,0,0,0,0,0,0,0]
[64,{"$f":"OFFSET(Start,'Mellomlagring - antall besøk'!A65,0)","v":0},0,0,0,0,0,0,0,0,0,0,0,0,0,0,0,{"$f":"OFFSET(Start,$A65,R$1)","v":0},0,0,0,0,0,0,0,0,0,0,0,0,0,0,0,0,0,0,0,0]
[65,{"$f":"OFFSET(Start,'Mellomlagring - antall besøk'!A66,0)","v":0},{"$f":"OFFSET(Start,$A66,C$1)","v":0},0,0,0,0,0,0,0,0,0,0,0,0,0,0,0,0,0,0,0,0,0,0,0,0,0,0,0,0,0,0,0,0,0,0,0]
[66,{"$f":"OFFSET(Start,'Mellomlagring - antall besøk'!A67,0)","v":0},0,0,0,0,0,0,0,0,0,0,0,0,0,0,0,0,0,0,0,0,0,0,0,0,0,0,0,0,0,0,0,0,0,0,0,{"$f":"OFFSET(Start,$A67,AL$1)","v":0}]
[67,{"$f":"OFFSET(Start,'Mellomlagring - antall besøk'!A68,0)","v":0},0,0,0,0,0,0,0,0,0,0,0,0,0,0,0,0,0,0,0,0,0,0,0,0,0,0,0,0,0,0,0,0,0,0,0,0]
[{"$f":"+A68+1","v":68},{"$f":"OFFSET(Start,'Mellomlagring - antall besøk'!A69,0)","v":0},0,0,0,0,0,0,0,0,0,0,0,0,0,0,0,0,0,0,0,0,0,0,0,0,0,0,0,0,0,0,0,0,0,0,0,0]
[69,{"$f":"OFFSET(Start,'Mellomlagring - antall besøk'!A70,0)","v":0},0,0,0,0,0,0,0,0,0,0,0,0,0,0,0,0,0,0,0,0,0,0,0,0,0,0,0,0,0,0,0,0,0,0,0,0]
[70,{"$f":"OFFSET(Start,'Mellomlagring - antall besøk'!A71,0)","v":0},0,0,0,0,0,0,0,0,0,0,0,0,0,0,0,0,0,0,0,0,0,0,0,0,0,0,0,0,0,0,0,0,0,0,0,0]
[71,{"$f":"OFFSET(Start,'Mellomlagring - antall besøk'!A72,0)","v":0},0,0,0,0,0,0,0,0,0,0,0,0,0,0,0,0,0,0,0,0,0,0,0,0,0,0,0,0,0,0,0,0,0,0,0,0]
[72,{"$f":"OFFSET(Start,'Mellomlagring - antall besøk'!A73,0)","v":0},0,0,0,0,0,0,0,0,0,0,0,0,0,0,0,0,0,0,0,0,0,0,0,0,0,0,0,0,0,0,0,0,0,0,0,0]
[73,{"$f":"OFFSET(Start,'Mellomlagring - antall besøk'!A74,0)","v":0},0,0,0,0,0,0,0,0,0,0,0,0,0,0,0,0,0,0,0,0,0,0,0,0,0,0,0,0,0,0,0,0,0,0,0,0]
[74,{"$f":"OFFSET(Start,'Mellomlagring - antall besøk'!A75,0)","v":0},0,0,0,0,0,0,0,0,0,0,0,0,0,0,0,0,0,0,0,0,0,0,0,0,0,0,0,0,0,0,0,0,0,0,0,0]
[75,{"$f":"OFFSET(Start,'Mellomlagring - antall besøk'!A76,0)","v":0},0,0,0,0,0,0,0,0,0,0,0,0,0,0,0,0,0,0,0,0,0,0,{"$f":"OFFSET(Start,$A76,Y$1)","v":0},0,0,0,0,0,0,0,0,0,0,0,0,0]
[76,{"$f":"OFFSET(Start,'Mellomlagring - antall besøk'!A77,0)","v":0},0,0,0,0,0,0,0,0,0,0,0,0,0,0,0,0,0,0,0,{"$f":"OFFSET(Start,$A77,V$1)","v":0},0,0,0,0,0,0,0,0,0,0,0,0,0,0,0,0]
[77,{"$f":"OFFSET(Start,'Mellomlagring - antall besøk'!A78,0)","v":0},0,0,0,0,0,0,0,0,0,0,0,0,0,0,0,0,0,0,0,0,0,0,0,0,0,0,0,0,0,0,0,0,0,0,0,0]
[78,{"$f":"OFFSET(Start,'Mellomlagring - antall besøk'!A79,0)","v":0},0,0,0,0,0,0,0,0,0,0,0,0,0,0,0,0,0,0,0,0,0,0,0,0,0,0,0,0,0,0,0,0,0,0,0,0]
[79,{"$f":"OFFSET(Start,'Mellomlagring - antall besøk'!A80,0)","v":0},0,0,0,0,0,0,0,0,0,0,0,0,0,0,0,0,0,0,0,0,0,0,0,0,0,0,0,0,0,0,0,{"$f":"OFFSET(Start,$A80,AH$1)","v":0},0,0,0,0]
[80,{"$f":"OFFSET(Start,'Mellomlagring - antall besøk'!A81,0)","v":0},0,0,0,0,0,0,0,0,0,0,0,0,0,0,0,{"$f":"OFFSET(Start,$A81,R$1)","v":0},0,0,0,0,0,0,0,0,0,0,0,0,0,0,0,0,0,0,0,0]
[81,{"$f":"OFFSET(Start,'Mellomlagring - antall besøk'!A82,0)","v":0},{"$f":"OFFSET(Start,$A82,C$1)","v":0},0,0,0,0,0,0,0,0,0,0,0,0,0,0,0,0,0,0,0,0,0,0,0,0,0,0,0,0,0,0,0,0,0,0,0]
[82,{"$f":"OFFSET(Start,'Mellomlagring - antall besøk'!A83,0)","v":0},0,0,0,0,0,0,0,0,0,0,0,0,0,0,0,0,0,0,0,0,0,0,0,0,0,0,0,0,0,0,0,0,0,0,0,0]
[83,{"$f":"OFFSET(Start,'Mellomlagring - antall besøk'!A84,0)","v":0},0,0,0,0,0,0,0,0,0,0,0,0,0,0,0,0,0,0,0,0,0,0,0,0,0,0,0,0,0,0,0,0,0,0,0,0]
[84,{"$f":"OFFSET(Start,'Mellomlagring - antall besøk'!A85,0)","v":0},0,0,0,0,0,0,0,0,0,0,0,0,0,0,0,0,0,0,0,0,0,0,0,0,0,0,0,0,0,0,0,0,0,0,0,0]
[85,{"$f":"OFFSET(Start,'Mellomlagring - antall besøk'!A86,0)","v":0},0,0,0,0,0,0,0,0,0,0,0,0,0,0,0,0,0,0,0,0,0,0,0,0,0,0,0,0,0,0,0,0,0,0,0,0]
[86,{"$f":"OFFSET(Start,'Mellomlagring - antall besøk'!A87,0)","v":0},0,0,0,0,0,0,0,0,0,0,0,0,0,0,0,0,0,0,0,0,0,0,0,0,0,0,0,0,0,0,0,0,0,0,0,0]
[87,{"$f":"OFFSET(Start,'Mellomlagring - antall besøk'!A88,0)","v":0},0,0,0,0,0,0,0,0,0,0,0,0,0,0,0,0,0,0,0,0,0,0,0,0,0,0,0,0,0,0,0,0,0,0,0,0]
[88,{"$f":"OFFSET(Start,'Mellomlagring - antall besøk'!A89,0)","v":0},0,0,0,0,0,0,0,0,0,0,0,0,0,0,0,0,0,0,0,0,0,0,0,0,0,0,0,0,0,0,0,0,0,0,0,0]
[89,{"$f":"OFFSET(Start,'Mellomlagring - antall besøk'!A90,0)","v":0},0,0,0,0,0,0,0,0,0,0,0,0,0,0,0,0,0,0,0,0,0,0,0,0,0,0,0,0,0,0,0,0,0,0,0,0]
[90,{"$f":"OFFSET(Start,'Mellomlagring - antall besøk'!A91,0)","v":0},0,0,0,0,0,0,0,0,0,0,0,0,0,0,0,0,0,0,0,0,0,0,0,0,0,0,0,0,0,0,0,0,0,0,0,0]
[91,{"$f":"OFFSET(Start,'Mellomlagring - antall besøk'!A92,0)","v":0},0,0,0,0,0,0,0,0,0,0,0,0,0,0,0,0,0,0,0,0,0,0,0,0,0,0,0,0,0,0,0,0,0,0,0,0]
[92,{"$f":"OFFSET(Start,'Mellomlagring - antall besøk'!A93,0)","v":0},0,0,0,0,0,0,0,0,0,0,0,0,0,0,0,0,0,0,0,0,0,0,0,0,0,0,0,0,0,0,0,0,0,0,0,0]
[93,{"$f":"OFFSET(Start,'Mellomlagring - antall besøk'!A94,0)","v":0},0,0,0,0,0,0,0,0,0,0,0,0,0,0,0,0,0,0,0,0,0,0,0,0,0,0,0,0,0,0,0,0,0,0,0,0]
[94,{"$f":"OFFSET(Start,'Mellomlagring - antall besøk'!A95,0)","v":0},0,0,0,0,0,0,0,0,0,0,0,0,0,0,0,0,0,0,0,0,0,0,0,0,0,0,0,0,0,0,0,0,0,0,0,0]
[95,{"$f":"OFFSET(Start,'Mellomlagring - antall besøk'!A96,0)","v":0},0,0,0,0,0,0,0,0,0,0,0,0,0,0,0,0,0,0,0,0,0,0,0,0,0,0,0,0,0,0,0,0,0,0,0,0]
[96,{"$f":"OFFSET(Start,'Mellomlagring - antall besøk'!A97,0)","v":0},0,0,0,0,0,0,0,0,0,0,0,0,0,0,0,{"$f":"OFFSET(Start,$A97,R$1)","v":0},0,0,0,0,0,0,0,0,0,0,0,0,0,0,{"$f":"OFFSET(Start,$A97,AG$1)","v":0},0,0,0,0,0]
[97,{"$f":"OFFSET(Start,'Mellomlagring - antall besøk'!A98,0)","v":0},{"$f":"OFFSET(Start,$A98,C$1)","v":0},0,0,0,0,0,0,0,0,0,0,0,0,0,0,0,{"$f":"OFFSET(Start,$A98,S$1)","v":0},0,0,0,0,0,0,0,0,0,0,0,0,0,0,0,0,0,0,0]
[98,{"$f":"OFFSET(Start,'Mellomlagring - antall besøk'!A99,0)","v":0},0,0,0,0,0,0,0,0,0,0,0,0,0,0,0,0,0,0,0,0,0,0,0,0,0,0,0,0,0,0,0,0,0,0,0,0]
[99,{"$f":"OFFSET(Start,'Mellomlagring - antall besøk'!A100,0)","v":0},0,0,0,0,0,0,0,0,0,0,0,0,0,0,0,0,0,0,0,0,0,0,0,0,0,0,0,0,0,0,0,0,0,0,0,0]
[100,{"$f":"OFFSET(Start,'Mellomlagring - antall besøk'!A101,0)","v":0},0,0,0,0,0,0,0,0,0,0,0,0,0,0,0,0,0,0,0,0,0,0,0,0,0,0,0,0,0,0,0,0,0,0,0,0]
[101,{"$f":"OFFSET(Start,'Mellomlagring - antall besøk'!A102,0)","v":0},0,0,0,0,0,0,0,0,0,0,0,0,0,0,0,0,0,0,0,0,0,0,0,0,0,0,0,0,0,0,0,0,0,0,0,0]

{"sheet":"Mellomlagring - kvalitet","index":8,"n_rows":105,"n_cols":41,"rows_kept":105,"cut":false,"hidden":true,"merged":[]}
[null,null,41,{"$f":"C1+3","v":44},{"$f":"D1+3","v":47},50,53,56,59,62,65,68,71,74,77,80,83,86,89,92,95,98,101,104,107,110,113,116,119,122,125,128,131,134,137,140,143,146]
["Nummer","Bruker ID",{"$f":"OFFSET('Månedlig registrering'!$AN$6,0,COLUMN(C:C)*3-9)","v":"2018-01-01"},{"$f":"OFFSET('Månedlig registrering'!$AN$6,0,COLUMN(D:D)*3-9)","v":"2018-02-01"},{"$f":"OFFSET('Månedlig registrering'!$AN$6,0,COLUMN(E:E)*3-9)","v":"2018-03-01"},{"$f":"OFFSET('Månedlig registrering'!$AN$6,0,COLUMN(F:F)*3-9)","v":"2018-04-01"},{"$f":"OFFSET('Månedlig registrering'!$AN$6,0,COLUMN(G:G)*3-9)","v":"2018-05-01"},{"$f":"OFFSET('Månedlig registrering'!$AN$6,0,COLUMN(H:H)*3-9)","v":"2018-06-01"},{"$f":"OFFSET('Månedlig registrering'!$AN$6,0,COLUMN(I:I)*3-9)","v":"2018-07-01"},{"$f":"OFFSET('Månedlig registrering'!$AN$6,0,COLUMN(J:J)*3-9)","v":"2018-08-01"},{"$f":"OFFSET('Månedlig registrering'!$AN$6,0,COLUMN(K:K)*3-9)","v":"2018-09-01"},{"$f":"OFFSET('Månedlig registrering'!$AN$6,0,COLUMN(L:L)*3-9)","v":"2018-10-01"},{"$f":"OFFSET('Månedlig registrering'!$AN$6,0,COLUMN(M:M)*3-9)","v":"2018-11-01"},{"$f":"OFFSET('Månedlig registrering'!$AN$6,0,COLUMN(N:N)*3-9)","v":"2018-12-01"},{"$f":"OFFSET('Månedlig registrering'!$AN$6,0,COLUMN(O:O)*3-9)","v":"2019-01-01"},{"$f":"OFFSET('Månedlig registrering'!$AN$6,0,COLUMN(P:P)*3-9)","v":"2019-02-01"},{"$f":"OFFSET('Månedlig registrering'!$AN$6,0,COLUMN(Q:Q)*3-9)","v":"2019-03-01"},{"$f":"OFFSET('Månedlig registrering'!$AN$6,0,COLUMN(R:R)*3-9)","v":"2019-04-01"},{"$f":"OFFSET('Månedlig registrering'!$AN$6,0,COLUMN(S:S)*3-9)","v":"2019-05-01"},{"$f":"OFFSET('Månedlig registrering'!$AN$6,0,COLUMN(T:T)*3-9)","v":"2019-06-01"},{"$f":"OFFSET('Månedlig registrering'!$AN$6,0,COLUMN(U:U)*3-9)","v":"2019-07-01"},{"$f":"OFFSET('Månedlig registrering'!$AN$6,0,COLUMN(V:V)*3-9)","v":"2019-08-01"},{"$f":"OFFSET('Månedlig registrering'!$AN$6,0,COLUMN(W:W)*3-9)","v":"2019-09-01"},{"$f":"OFFSET('Månedlig registrering'!$AN$6,0,COLUMN(X:X)*3-9)","v":"2019-10-01"},{"$f":"OFFSET('Månedlig registrering'!$AN$6,0,COLUMN(Y:Y)*3-9)","v":"2019-11-01"},{"$f":"OFFSET('Månedlig registrering'!$AN$6,0,COLUMN(Z:Z)*3-9)","v":"2019-12-01"},{"$f":"OFFSET('Månedlig registrering'!$AN$6,0,COLUMN(AA:AA)*3-9)","v":"2020-01-01"},{"$f":"OFFSET('Månedlig registrering'!$AN$6,0,COLUMN(AB:AB)*3-9)","v":"2020-02-01"},{"$f":"OFFSET('Månedlig registrering'!$AN$6,0,COLUMN(AC:AC)*3-9)","v":"2020-03-01"},{"$f":"OFFSET('Månedlig registrering'!$AN$6,0,COLUMN(AD:AD)*3-9)","v":"2020-04-01"},{"$f":"OFFSET('Månedlig registrering'!$AN$6,0,COLUMN(AE:AE)*3-9)","v":"2020-05-01"},{"$f":"OFFSET('Månedlig registrering'!$AN$6,0,COLUMN(AF:AF)*3-9)","v":"2020-06-01"},{"$f":"OFFSET('Månedlig registrering'!$AN$6,0,COLUMN(AG:AG)*3-9)","v":"2020-07-01"},{"$f":"OFFSET('Månedlig registrering'!$AN$6,0,COLUMN(AH:AH)*3-9)","v":"2020-08-01"},{"$f":"OFFSET('Månedlig registrering'!$AN$6,0,COLUMN(AI:AI)*3-9)","v":"2020-09-01"},{"$f":"OFFSET('Månedlig registrering'!$AN$6,0,COLUMN(AJ:AJ)*3-9)","v":"2020-10-01"},{"$f":"OFFSET('Månedlig registrering'!$AN$6,0,COLUMN(AK:AK)*3-9)","v":"2020-11-01"},{"$f":"OFFSET('Månedlig registrering'!$AN$6,0,COLUMN(AL:AL)*3-9)","v":"2020-12-01"},"Sum Fornøyd","Sum Nøytral","Sum Misfornøyd"]
[2,{"$f":"OFFSET(Start,'Mellomlagring - antall besøk'!A3,0)","v":1001},{"$f":"OFFSET(Start,$A3,C$1)","v":"Nøytral"},{"$f":"OFFSET(Start,$A3,D$1)","v":"Fornøyd"},"Fornøyd","Fornøyd","Fornøyd",0,0,0,0,0,0,0,0,0,0,0,0,0,{"$f":"OFFSET(Start,$A3,U$1)","v":0},0,0,0,0,0,0,0,0,0,0,0,0,0,0,0,0,0,{"$f":"COUNTIF($C3:$AL3,\"Fornøyd\")","v":4},{"$f":"COUNTIF($C3:$AL3,\"Nøytral\")","v":1},{"$f":"COUNTIF($C3:$AL3,\"Misfornøyd\")","v":0}]
[{"$f":"+A3+1","v":3},{"$f":"OFFSET(Start,'Mellomlagring - antall besøk'!A4,0)","v":1002},0,0,"Fornøyd","Fornøyd","Fornøyd",0,0,0,0,0,0,0,0,0,0,0,0,0,0,0,0,0,0,0,0,0,0,0,0,0,0,0,0,0,0,0,3,0,0]
[{"$f":"+A4+1","v":4},{"$f":"OFFSET(Start,'Mellomlagring - antall besøk'!A5,0)","v":1003},0,0,0,0,0,0,0,0,0,0,0,0,0,0,0,0,0,0,0,0,0,0,0,0,0,0,0,0,0,0,0,0,0,0,0,0,0,0,0]
[5,{"$f":"OFFSET(Start,'Mellomlagring - antall besøk'!A6,0)","v":0},0,0,0,0,0,0,0,0,0,0,0,0,0,0,0,0,0,0,0,0,0,0,0,0,0,0,0,0,0,0,0,0,0,0,0,0,0,0,0]
[6,{"$f":"OFFSET(Start,'Mellomlagring - antall besøk'!A7,0)","v":0},0,0,0,0,0,0,0,0,0,0,0,0,0,0,0,0,0,0,0,0,0,0,0,0,0,0,0,0,0,0,0,0,0,0,0,0,0,0,0]
[7,{"$f":"OFFSET(Start,'Mellomlagring - antall besøk'!A8,0)","v":0},0,0,0,0,0,0,0,0,0,0,0,0,0,0,0,0,0,0,0,0,0,0,0,0,0,0,0,0,0,0,0,0,0,0,0,0,0,0,0]
[8,{"$f":"OFFSET(Start,'Mellomlagring - antall besøk'!A9,0)","v":0},0,0,0,0,0,0,0,0,0,0,0,0,0,0,0,0,0,0,0,0,0,0,0,0,0,0,0,0,0,0,0,0,0,0,0,0,0,0,0]
[9,{"$f":"OFFSET(Start,'Mellomlagring - antall besøk'!A10,0)","v":0},0,0,0,0,0,0,0,0,0,0,0,0,0,0,0,0,0,0,0,0,0,0,0,0,0,0,0,0,0,0,0,0,0,0,0,0,0,0,0]
[10,{"$f":"OFFSET(Start,'Mellomlagring - antall besøk'!A11,0)","v":0},0,0,0,0,0,0,0,0,0,0,0,0,0,0,0,0,0,0,0,0,0,0,0,0,0,0,0,0,0,0,0,0,0,0,0,0,0,0,0]
[11,{"$f":"OFFSET(Start,'Mellomlagring - antall besøk'!A12,0)","v":0},0,0,0,0,0,0,0,0,0,0,0,0,0,0,0,0,0,0,0,0,0,0,0,0,0,0,0,0,0,0,0,0,0,0,0,0,0,0,0]
[12,{"$f":"OFFSET(Start,'Mellomlagring - antall besøk'!A13,0)","v":0},0,0,0,0,0,0,0,0,0,0,0,0,0,0,0,0,0,0,0,0,0,0,0,0,0,0,0,0,0,0,0,0,0,0,0,0,0,0,0]
[13,{"$f":"OFFSET(Start,'Mellomlagring - antall besøk'!A14,0)","v":0},0,0,0,0,0,0,0,0,0,0,0,0,0,0,0,0,0,0,0,0,{"$f":"OFFSET(Start,$A14,W$1)","v":0},0,0,0,0,0,0,0,0,0,0,0,0,0,0,0,0,0,0]
[14,{"$f":"OFFSET(Start,'Mellomlagring - antall besøk'!A15,0)","v":0},0,0,0,0,0,0,0,0,0,0,0,0,0,0,0,0,0,0,{"$f":"OFFSET(Start,$A15,U$1)","v":0},0,0,0,0,0,0,0,0,0,0,0,0,0,{"$f":"OFFSET(Start,$A15,AI$1)","v":0},0,0,0,0,0,0]
[15,{"$f":"OFFSET(Start,'Mellomlagring - antall besøk'!A16,0)","v":0},0,0,0,0,0,0,0,0,0,0,0,0,0,0,0,0,0,0,0,0,0,0,0,0,0,0,0,0,0,0,0,0,0,0,0,0,0,0,0]
[16,{"$f":"OFFSET(Start,'Mellomlagring - antall besøk'!A17,0)","v":0},0,0,0,{"$f":"OFFSET(Start,$A17,F$1)","v":0},0,0,0,0,0,0,0,0,0,0,0,0,0,0,0,0,0,0,0,0,0,0,0,0,0,0,0,0,0,0,0,0,0,0,0]
[17,{"$f":"OFFSET(Start,'Mellomlagring - antall besøk'!A18,0)","v":0},{"$f":"OFFSET(Start,$A18,C$1)","v":0},0,0,0,0,0,0,0,0,0,0,0,0,0,0,0,0,0,0,0,0,0,0,0,0,0,0,0,0,0,0,0,0,0,0,0,0,0,0]
[18,{"$f":"OFFSET(Start,'Mellomlagring - antall besøk'!A19,0)","v":0},0,0,0,0,0,0,0,0,0,0,0,0,0,0,0,0,0,0,0,0,0,0,0,0,0,0,0,0,0,0,0,0,0,0,0,0,0,0,0]
[19,{"$f":"OFFSET(Start,'Mellomlagring - antall besøk'!A20,0)","v":0},0,0,0,0,0,0,0,0,0,0,0,0,0,0,0,0,0,0,0,0,0,0,0,0,0,0,0,0,0,0,0,0,0,0,0,0,0,0,0]
[20,{"$f":"OFFSET(Start,'Mellomlagring - antall besøk'!A21,0)","v":0},0,0,0,0,0,0,0,0,0,0,0,0,0,0,0,0,0,0,0,0,0,0,0,0,0,0,0,0,0,0,0,0,0,0,0,0,0,0,0]
[21,{"$f":"OFFSET(Start,'Mellomlagring - antall besøk'!A22,0)","v":0},0,0,0,0,0,0,0,0,0,0,0,0,0,0,0,0,0,0,0,0,0,0,0,0,0,0,0,0,0,0,0,0,0,0,0,0,0,0,0]
[22,{"$f":"OFFSET(Start,'Mellomlagring - antall besøk'!A23,0)","v":0},0,0,0,0,0,0,0,0,0,0,0,0,0,0,0,0,0,0,0,0,0,0,0,0,0,0,0,0,0,0,0,0,0,0,0,0,0,0,0]
[23,{"$f":"OFFSET(Start,'Mellomlagring - antall besøk'!A24,0)","v":0},0,0,0,0,0,0,0,0,0,0,0,0,0,0,0,0,0,0,0,0,0,0,0,0,0,0,0,0,0,0,0,0,0,0,0,0,0,0,0]
[24,{"$f":"OFFSET(Start,'Mellomlagring - antall besøk'!A25,0)","v":0},0,0,0,0,0,0,0,0,0,0,0,0,0,0,0,0,0,0,0,0,0,0,0,0,0,0,0,0,0,0,0,0,0,0,0,0,0,0,0]
[25,{"$f":"OFFSET(Start,'Mellomlagring - antall besøk'!A26,0)","v":0},0,0,0,0,0,0,0,0,0,0,0,0,0,0,0,0,0,0,0,0,0,0,0,0,0,0,0,0,0,0,0,0,0,0,0,0,0,0,0]
[26,{"$f":"OFFSET(Start,'Mellomlagring - antall besøk'!A27,0)","v":0},0,0,0,0,0,0,0,0,0,0,0,0,0,0,0,0,0,0,0,0,0,0,0,0,0,0,0,0,0,0,0,0,0,0,0,0,0,0,0]
[27,{"$f":"OFFSET(Start,'Mellomlagring - antall besøk'!A28,0)","v":0},0,0,0,0,0,0,0,0,0,0,0,0,0,0,0,0,0,0,0,0,0,0,0,0,0,0,0,0,0,0,0,0,0,0,0,0,0,0,0]
[28,{"$f":"OFFSET(Start,'Mellomlagring - antall besøk'!A29,0)","v":0},0,0,0,0,0,0,0,0,0,0,0,0,0,0,0,0,0,0,0,0,0,0,0,0,0,0,0,0,0,0,0,0,0,0,0,0,0,0,0]
[29,{"$f":"OFFSET(Start,'Mellomlagring - antall besøk'!A30,0)","v":0},0,0,0,0,0,0,0,0,0,0,0,0,0,0,0,0,0,0,0,0,0,0,0,0,0,0,0,0,0,0,0,0,0,0,0,0,0,0,0]
[30,{"$f":"OFFSET(Start,'Mellomlagring - antall besøk'!A31,0)","v":0},0,0,0,0,0,0,0,0,0,0,0,0,0,0,0,0,0,0,0,0,0,0,0,0,0,0,0,0,0,0,0,0,0,0,0,0,0,0,0]
[31,{"$f":"OFFSET(Start,'Mellomlagring - antall besøk'!A32,0)","v":0},0,0,0,0,0,0,0,0,0,0,0,0,0,0,0,0,0,0,0,0,0,0,0,0,0,0,0,0,0,0,0,0,0,0,0,0,0,0,0]
[32,{"$f":"OFFSET(Start,'Mellomlagring - antall besøk'!A33,0)","v":0},0,0,0,0,0,0,0,0,0,0,0,0,0,0,0,{"$f":"OFFSET(Start,$A33,R$1)","v":0},0,0,0,0,0,0,0,0,0,0,0,0,0,0,0,0,0,0,0,0,0,0,0]
[33,{"$f":"OFFSET(Start,'Mellomlagring - antall besøk'!A34,0)","v":0},{"$f":"OFFSET(Start,$A34,C$1)","v":0},0,0,0,0,0,0,0,0,0,0,0,0,0,0,0,0,0,0,0,0,0,0,0,0,0,0,0,0,0,0,0,0,0,0,0,0,0,0]
[34,{"$f":"OFFSET(Start,'Mellomlagring - antall besøk'!A35,0)","v":0},0,0,0,0,0,0,0,0,0,0,0,0,0,0,0,0,0,0,0,0,0,0,0,0,0,0,0,0,0,0,0,0,0,0,0,0,{"$f":"COUNTIF($C35:$AL35,\"Fornøyd\")","v":0},{"$f":"COUNTIF($C35:$AL35,\"Nøytral\")","v":0},{"$f":"COUNTIF($C35:$AL35,\"Misfornøyd\")","v":0}]
[35,{"$f":"OFFSET(Start,'Mellomlagring - antall besøk'!A36,0)","v":0},0,0,0,0,0,0,0,0,0,0,0,0,0,0,0,0,0,0,0,0,0,0,0,0,0,{"$f":"OFFSET(Start,$A36,AB$1)","v":0},0,0,0,0,0,0,0,0,0,0,0,0,0]
[36,{"$f":"OFFSET(Start,'Mellomlagring - antall besøk'!A37,0)","v":0},0,0,0,0,0,0,0,0,0,0,0,0,0,0,0,0,0,0,0,0,0,0,0,0,0,0,0,0,0,0,0,0,0,0,0,0,0,0,0]
[37,{"$f":"OFFSET(Start,'Mellomlagring - antall besøk'!A38,0)","v":0},0,0,0,0,0,0,0,0,0,0,0,0,0,0,0,0,0,0,0,0,0,0,0,0,0,0,0,0,0,0,0,0,0,0,0,0,0,0,0]
[38,{"$f":"OFFSET(Start,'Mellomlagring - antall besøk'!A39,0)","v":0},0,0,0,0,0,0,0,0,0,0,0,0,0,0,0,0,0,0,0,0,0,0,0,0,0,0,0,0,0,0,0,0,0,0,0,0,0,0,0]
[39,{"$f":"OFFSET(Start,'Mellomlagring - antall besøk'!A40,0)","v":0},0,0,0,0,0,0,0,0,0,0,0,0,0,0,0,0,0,0,0,0,0,0,0,0,0,0,0,0,0,0,0,0,0,0,0,0,0,0,0]
[40,{"$f":"OFFSET(Start,'Mellomlagring - antall besøk'!A41,0)","v":0},0,0,0,0,0,0,0,0,0,0,0,0,0,0,0,0,0,0,0,0,0,0,0,0,0,0,0,0,0,0,0,0,0,0,0,0,0,0,0]
[41,{"$f":"OFFSET(Start,'Mellomlagring - antall besøk'!A42,0)","v":0},0,0,0,0,0,0,0,0,0,0,0,0,0,0,0,0,0,0,0,0,{"$f":"OFFSET(Start,$A42,W$1)","v":0},0,0,0,0,0,0,0,0,0,0,0,0,0,0,0,0,0,0]
[42,{"$f":"OFFSET(Start,'Mellomlagring - antall besøk'!A43,0)","v":0},0,0,0,0,0,0,0,0,0,0,0,0,0,0,0,0,0,0,0,{"$f":"OFFSET(Start,$A43,V$1)","v":0},0,0,0,0,0,0,0,0,0,0,0,0,0,0,0,0,0,0,0]
[43,{"$f":"OFFSET(Start,'Mellomlagring - antall besøk'!A44,0)","v":0},0,0,0,0,0,0,0,0,0,0,0,0,0,0,0,0,0,0,0,0,0,0,0,0,0,0,0,0,0,0,0,0,0,0,0,0,0,0,0]
[44,{"$f":"OFFSET(Start,'Mellomlagring - antall besøk'!A45,0)","v":0},0,0,0,0,0,0,0,0,0,0,0,0,0,0,0,0,0,0,0,0,0,0,0,0,0,0,0,0,0,0,0,0,0,0,0,0,0,0,0]
[45,{"$f":"OFFSET(Start,'Mellomlagring - antall besøk'!A46,0)","v":0},0,0,0,0,0,0,0,0,0,0,0,0,0,0,0,0,0,0,0,0,0,0,0,0,0,0,0,0,0,0,0,0,0,0,0,0,0,0,0]
[46,{"$f":"OFFSET(Start,'Mellomlagring - antall besøk'!A47,0)","v":0},0,0,0,0,0,0,0,0,0,0,0,0,0,0,0,0,0,0,0,0,0,0,0,0,0,0,0,0,0,0,0,0,0,0,0,0,0,0,0]
[47,{"$f":"OFFSET(Start,'Mellomlagring - antall besøk'!A48,0)","v":0},0,0,0,0,0,0,0,0,0,0,0,0,0,0,0,0,0,0,0,0,0,0,0,0,0,0,0,0,0,0,0,0,0,0,0,0,0,0,0]
[48,{"$f":"OFFSET(Start,'Mellomlagring - antall besøk'!A49,0)","v":0},0,0,0,0,0,0,0,0,0,0,0,0,0,0,0,{"$f":"OFFSET(Start,$A49,R$1)","v":0},0,0,0,0,0,0,0,0,0,0,0,0,0,0,0,0,0,0,0,0,0,0,0]
[49,{"$f":"OFFSET(Start,'Mellomlagring - antall besøk'!A50,0)","v":0},{"$f":"OFFSET(Start,$A50,C$1)","v":0},0,0,0,0,0,0,0,0,0,0,0,0,0,0,0,0,0,0,0,0,0,0,0,0,0,0,0,0,0,0,0,0,0,0,0,0,0,0]
[50,{"$f":"OFFSET(Start,'Mellomlagring - antall besøk'!A51,0)","v":0},0,0,0,0,0,0,0,0,0,0,0,0,0,0,0,0,0,0,0,0,0,0,0,0,0,0,0,0,0,0,0,0,0,0,0,0,0,0,0]
[51,{"$f":"OFFSET(Start,'Mellomlagring - antall besøk'!A52,0)","v":0},0,0,0,0,0,0,0,0,0,0,0,0,0,0,0,0,0,0,0,0,0,0,0,0,0,0,0,0,0,0,0,0,0,0,0,0,0,0,0]
[52,{"$f":"OFFSET(Start,'Mellomlagring - antall besøk'!A53,0)","v":0},0,0,0,0,0,0,0,0,0,0,0,0,0,0,0,0,0,0,0,0,0,0,0,0,0,0,0,0,0,0,0,0,0,0,0,0,0,0,0]
[53,{"$f":"OFFSET(Start,'Mellomlagring - antall besøk'!A54,0)","v":0},0,0,0,0,0,0,0,0,0,0,0,0,0,0,0,0,0,0,0,0,0,0,0,0,0,0,0,0,0,0,0,0,{"$f":"OFFSET(Start,$A54,AI$1)","v":0},0,0,0,0,0,0]
[54,{"$f":"OFFSET(Start,'Mellomlagring - antall besøk'!A55,0)","v":0},0,0,0,0,0,0,0,0,0,0,0,0,0,0,0,0,0,0,0,{"$f":"OFFSET(Start,$A55,V$1)","v":0},0,0,0,0,0,0,0,0,0,0,0,0,0,0,0,0,0,0,0]
[55,{"$f":"OFFSET(Start,'Mellomlagring - antall besøk'!A56,0)","v":0},0,0,0,0,0,0,0,0,0,0,0,0,0,0,0,0,0,0,0,0,0,0,0,0,0,0,0,0,0,0,0,0,0,0,0,0,0,0,0]
[56,{"$f":"OFFSET(Start,'Mellomlagring - antall besøk'!A57,0)","v":0},0,0,0,0,0,0,0,0,0,0,0,0,0,0,0,0,0,0,0,0,0,0,0,0,0,0,0,0,0,0,0,0,0,0,0,0,0,0,0]
[57,{"$f":"OFFSET(Start,'Mellomlagring - antall besøk'!A58,0)","v":0},0,0,0,0,0,0,0,0,0,0,0,0,0,0,0,0,0,0,0,0,0,0,0,0,0,0,0,0,0,0,0,0,0,0,0,0,0,0,0]
[58,{"$f":"OFFSET(Start,'Mellomlagring - antall besøk'!A59,0)","v":0},0,0,0,0,0,0,0,0,0,0,0,0,0,0,0,0,0,0,0,0,0,0,0,0,0,0,0,0,0,0,0,0,0,0,0,0,0,0,0]
[59,{"$f":"OFFSET(Start,'Mellomlagring - antall besøk'!A60,0)","v":0},0,0,0,0,0,0,0,0,0,0,0,0,0,0,0,0,0,0,0,0,0,0,0,0,0,0,0,0,0,0,0,0,0,0,0,0,0,0,0]
[60,{"$f":"OFFSET(Start,'Mellomlagring - antall besøk'!A61,0)","v":0},0,0,0,0,0,0,0,0,0,0,0,0,0,0,0,0,0,0,0,0,0,0,0,0,0,0,0,0,0,0,0,0,0,0,0,0,0,0,0]
[61,{"$f":"OFFSET(Start,'Mellomlagring - antall besøk'!A62,0)","v":0},0,0,0,0,0,0,0,0,0,0,0,0,0,0,0,0,0,0,0,0,0,0,0,0,0,0,0,0,0,0,0,0,0,0,0,0,0,0,0]
[62,{"$f":"OFFSET(Start,'Mellomlagring - antall besøk'!A63,0)","v":0},0,0,0,0,0,0,0,0,0,0,0,0,0,0,0,0,0,0,0,0,0,0,0,0,0,0,0,0,0,0,0,0,0,0,0,0,0,0,0]
[63,{"$f":"OFFSET(Start,'Mellomlagring - antall besøk'!A64,0)","v":0},0,0,0,0,0,0,0,0,0,0,0,0,0,0,0,0,0,0,0,0,0,0,0,0,0,0,0,0,0,0,0,0,0,0,0,0,0,0,0]
[64,{"$f":"OFFSET(Start,'Mellomlagring - antall besøk'!A65,0)","v":0},0,0,0,0,0,0,0,0,0,0,0,0,0,0,0,{"$f":"OFFSET(Start,$A65,R$1)","v":0},0,0,0,0,0,0,0,0,0,0,0,0,0,0,0,0,0,0,0,0,0,0,0]
[65,{"$f":"OFFSET(Start,'Mellomlagring - antall besøk'!A66,0)","v":0},{"$f":"OFFSET(Start,$A66,C$1)","v":0},0,0,0,0,0,0,0,0,0,0,0,0,0,0,0,0,0,0,0,0,0,0,0,0,0,0,0,0,0,0,0,0,0,0,0,0,0,0]
[66,{"$f":"OFFSET(Start,'Mellomlagring - antall besøk'!A67,0)","v":0},0,0,0,0,0,0,0,0,0,0,0,0,0,0,0,0,0,0,0,0,0,0,0,0,0,0,0,0,0,0,0,0,0,0,0,0,{"$f":"COUNTIF($C67:$AL67,\"Fornøyd\")","v":0},{"$f":"COUNTIF($C67:$AL67,\"Nøytral\")","v":0},{"$f":"COUNTIF($C67:$AL67,\"Misfornøyd\")","v":0}]
[67,{"$f":"OFFSET(Start,'Mellomlagring - antall besøk'!A68,0)","v":0},0,0,0,0,0,0,0,0,0,0,0,0,0,0,0,0,0,0,0,0,0,0,0,0,0,0,0,0,0,0,0,0,0,0,0,0,0,0,0]
[{"$f":"+A68+1","v":68},{"$f":"OFFSET(Start,'Mellomlagring - antall besøk'!A69,0)","v":0},0,0,0,0,0,0,0,0,0,0,0,0,0,0,0,0,0,0,0,0,0,0,0,0,0,0,0,0,0,0,0,0,0,0,0,0,0,0,0]
[69,{"$f":"OFFSET(Start,'Mellomlagring - antall besøk'!A70,0)","v":0},0,0,0,0,0,0,0,0,0,0,0,0,0,0,0,0,0,0,0,0,0,0,0,0,0,0,0,0,0,0,0,0,0,0,0,0,0,0,0]
[70,{"$f":"OFFSET(Start,'Mellomlagring - antall besøk'!A71,0)","v":0},0,0,0,0,0,0,0,0,0,0,0,0,0,0,0,0,0,0,0,0,0,0,0,0,0,0,0,0,0,0,0,0,0,0,0,0,0,0,0]
[71,{"$f":"OFFSET(Start,'Mellomlagring - antall besøk'!A72,0)","v":0},0,0,0,0,0,0,0,0,0,0,0,0,0,0,0,0,0,0,0,0,0,0,0,0,0,0,0,0,0,0,0,0,0,0,0,0,0,0,0]
[72,{"$f":"OFFSET(Start,'Mellomlagring - antall besøk'!A73,0)","v":0},0,0,0,0,0,0,0,0,0,0,0,0,0,0,0,0,0,0,0,0,0,0,0,0,0,0,0,0,0,0,0,0,0,0,0,0,0,0,0]
[73,{"$f":"OFFSET(Start,'Mellomlagring - antall besøk'!A74,0)","v":0},0,0,0,0,0,0,0,0,0,0,0,0,0,0,0,0,0,0,0,0,0,0,0,0,0,0,0,0,0,0,0,0,0,0,0,0,0,0,0]
[74,{"$f":"OFFSET(Start,'Mellomlagring - antall besøk'!A75,0)","v":0},0,0,0,0,0,0,0,0,0,0,0,0,0,0,0,0,0,0,0,0,0,0,0,0,0,0,0,0,0,0,0,0,0,0,0,0,0,0,0]
[75,{"$f":"OFFSET(Start,'Mellomlagring - antall besøk'!A76,0)","v":0},0,0,0,0,0,0,0,0,0,0,0,0,0,0,0,0,0,0,0,0,0,0,{"$f":"OFFSET(Start,$A76,Y$1)","v":0},0,0,0,0,0,0,0,0,0,0,0,0,0,0,0,0]
[76,{"$f":"OFFSET(Start,'Mellomlagring - antall besøk'!A77,0)","v":0},0,0,0,0,0,0,0,0,0,0,0,0,0,0,0,0,0,0,0,{"$f":"OFFSET(Start,$A77,V$1)","v":0},0,0,0,0,0,0,0,0,0,0,0,0,0,0,0,0,0,0,0]
[77,{"$f":"OFFSET(Start,'Mellomlagring - antall besøk'!A78,0)","v":0},0,0,0,0,0,0,0,0,0,0,0,0,0,0,0,0,0,0,0,0,0,0,0,0,0,0,0,0,0,0,0,0,0,0,0,0,0,0,0]
[78,{"$f":"OFFSET(Start,'Mellomlagring - antall besøk'!A79,0)","v":0},0,0,0,0,0,0,0,0,0,0,0,0,0,0,0,0,0,0,0,0,0,0,0,0,0,0,0,0,0,0,0,0,0,0,0,0,0,0,0]
[79,{"$f":"OFFSET(Start,'Mellomlagring - antall besøk'!A80,0)","v":0},0,0,0,0,0,0,0,0,0,0,0,0,0,0,0,0,0,0,0,0,0,0,0,0,0,0,0,0,0,0,0,{"$f":"OFFSET(Start,$A80,AH$1)","v":0},0,0,0,0,0,0,0]
[80,{"$f":"OFFSET(Start,'Mellomlagring - antall besøk'!A81,0)","v":0},0,0,0,0,0,0,0,0,0,0,0,0,0,0,0,{"$f":"OFFSET(Start,$A81,R$1)","v":0},0,0,0,0,0,0,0,0,0,0,0,0,0,0,0,0,0,0,0,0,0,0,0]
[81,{"$f":"OFFSET(Start,'Mellomlagring - antall besøk'!A82,0)","v":0},{"$f":"OFFSET(Start,$A82,C$1)","v":0},0,0,0,0,0,0,0,0,0,0,0,0,0,0,0,0,0,0,0,0,0,0,0,0,0,0,0,0,0,0,0,0,0,0,0,0,0,0]
[82,{"$f":"OFFSET(Start,'Mellomlagring - antall besøk'!A83,0)","v":0},0,0,0,0,0,0,0,0,0,0,0,0,0,0,0,0,0,0,0,0,0,0,0,0,0,0,0,0,0,0,0,0,0,0,0,0,0,0,0]
[83,{"$f":"OFFSET(Start,'Mellomlagring - antall besøk'!A84,0)","v":0},0,0,0,0,0,0,0,0,0,0,0,0,0,0,0,0,0,0,0,0,0,0,0,0,0,0,0,0,0,0,0,0,0,0,0,0,0,0,0]
[84,{"$f":"OFFSET(Start,'Mellomlagring - antall besøk'!A85,0)","v":0},0,0,0,0,0,0,0,0,0,0,0,0,0,0,0,0,0,0,0,0,0,0,0,0,0,0,0,0,0,0,0,0,0,0,0,0,0,0,0]
[85,{"$f":"OFFSET(Start,'Mellomlagring - antall besøk'!A86,0)","v":0},0,0,0,0,0,0,0,0,0,0,0,0,0,0,0,0,0,0,0,0,0,0,0,0,0,0,0,0,0,0,0,0,0,0,0,0,0,0,0]
[86,{"$f":"OFFSET(Start,'Mellomlagring - antall besøk'!A87,0)","v":0},0,0,0,0,0,0,0,0,0,0,0,0,0,0,0,0,0,0,0,0,0,0,0,0,0,0,0,0,0,0,0,0,0,0,0,0,0,0,0]
[87,{"$f":"OFFSET(Start,'Mellomlagring - antall besøk'!A88,0)","v":0},0,0,0,0,0,0,0,0,0,0,0,0,0,0,0,0,0,0,0,0,0,0,0,0,0,0,0,0,0,0,0,0,0,0,0,0,0,0,0]
[88,{"$f":"OFFSET(Start,'Mellomlagring - antall besøk'!A89,0)","v":0},0,0,0,0,0,0,0,0,0,0,0,0,0,0,0,0,0,0,0,0,0,0,0,0,0,0,0,0,0,0,0,0,0,0,0,0,0,0,0]
[89,{"$f":"OFFSET(Start,'Mellomlagring - antall besøk'!A90,0)","v":0},0,0,0,0,0,0,0,0,0,0,0,0,0,0,0,0,0,0,0,0,0,0,0,0,0,0,0,0,0,0,0,0,0,0,0,0,0,0,0]
[90,{"$f":"OFFSET(Start,'Mellomlagring - antall besøk'!A91,0)","v":0},0,0,0,0,0,0,0,0,0,0,0,0,0,0,0,0,0,0,0,0,0,0,0,0,0,0,0,0,0,0,0,0,0,0,0,0,0,0,0]
[91,{"$f":"OFFSET(Start,'Mellomlagring - antall besøk'!A92,0)","v":0},0,0,0,0,0,0,0,0,0,0,0,0,0,0,0,0,0,0,0,0,0,0,0,0,0,0,0,0,0,0,0,0,0,0,0,0,0,0,0]
[92,{"$f":"OFFSET(Start,'Mellomlagring - antall besøk'!A93,0)","v":0},0,0,0,0,0,0,0,0,0,0,0,0,0,0,0,0,0,0,0,0,0,0,0,0,0,0,0,0,0,0,0,0,0,0,0,0,0,0,0]
[93,{"$f":"OFFSET(Start,'Mellomlagring - antall besøk'!A94,0)","v":0},0,0,0,0,0,0,0,0,0,0,0,0,0,0,0,0,0,0,0,0,0,0,0,0,0,0,0,0,0,0,0,0,0,0,0,0,0,0,0]
[94,{"$f":"OFFSET(Start,'Mellomlagring - antall besøk'!A95,0)","v":0},0,0,0,0,0,0,0,0,0,0,0,0,0,0,0,0,0,0,0,0,0,0,0,0,0,0,0,0,0,0,0,0,0,0,0,0,0,0,0]
[95,{"$f":"OFFSET(Start,'Mellomlagring - antall besøk'!A96,0)","v":0},0,0,0,0,0,0,0,0,0,0,0,0,0,0,0,0,0,0,0,0,0,0,0,0,0,0,0,0,0,0,0,0,0,0,0,0,0,0,0]
[96,{"$f":"OFFSET(Start,'Mellomlagring - antall besøk'!A97,0)","v":0},0,0,0,0,0,0,0,0,0,0,0,0,0,0,0,{"$f":"OFFSET(Start,$A97,R$1)","v":0},0,0,0,0,0,0,0,0,0,0,0,0,0,0,{"$f":"OFFSET(Start,$A97,AG$1)","v":0},0,0,0,0,0,0,0,0]
[97,{"$f":"OFFSET(Start,'Mellomlagring - antall besøk'!A98,0)","v":0},{"$f":"OFFSET(Start,$A98,C$1)","v":0},0,0,0,0,0,0,0,0,0,0,0,0,0,0,0,{"$f":"OFFSET(Start,$A98,S$1)","v":0},0,0,0,0,0,0,0,0,0,0,0,0,0,0,0,0,0,0,0,0,0,0]
[98,{"$f":"OFFSET(Start,'Mellomlagring - antall besøk'!A99,0)","v":0},0,0,0,0,0,0,0,0,0,0,0,0,0,0,0,0,0,0,0,0,0,0,0,0,0,0,0,0,0,0,0,0,0,0,0,0,0,0,0]
[99,{"$f":"OFFSET(Start,'Mellomlagring - antall besøk'!A100,0)","v":0},0,0,0,0,0,0,0,0,0,0,0,0,0,0,0,0,0,0,0,0,0,0,0,0,0,0,0,0,0,0,0,0,0,0,0,0,0,0,0]
[100,{"$f":"OFFSET(Start,'Mellomlagring - antall besøk'!A101,0)","v":0},0,0,0,0,0,0,0,0,0,0,0,0,0,0,0,0,0,0,0,0,0,0,0,0,0,0,0,0,0,0,0,0,0,0,0,0,0,0,0]
[101,{"$f":"OFFSET(Start,'Mellomlagring - antall besøk'!A102,0)","v":0},0,0,0,0,0,0,0,0,0,0,0,0,0,0,0,0,0,0,0,0,0,0,0,0,0,0,0,0,0,0,0,0,0,0,0,0,0,0,0]
[null,"Sum fornøyd",{"$f":"COUNTIF(C$3:C$102,\"Fornøyd\")","v":0},{"$f":"COUNTIF(D$3:D$102,\"Fornøyd\")","v":1},2,2,2,0,0,0,0,0,0,0,0,0,0,0,0,0,0,0,0,0,0,0,0,0,0,0,0,0,0,0,0,0,0,0]
[null,"Sum nøytral",{"$f":"COUNTIF(C$3:C$102,\"Nøytral\")","v":1},{"$f":"COUNTIF(D$3:D$102,\"Nøytral\")","v":0},0,0,0,0,0,0,0,0,0,0,0,0,0,0,0,0,0,0,0,0,0,0,0,0,0,0,0,0,0,0,0,0,0,0]
[null,"Sum misfornøyd",{"$f":"COUNTIF(C$3:C$102,\"Misfornøyd\")","v":0},{"$f":"COUNTIF(D$3:D$102,\"Misfornøyd\")","v":0},0,0,0,0,0,0,0,0,0,0,0,0,0,0,0,0,0,0,0,0,0,0,0,0,0,0,0,0,0,0,0,0,0,0]

{"sheet":"Spart tid - ungått besøk","index":9,"n_rows":103,"n_cols":39,"rows_kept":103,"cut":false,"hidden":true,"merged":[]}
[null,null,39,{"$f":"C1+3","v":42},{"$f":"D1+3","v":45},48,51,54,57,60,63,66,69,72,75,78,81,84,87,90,93,96,99,102,105,108,111,114,117,120,123,126,129,132,135,138,141,144]
["Nummer","Bruker ID",{"$f":"OFFSET('Månedlig registrering'!$AN$6,0,COLUMN(C:C)*3-9)","v":"2018-01-01"},{"$f":"OFFSET('Månedlig registrering'!$AN$6,0,COLUMN(D:D)*3-9)","v":"2018-02-01"},{"$f":"OFFSET('Månedlig registrering'!$AN$6,0,COLUMN(E:E)*3-9)","v":"2018-03-01"},{"$f":"OFFSET('Månedlig registrering'!$AN$6,0,COLUMN(F:F)*3-9)","v":"2018-04-01"},{"$f":"OFFSET('Månedlig registrering'!$AN$6,0,COLUMN(G:G)*3-9)","v":"2018-05-01"},{"$f":"OFFSET('Månedlig registrering'!$AN$6,0,COLUMN(H:H)*3-9)","v":"2018-06-01"},{"$f":"OFFSET('Månedlig registrering'!$AN$6,0,COLUMN(I:I)*3-9)","v":"2018-07-01"},{"$f":"OFFSET('Månedlig registrering'!$AN$6,0,COLUMN(J:J)*3-9)","v":"2018-08-01"},{"$f":"OFFSET('Månedlig registrering'!$AN$6,0,COLUMN(K:K)*3-9)","v":"2018-09-01"},{"$f":"OFFSET('Månedlig registrering'!$AN$6,0,COLUMN(L:L)*3-9)","v":"2018-10-01"},{"$f":"OFFSET('Månedlig registrering'!$AN$6,0,COLUMN(M:M)*3-9)","v":"2018-11-01"},{"$f":"OFFSET('Månedlig registrering'!$AN$6,0,COLUMN(N:N)*3-9)","v":"2018-12-01"},{"$f":"OFFSET('Månedlig registrering'!$AN$6,0,COLUMN(O:O)*3-9)","v":"2019-01-01"},{"$f":"OFFSET('Månedlig registrering'!$AN$6,0,COLUMN(P:P)*3-9)","v":"2019-02-01"},{"$f":"OFFSET('Månedlig registrering'!$AN$6,0,COLUMN(Q:Q)*3-9)","v":"2019-03-01"},{"$f":"OFFSET('Månedlig registrering'!$AN$6,0,COLUMN(R:R)*3-9)","v":"2019-04-01"},{"$f":"OFFSET('Månedlig registrering'!$AN$6,0,COLUMN(S:S)*3-9)","v":"2019-05-01"},{"$f":"OFFSET('Månedlig registrering'!$AN$6,0,COLUMN(T:T)*3-9)","v":"2019-06-01"},{"$f":"OFFSET('Månedlig registrering'!$AN$6,0,COLUMN(U:U)*3-9)","v":"2019-07-01"},{"$f":"OFFSET('Månedlig registrering'!$AN$6,0,COLUMN(V:V)*3-9)","v":"2019-08-01"},{"$f":"OFFSET('Månedlig registrering'!$AN$6,0,COLUMN(W:W)*3-9)","v":"2019-09-01"},{"$f":"OFFSET('Månedlig registrering'!$AN$6,0,COLUMN(X:X)*3-9)","v":"2019-10-01"},{"$f":"OFFSET('Månedlig registrering'!$AN$6,0,COLUMN(Y:Y)*3-9)","v":"2019-11-01"},{"$f":"OFFSET('Månedlig registrering'!$AN$6,0,COLUMN(Z:Z)*3-9)","v":"2019-12-01"},{"$f":"OFFSET('Månedlig registrering'!$AN$6,0,COLUMN(AA:AA)*3-9)","v":"2020-01-01"},{"$f":"OFFSET('Månedlig registrering'!$AN$6,0,COLUMN(AB:AB)*3-9)","v":"2020-02-01"},{"$f":"OFFSET('Månedlig registrering'!$AN$6,0,COLUMN(AC:AC)*3-9)","v":"2020-03-01"},{"$f":"OFFSET('Månedlig registrering'!$AN$6,0,COLUMN(AD:AD)*3-9)","v":"2020-04-01"},{"$f":"OFFSET('Månedlig registrering'!$AN$6,0,COLUMN(AE:AE)*3-9)","v":"2020-05-01"},{"$f":"OFFSET('Månedlig registrering'!$AN$6,0,COLUMN(AF:AF)*3-9)","v":"2020-06-01"},{"$f":"OFFSET('Månedlig registrering'!$AN$6,0,COLUMN(AG:AG)*3-9)","v":"2020-07-01"},{"$f":"OFFSET('Månedlig registrering'!$AN$6,0,COLUMN(AH:AH)*3-9)","v":"2020-08-01"},{"$f":"OFFSET('Månedlig registrering'!$AN$6,0,COLUMN(AI:AI)*3-9)","v":"2020-09-01"},{"$f":"OFFSET('Månedlig registrering'!$AN$6,0,COLUMN(AJ:AJ)*3-9)","v":"2020-10-01"},{"$f":"OFFSET('Månedlig registrering'!$AN$6,0,COLUMN(AK:AK)*3-9)","v":"2020-11-01"},{"$f":"OFFSET('Månedlig registrering'!$AN$6,0,COLUMN(AL:AL)*3-9)","v":"2020-12-01"},"SUM TIMER"]
[2,{"$f":"OFFSET(Start,'Mellomlagring - antall besøk'!A3,0)","v":1001},{"$f":"IF(TODAY()-C$2>0,(OFFSET(Start,$A3,5)*OFFSET(Start,$A3,7)-OFFSET(Start,$A3,6)*(OFFSET(Start,$A3,C$1)))/60,0)","v":0},{"$f":"IF(TODAY()-D$2>0,(OFFSET(Start,$A3,5)*OFFSET(Start,$A3,7)-OFFSET(Start,$A3,6)*(OFFSET(Start,$A3,D$1)))/60,0)","v":40},40,40,40,45,0,0,0,0,{"$f":"IF(TODAY()-M$2>0,(OFFSET(Start,$A3,5)*OFFSET(Start,$A3,7)-OFFSET(Start,$A3,6)*(OFFSET(Start,$A3,M$1)))/60,0)","v":0},0,0,0,0,0,0,0,0,0,{"$f":"IF(TODAY()-W$2>0,(OFFSET(Start,$A3,5)*OFFSET(Start,$A3,7)-OFFSET(Start,$A3,6)*(OFFSET(Start,$A3,W$1)))/60,0)","v":0},0,0,0,0,0,0,0,0,0,{"$f":"IF(TODAY()-AG$2>0,(OFFSET(Start,$A3,5)*OFFSET(Start,$A3,7)-OFFSET(Start,$A3,6)*(OFFSET(Start,$A3,AG$1)))/60,0)","v":0},0,0,0,0,0,{"$f":"SUM(C3:AL3)","v":205}]
[{"$f":"+A3+1","v":3},{"$f":"OFFSET(Start,'Mellomlagring - antall besøk'!A4,0)","v":1002},5,5,-5,4.333333333333333,4.333333333333333,5,0,0,0,0,0,0,0,0,0,0,0,0,0,0,0,0,0,0,0,0,0,0,0,0,0,0,0,0,0,0,{"$f":"SUM(C4:AL4)","v":18.666666666666664}]
[{"$f":"+A4+1","v":4},{"$f":"OFFSET(Start,'Mellomlagring - antall besøk'!A5,0)","v":1003},0,0,0,0,0,0,0,0,0,0,0,0,0,0,0,0,0,0,0,0,0,0,0,0,0,0,0,0,0,0,0,0,0,0,0,0,0]
[5,{"$f":"OFFSET(Start,'Mellomlagring - antall besøk'!A6,0)","v":0},0,0,0,0,0,0,0,0,0,0,0,0,0,0,0,0,0,0,0,0,0,0,0,0,0,0,0,0,0,0,0,0,0,0,0,0,0]
[6,{"$f":"OFFSET(Start,'Mellomlagring - antall besøk'!A7,0)","v":0},0,0,0,0,0,0,0,0,0,0,0,0,0,0,0,0,0,0,0,0,0,0,0,0,0,0,0,0,0,0,0,0,0,0,0,0,0]
[7,{"$f":"OFFSET(Start,'Mellomlagring - antall besøk'!A8,0)","v":0},0,0,0,0,0,0,0,0,0,0,0,0,0,0,0,0,0,0,0,0,0,0,0,0,0,0,0,0,0,0,0,0,0,0,0,0,0]
[8,{"$f":"OFFSET(Start,'Mellomlagring - antall besøk'!A9,0)","v":0},0,0,0,0,0,0,0,0,0,0,0,0,0,0,0,0,0,0,0,0,0,0,0,0,0,0,0,0,0,0,0,0,0,0,0,0,0]
[9,{"$f":"OFFSET(Start,'Mellomlagring - antall besøk'!A10,0)","v":0},0,0,0,0,0,0,0,0,0,0,0,0,0,0,0,0,0,0,0,0,0,0,0,0,0,0,0,0,0,0,0,0,0,0,0,0,0]
[10,{"$f":"OFFSET(Start,'Mellomlagring - antall besøk'!A11,0)","v":0},0,0,0,0,0,0,0,0,0,0,0,0,0,0,0,0,0,0,0,0,0,0,0,0,0,0,0,0,0,0,0,0,0,0,0,0,0]
[11,{"$f":"OFFSET(Start,'Mellomlagring - antall besøk'!A12,0)","v":0},0,0,0,0,0,0,0,0,0,0,0,0,0,0,0,0,0,0,0,0,0,0,0,0,0,0,0,0,0,0,0,0,0,0,0,0,0]
[12,{"$f":"OFFSET(Start,'Mellomlagring - antall besøk'!A13,0)","v":0},{"$f":"IF(TODAY()-C$2>0,(OFFSET(Start,$A13,5)*OFFSET(Start,$A13,7)-OFFSET(Start,$A13,6)*(OFFSET(Start,$A13,C$1)))/60,0)","v":0},0,0,0,0,0,0,0,0,0,{"$f":"IF(TODAY()-M$2>0,(OFFSET(Start,$A13,5)*OFFSET(Start,$A13,7)-OFFSET(Start,$A13,6)*(OFFSET(Start,$A13,M$1)))/60,0)","v":0},0,0,0,0,0,0,0,0,0,{"$f":"IF(TODAY()-W$2>0,(OFFSET(Start,$A13,5)*OFFSET(Start,$A13,7)-OFFSET(Start,$A13,6)*(OFFSET(Start,$A13,W$1)))/60,0)","v":0},0,0,0,0,0,0,0,0,0,{"$f":"IF(TODAY()-AG$2>0,(OFFSET(Start,$A13,5)*OFFSET(Start,$A13,7)-OFFSET(Start,$A13,6)*(OFFSET(Start,$A13,AG$1)))/60,0)","v":0},0,0,0,0,0,0]
[13,{"$f":"OFFSET(Start,'Mellomlagring - antall besøk'!A14,0)","v":0},0,0,0,0,0,0,0,0,0,0,0,0,0,0,0,0,0,0,0,0,0,0,0,0,0,0,0,0,0,0,0,0,0,0,0,0,0]
[14,{"$f":"OFFSET(Start,'Mellomlagring - antall besøk'!A15,0)","v":0},0,0,0,0,0,0,0,0,0,0,0,0,0,0,0,0,0,0,0,0,0,0,0,0,0,0,0,0,0,0,0,0,0,0,0,0,0]
[15,{"$f":"OFFSET(Start,'Mellomlagring - antall besøk'!A16,0)","v":0},0,0,0,0,0,0,0,0,0,0,0,0,0,0,0,0,0,0,0,0,0,0,0,0,0,0,0,0,0,0,0,0,0,0,0,0,0]
[16,{"$f":"OFFSET(Start,'Mellomlagring - antall besøk'!A17,0)","v":0},0,0,0,0,0,0,0,0,0,0,0,0,0,0,0,0,0,0,0,0,0,0,0,0,0,0,0,0,0,0,0,0,0,0,0,0,0]
[17,{"$f":"OFFSET(Start,'Mellomlagring - antall besøk'!A18,0)","v":0},0,0,0,0,0,0,0,0,0,0,0,0,0,0,0,0,0,0,0,0,0,0,0,0,0,0,0,0,0,0,0,0,0,0,0,0,0]
[18,{"$f":"OFFSET(Start,'Mellomlagring - antall besøk'!A19,0)","v":0},0,0,0,0,0,0,0,0,0,0,0,0,0,0,0,0,0,0,0,0,0,0,0,0,0,0,0,0,0,0,0,0,0,0,0,0,0]
[19,{"$f":"OFFSET(Start,'Mellomlagring - antall besøk'!A20,0)","v":0},0,0,0,0,0,0,0,0,0,0,0,0,0,0,0,0,0,0,0,0,0,0,0,0,0,0,0,0,0,0,0,0,0,0,0,0,0]
[20,{"$f":"OFFSET(Start,'Mellomlagring - antall besøk'!A21,0)","v":0},0,0,0,0,0,0,0,0,0,0,0,0,0,0,0,0,0,0,0,0,0,0,0,0,0,0,0,0,0,0,0,0,0,0,0,0,0]
[21,{"$f":"OFFSET(Start,'Mellomlagring - antall besøk'!A22,0)","v":0},0,0,0,0,0,0,0,0,0,0,0,0,0,0,0,0,0,0,0,0,0,0,0,0,0,0,0,0,0,0,0,0,0,0,0,0,0]
[22,{"$f":"OFFSET(Start,'Mellomlagring - antall besøk'!A23,0)","v":0},{"$f":"IF(TODAY()-C$2>0,(OFFSET(Start,$A23,5)*OFFSET(Start,$A23,7)-OFFSET(Start,$A23,6)*(OFFSET(Start,$A23,C$1)))/60,0)","v":0},0,0,0,0,0,0,0,0,0,{"$f":"IF(TODAY()-M$2>0,(OFFSET(Start,$A23,5)*OFFSET(Start,$A23,7)-OFFSET(Start,$A23,6)*(OFFSET(Start,$A23,M$1)))/60,0)","v":0},0,0,0,0,0,0,0,0,0,{"$f":"IF(TODAY()-W$2>0,(OFFSET(Start,$A23,5)*OFFSET(Start,$A23,7)-OFFSET(Start,$A23,6)*(OFFSET(Start,$A23,W$1)))/60,0)","v":0},0,0,0,0,0,0,0,0,0,{"$f":"IF(TODAY()-AG$2>0,(OFFSET(Start,$A23,5)*OFFSET(Start,$A23,7)-OFFSET(Start,$A23,6)*(OFFSET(Start,$A23,AG$1)))/60,0)","v":0},0,0,0,0,0,0]
[23,{"$f":"OFFSET(Start,'Mellomlagring - antall besøk'!A24,0)","v":0},0,0,0,0,0,0,0,0,0,0,0,0,0,0,0,0,0,0,0,0,0,0,0,0,0,0,0,0,0,0,0,0,0,0,0,0,0]
[24,{"$f":"OFFSET(Start,'Mellomlagring - antall besøk'!A25,0)","v":0},0,0,0,0,0,0,0,0,0,0,0,0,0,0,0,0,0,0,0,0,0,0,0,0,0,0,0,0,0,0,0,0,0,0,0,0,0]
[25,{"$f":"OFFSET(Start,'Mellomlagring - antall besøk'!A26,0)","v":0},0,0,0,0,0,0,0,0,0,0,0,0,0,0,0,0,0,0,0,0,0,0,0,0,0,0,0,0,0,0,0,0,0,0,0,0,0]
[26,{"$f":"OFFSET(Start,'Mellomlagring - antall besøk'!A27,0)","v":0},0,0,0,0,0,0,0,0,0,0,0,0,0,0,0,0,0,0,0,0,0,0,0,0,0,0,0,0,0,0,0,0,0,0,0,0,0]
[27,{"$f":"OFFSET(Start,'Mellomlagring - antall besøk'!A28,0)","v":0},0,0,0,0,0,0,0,0,0,0,0,0,0,0,0,0,0,0,0,0,0,0,0,0,0,0,0,0,0,0,0,0,0,0,0,0,0]
[28,{"$f":"OFFSET(Start,'Mellomlagring - antall besøk'!A29,0)","v":0},0,0,0,0,0,0,0,0,0,0,0,0,0,0,0,0,0,0,0,0,0,0,0,0,0,0,0,0,0,0,0,0,0,0,0,0,0]
[29,{"$f":"OFFSET(Start,'Mellomlagring - antall besøk'!A30,0)","v":0},0,0,0,0,0,0,0,0,0,0,0,0,0,0,0,0,0,0,0,0,0,0,0,0,0,0,0,0,0,0,0,0,0,0,0,0,0]
[30,{"$f":"OFFSET(Start,'Mellomlagring - antall besøk'!A31,0)","v":0},0,0,0,0,0,0,0,0,0,0,0,0,0,0,0,0,0,0,0,0,0,0,0,0,0,0,0,0,0,0,0,0,0,0,0,0,0]
[31,{"$f":"OFFSET(Start,'Mellomlagring - antall besøk'!A32,0)","v":0},0,0,0,0,0,0,0,0,0,0,0,0,0,0,0,0,0,0,0,0,0,0,0,0,0,0,0,0,0,0,0,0,0,0,0,0,0]
[32,{"$f":"OFFSET(Start,'Mellomlagring - antall besøk'!A33,0)","v":0},{"$f":"IF(TODAY()-C$2>0,(OFFSET(Start,$A33,5)*OFFSET(Start,$A33,7)-OFFSET(Start,$A33,6)*(OFFSET(Start,$A33,C$1)))/60,0)","v":0},0,0,0,0,0,0,0,0,0,{"$f":"IF(TODAY()-M$2>0,(OFFSET(Start,$A33,5)*OFFSET(Start,$A33,7)-OFFSET(Start,$A33,6)*(OFFSET(Start,$A33,M$1)))/60,0)","v":0},0,0,0,0,0,0,0,0,0,{"$f":"IF(TODAY()-W$2>0,(OFFSET(Start,$A33,5)*OFFSET(Start,$A33,7)-OFFSET(Start,$A33,6)*(OFFSET(Start,$A33,W$1)))/60,0)","v":0},0,0,0,0,0,0,0,0,0,{"$f":"IF(TODAY()-AG$2>0,(OFFSET(Start,$A33,5)*OFFSET(Start,$A33,7)-OFFSET(Start,$A33,6)*(OFFSET(Start,$A33,AG$1)))/60,0)","v":0},0,0,0,0,0,0]
[33,{"$f":"OFFSET(Start,'Mellomlagring - antall besøk'!A34,0)","v":0},0,0,0,0,0,0,0,0,0,0,0,0,0,0,0,0,0,0,0,0,0,0,0,0,0,0,0,0,0,0,0,0,0,0,0,0,0]
[34,{"$f":"OFFSET(Start,'Mellomlagring - antall besøk'!A35,0)","v":0},0,0,0,0,0,0,0,0,0,0,0,0,0,0,0,0,0,0,0,0,0,0,0,0,0,0,0,0,0,0,0,0,0,0,0,0,0]
[35,{"$f":"OFFSET(Start,'Mellomlagring - antall besøk'!A36,0)","v":0},0,0,0,0,0,0,0,0,0,0,0,0,0,0,0,0,0,0,0,0,0,0,0,0,0,0,0,0,0,0,0,0,0,0,0,0,0]
[36,{"$f":"OFFSET(Start,'Mellomlagring - antall besøk'!A37,0)","v":0},0,0,0,0,0,0,0,0,0,0,0,0,0,0,0,0,0,0,0,0,0,0,0,0,0,0,0,0,0,0,0,0,0,0,0,0,0]
[37,{"$f":"OFFSET(Start,'Mellomlagring - antall besøk'!A38,0)","v":0},0,0,0,0,0,0,0,0,0,0,0,0,0,0,0,0,0,0,0,0,0,0,0,0,0,0,0,0,0,0,0,0,0,0,0,0,0]
[38,{"$f":"OFFSET(Start,'Mellomlagring - antall besøk'!A39,0)","v":0},0,0,0,0,0,0,0,0,0,0,0,0,0,0,0,0,0,0,0,0,0,0,0,0,0,0,0,0,0,0,0,0,0,0,0,0,0]
[39,{"$f":"OFFSET(Start,'Mellomlagring - antall besøk'!A40,0)","v":0},0,0,0,0,0,0,0,0,0,0,0,0,0,0,0,0,0,0,0,0,0,0,0,0,0,0,0,0,0,0,0,0,0,0,0,0,0]
[40,{"$f":"OFFSET(Start,'Mellomlagring - antall besøk'!A41,0)","v":0},0,0,0,0,0,0,0,0,0,0,0,0,0,0,0,0,0,0,0,0,0,0,0,0,0,0,0,0,0,0,0,0,0,0,0,0,0]
[41,{"$f":"OFFSET(Start,'Mellomlagring - antall besøk'!A42,0)","v":0},0,0,0,0,0,0,0,0,0,0,0,0,0,0,0,0,0,0,0,0,0,0,0,0,0,0,0,0,0,0,0,0,0,0,0,0,0]
[42,{"$f":"OFFSET(Start,'Mellomlagring - antall besøk'!A43,0)","v":0},{"$f":"IF(TODAY()-C$2>0,(OFFSET(Start,$A43,5)*OFFSET(Start,$A43,7)-OFFSET(Start,$A43,6)*(OFFSET(Start,$A43,C$1)))/60,0)","v":0},0,0,0,0,0,0,0,0,0,{"$f":"IF(TODAY()-M$2>0,(OFFSET(Start,$A43,5)*OFFSET(Start,$A43,7)-OFFSET(Start,$A43,6)*(OFFSET(Start,$A43,M$1)))/60,0)","v":0},0,0,0,0,0,0,0,0,0,{"$f":"IF(TODAY()-W$2>0,(OFFSET(Start,$A43,5)*OFFSET(Start,$A43,7)-OFFSET(Start,$A43,6)*(OFFSET(Start,$A43,W$1)))/60,0)","v":0},0,0,0,0,0,0,0,0,0,{"$f":"IF(TODAY()-AG$2>0,(OFFSET(Start,$A43,5)*OFFSET(Start,$A43,7)-OFFSET(Start,$A43,6)*(OFFSET(Start,$A43,AG$1)))/60,0)","v":0},0,0,0,0,0,0]
[43,{"$f":"OFFSET(Start,'Mellomlagring - antall besøk'!A44,0)","v":0},0,0,0,0,0,0,0,0,0,0,0,0,0,0,0,0,0,0,0,0,0,0,0,0,0,0,0,0,0,0,0,0,0,0,0,0,0]
[44,{"$f":"OFFSET(Start,'Mellomlagring - antall besøk'!A45,0)","v":0},0,0,0,0,0,0,0,0,0,0,0,0,0,0,0,0,0,0,0,0,0,0,0,0,0,0,0,0,0,0,0,0,0,0,0,0,0]
[45,{"$f":"OFFSET(Start,'Mellomlagring - antall besøk'!A46,0)","v":0},0,0,0,0,0,0,0,0,0,0,0,0,0,0,0,0,0,0,0,0,0,0,0,0,0,0,0,0,0,0,0,0,0,0,0,0,0]
[46,{"$f":"OFFSET(Start,'Mellomlagring - antall besøk'!A47,0)","v":0},0,0,0,0,0,0,0,0,0,0,0,0,0,0,0,0,0,0,0,0,0,0,0,0,0,0,0,0,0,0,0,0,0,0,0,0,0]
[47,{"$f":"OFFSET(Start,'Mellomlagring - antall besøk'!A48,0)","v":0},0,0,0,0,0,0,0,0,0,0,0,0,0,0,0,0,0,0,0,0,0,0,0,0,0,0,0,0,0,0,0,0,0,0,0,0,0]
[48,{"$f":"OFFSET(Start,'Mellomlagring - antall besøk'!A49,0)","v":0},0,0,0,0,0,0,0,0,0,0,0,0,0,0,0,0,0,0,0,0,0,0,0,0,0,0,0,0,0,0,0,0,0,0,0,0,0]
[49,{"$f":"OFFSET(Start,'Mellomlagring - antall besøk'!A50,0)","v":0},0,0,0,0,0,0,0,0,0,0,0,0,0,0,0,0,0,0,0,0,0,0,0,0,0,0,0,0,0,0,0,0,0,0,0,0,0]
[50,{"$f":"OFFSET(Start,'Mellomlagring - antall besøk'!A51,0)","v":0},0,0,0,0,0,0,0,0,0,0,0,0,0,0,0,0,0,0,0,0,0,0,0,0,0,0,0,0,0,0,0,0,0,0,0,0,0]
[51,{"$f":"OFFSET(Start,'Mellomlagring - antall besøk'!A52,0)","v":0},0,0,0,0,0,0,0,0,0,0,0,0,0,0,0,0,0,0,0,0,0,0,0,0,0,0,0,0,0,0,0,0,0,0,0,0,0]
[52,{"$f":"OFFSET(Start,'Mellomlagring - antall besøk'!A53,0)","v":0},{"$f":"IF(TODAY()-C$2>0,(OFFSET(Start,$A53,5)*OFFSET(Start,$A53,7)-OFFSET(Start,$A53,6)*(OFFSET(Start,$A53,C$1)))/60,0)","v":0},0,0,0,0,0,0,0,0,0,{"$f":"IF(TODAY()-M$2>0,(OFFSET(Start,$A53,5)*OFFSET(Start,$A53,7)-OFFSET(Start,$A53,6)*(OFFSET(Start,$A53,M$1)))/60,0)","v":0},0,0,0,0,0,0,0,0,0,{"$f":"IF(TODAY()-W$2>0,(OFFSET(Start,$A53,5)*OFFSET(Start,$A53,7)-OFFSET(Start,$A53,6)*(OFFSET(Start,$A53,W$1)))/60,0)","v":0},0,0,0,0,0,0,0,0,0,{"$f":"IF(TODAY()-AG$2>0,(OFFSET(Start,$A53,5)*OFFSET(Start,$A53,7)-OFFSET(Start,$A53,6)*(OFFSET(Start,$A53,AG$1)))/60,0)","v":0},0,0,0,0,0,0]
[53,{"$f":"OFFSET(Start,'Mellomlagring - antall besøk'!A54,0)","v":0},0,0,0,0,0,0,0,0,0,0,0,0,0,0,0,0,0,0,0,0,0,0,0,0,0,0,0,0,0,0,0,0,0,0,0,0,0]
[54,{"$f":"OFFSET(Start,'Mellomlagring - antall besøk'!A55,0)","v":0},0,0,0,0,0,0,0,0,0,0,0,0,0,0,0,0,0,0,0,0,0,0,0,0,0,0,0,0,0,0,0,0,0,0,0,0,0]
[55,{"$f":"OFFSET(Start,'Mellomlagring - antall besøk'!A56,0)","v":0},0,0,0,0,0,0,0,0,0,0,0,0,0,0,0,0,0,0,0,0,0,0,0,0,0,0,0,0,0,0,0,0,0,0,0,0,0]
[56,{"$f":"OFFSET(Start,'Mellomlagring - antall besøk'!A57,0)","v":0},0,0,0,0,0,0,0,0,0,0,0,0,0,0,0,0,0,0,0,0,0,0,0,0,0,0,0,0,0,0,0,0,0,0,0,0,0]
[57,{"$f":"OFFSET(Start,'Mellomlagring - antall besøk'!A58,0)","v":0},0,0,0,0,0,0,0,0,0,0,0,0,0,0,0,0,0,0,0,0,0,0,0,0,0,0,0,0,0,0,0,0,0,0,0,0,0]
[58,{"$f":"OFFSET(Start,'Mellomlagring - antall besøk'!A59,0)","v":0},0,0,0,0,0,0,0,0,0,0,0,0,0,0,0,0,0,0,0,0,0,0,0,0,0,0,0,0,0,0,0,0,0,0,0,0,0]
[59,{"$f":"OFFSET(Start,'Mellomlagring - antall besøk'!A60,0)","v":0},0,0,0,0,0,0,0,0,0,0,0,0,0,0,0,0,0,0,0,0,0,0,0,0,0,0,0,0,0,0,0,0,0,0,0,0,0]
[60,{"$f":"OFFSET(Start,'Mellomlagring - antall besøk'!A61,0)","v":0},0,0,0,0,0,0,0,0,0,0,0,0,0,0,0,0,0,0,0,0,0,0,0,0,0,0,0,0,0,0,0,0,0,0,0,0,0]
[61,{"$f":"OFFSET(Start,'Mellomlagring - antall besøk'!A62,0)","v":0},0,0,0,0,0,0,0,0,0,0,0,0,0,0,0,0,0,0,0,0,0,0,0,0,0,0,0,0,0,0,0,0,0,0,0,0,0]
[62,{"$f":"OFFSET(Start,'Mellomlagring - antall besøk'!A63,0)","v":0},{"$f":"IF(TODAY()-C$2>0,(OFFSET(Start,$A63,5)*OFFSET(Start,$A63,7)-OFFSET(Start,$A63,6)*(OFFSET(Start,$A63,C$1)))/60,0)","v":0},0,0,0,0,0,0,0,0,0,{"$f":"IF(TODAY()-M$2>0,(OFFSET(Start,$A63,5)*OFFSET(Start,$A63,7)-OFFSET(Start,$A63,6)*(OFFSET(Start,$A63,M$1)))/60,0)","v":0},0,0,0,0,0,0,0,0,0,{"$f":"IF(TODAY()-W$2>0,(OFFSET(Start,$A63,5)*OFFSET(Start,$A63,7)-OFFSET(Start,$A63,6)*(OFFSET(Start,$A63,W$1)))/60,0)","v":0},0,0,0,0,0,0,0,0,0,{"$f":"IF(TODAY()-AG$2>0,(OFFSET(Start,$A63,5)*OFFSET(Start,$A63,7)-OFFSET(Start,$A63,6)*(OFFSET(Start,$A63,AG$1)))/60,0)","v":0},0,0,0,0,0,0]
[63,{"$f":"OFFSET(Start,'Mellomlagring - antall besøk'!A64,0)","v":0},0,0,0,0,0,0,0,0,0,0,0,0,0,0,0,0,0,0,0,0,0,0,0,0,0,0,0,0,0,0,0,0,0,0,0,0,0]
[64,{"$f":"OFFSET(Start,'Mellomlagring - antall besøk'!A65,0)","v":0},0,0,0,0,0,0,0,0,0,0,0,0,0,0,0,0,0,0,0,0,0,0,0,0,0,0,0,0,0,0,0,0,0,0,0,0,0]
[65,{"$f":"OFFSET(Start,'Mellomlagring - antall besøk'!A66,0)","v":0},0,0,0,0,0,0,0,0,0,0,0,0,0,0,0,0,0,0,0,0,0,0,0,0,0,0,0,0,0,0,0,0,0,0,0,0,0]
[66,{"$f":"OFFSET(Start,'Mellomlagring - antall besøk'!A67,0)","v":0},0,0,0,0,0,0,0,0,0,0,0,0,0,0,0,0,0,0,0,0,0,0,0,0,0,0,0,0,0,0,0,0,0,0,0,0,0]
[67,{"$f":"OFFSET(Start,'Mellomlagring - antall besøk'!A68,0)","v":0},0,0,0,0,0,0,0,0,0,0,0,0,0,0,0,0,0,0,0,0,0,0,0,0,0,0,0,0,0,0,0,0,0,0,0,0,{"$f":"SUM(C68:AL68)","v":0}]
[{"$f":"+A68+1","v":68},{"$f":"OFFSET(Start,'Mellomlagring - antall besøk'!A69,0)","v":0},0,0,0,0,0,0,0,0,0,0,0,0,0,0,0,0,0,0,0,0,0,0,0,0,0,0,0,0,0,0,0,0,0,0,0,0,0]
[69,{"$f":"OFFSET(Start,'Mellomlagring - antall besøk'!A70,0)","v":0},0,0,0,0,0,0,0,0,0,0,0,0,0,0,0,0,0,0,0,0,0,0,0,0,0,0,0,0,0,0,0,0,0,0,0,0,0]
[70,{"$f":"OFFSET(Start,'Mellomlagring - antall besøk'!A71,0)","v":0},0,0,0,0,0,0,0,0,0,0,0,0,0,0,0,0,0,0,0,0,0,0,0,0,0,0,0,0,0,0,0,0,0,0,0,0,0]
[71,{"$f":"OFFSET(Start,'Mellomlagring - antall besøk'!A72,0)","v":0},0,0,0,0,0,0,0,0,0,0,0,0,0,0,0,0,0,0,0,0,0,0,0,0,0,0,0,0,0,0,0,0,0,0,0,0,0]
[72,{"$f":"OFFSET(Start,'Mellomlagring - antall besøk'!A73,0)","v":0},{"$f":"IF(TODAY()-C$2>0,(OFFSET(Start,$A73,5)*OFFSET(Start,$A73,7)-OFFSET(Start,$A73,6)*(OFFSET(Start,$A73,C$1)))/60,0)","v":0},0,0,0,0,0,0,0,0,0,{"$f":"IF(TODAY()-M$2>0,(OFFSET(Start,$A73,5)*OFFSET(Start,$A73,7)-OFFSET(Start,$A73,6)*(OFFSET(Start,$A73,M$1)))/60,0)","v":0},0,0,0,0,0,0,0,0,0,{"$f":"IF(TODAY()-W$2>0,(OFFSET(Start,$A73,5)*OFFSET(Start,$A73,7)-OFFSET(Start,$A73,6)*(OFFSET(Start,$A73,W$1)))/60,0)","v":0},0,0,0,0,0,0,0,0,0,{"$f":"IF(TODAY()-AG$2>0,(OFFSET(Start,$A73,5)*OFFSET(Start,$A73,7)-OFFSET(Start,$A73,6)*(OFFSET(Start,$A73,AG$1)))/60,0)","v":0},0,0,0,0,0,0]
[73,{"$f":"OFFSET(Start,'Mellomlagring - antall besøk'!A74,0)","v":0},0,0,0,0,0,0,0,0,0,0,0,0,0,0,0,0,0,0,0,0,0,0,0,0,0,0,0,0,0,0,0,0,0,0,0,0,0]
[74,{"$f":"OFFSET(Start,'Mellomlagring - antall besøk'!A75,0)","v":0},0,0,0,0,0,0,0,0,0,0,0,0,0,0,0,0,0,0,0,0,0,0,0,0,0,0,0,0,0,0,0,0,0,0,0,0,0]
[75,{"$f":"OFFSET(Start,'Mellomlagring - antall besøk'!A76,0)","v":0},0,0,0,0,0,0,0,0,0,0,0,0,0,0,0,0,0,0,0,0,0,0,0,0,0,0,0,0,0,0,0,0,0,0,0,0,0]
[76,{"$f":"OFFSET(Start,'Mellomlagring - antall besøk'!A77,0)","v":0},0,0,0,0,0,0,0,0,0,0,0,0,0,0,0,0,0,0,0,0,0,0,0,0,0,0,0,0,0,0,0,0,0,0,0,0,0]
[77,{"$f":"OFFSET(Start,'Mellomlagring - antall besøk'!A78,0)","v":0},0,0,0,0,0,0,0,0,0,0,0,0,0,0,0,0,0,0,0,0,0,0,0,0,0,0,0,0,0,0,0,0,0,0,0,0,0]
[78,{"$f":"OFFSET(Start,'Mellomlagring - antall besøk'!A79,0)","v":0},0,0,0,0,0,0,0,0,0,0,0,0,0,0,0,0,0,0,0,0,0,0,0,0,0,0,0,0,0,0,0,0,0,0,0,0,0]
[79,{"$f":"OFFSET(Start,'Mellomlagring - antall besøk'!A80,0)","v":0},0,0,0,0,0,0,0,0,0,0,0,0,0,0,0,0,0,0,0,0,0,0,0,0,0,0,0,0,0,0,0,0,0,0,0,0,0]
[80,{"$f":"OFFSET(Start,'Mellomlagring - antall besøk'!A81,0)","v":0},0,0,0,0,0,0,0,0,0,0,0,0,0,0,0,0,0,0,0,0,0,0,0,0,0,0,0,0,0,0,0,0,0,0,0,0,0]
[81,{"$f":"OFFSET(Start,'Mellomlagring - antall besøk'!A82,0)","v":0},0,0,0,0,0,0,0,0,0,0,0,0,0,0,0,0,0,0,0,0,0,0,0,0,0,0,0,0,0,0,0,0,0,0,0,0,0]
[82,{"$f":"OFFSET(Start,'Mellomlagring - antall besøk'!A83,0)","v":0},{"$f":"IF(TODAY()-C$2>0,(OFFSET(Start,$A83,5)*OFFSET(Start,$A83,7)-OFFSET(Start,$A83,6)*(OFFSET(Start,$A83,C$1)))/60,0)","v":0},0,0,0,0,0,0,0,0,0,{"$f":"IF(TODAY()-M$2>0,(OFFSET(Start,$A83,5)*OFFSET(Start,$A83,7)-OFFSET(Start,$A83,6)*(OFFSET(Start,$A83,M$1)))/60,0)","v":0},0,0,0,0,0,0,0,0,0,{"$f":"IF(TODAY()-W$2>0,(OFFSET(Start,$A83,5)*OFFSET(Start,$A83,7)-OFFSET(Start,$A83,6)*(OFFSET(Start,$A83,W$1)))/60,0)","v":0},0,0,0,0,0,0,0,0,0,{"$f":"IF(TODAY()-AG$2>0,(OFFSET(Start,$A83,5)*OFFSET(Start,$A83,7)-OFFSET(Start,$A83,6)*(OFFSET(Start,$A83,AG$1)))/60,0)","v":0},0,0,0,0,0,0]
[83,{"$f":"OFFSET(Start,'Mellomlagring - antall besøk'!A84,0)","v":0},0,0,0,0,0,0,0,0,0,0,0,0,0,0,0,0,0,0,0,0,0,0,0,0,0,0,0,0,0,0,0,0,0,0,0,0,0]
[84,{"$f":"OFFSET(Start,'Mellomlagring - antall besøk'!A85,0)","v":0},0,0,0,0,0,0,0,0,0,0,0,0,0,0,0,0,0,0,0,0,0,0,0,0,0,0,0,0,0,0,0,0,0,0,0,0,0]
[85,{"$f":"OFFSET(Start,'Mellomlagring - antall besøk'!A86,0)","v":0},0,0,0,0,0,0,0,0,0,0,0,0,0,0,0,0,0,0,0,0,0,0,0,0,0,0,0,0,0,0,0,0,0,0,0,0,0]
[86,{"$f":"OFFSET(Start,'Mellomlagring - antall besøk'!A87,0)","v":0},0,0,0,0,0,0,0,0,0,0,0,0,0,0,0,0,0,0,0,0,0,0,0,0,0,0,0,0,0,0,0,0,0,0,0,0,0]
[87,{"$f":"OFFSET(Start,'Mellomlagring - antall besøk'!A88,0)","v":0},0,0,0,0,0,0,0,0,0,0,0,0,0,0,0,0,0,0,0,0,0,0,0,0,0,0,0,0,0,0,0,0,0,0,0,0,0]
[88,{"$f":"OFFSET(Start,'Mellomlagring - antall besøk'!A89,0)","v":0},0,0,0,0,0,0,0,0,0,0,0,0,0,0,0,0,0,0,0,0,0,0,0,0,0,0,0,0,0,0,0,0,0,0,0,0,0]
[89,{"$f":"OFFSET(Start,'Mellomlagring - antall besøk'!A90,0)","v":0},0,0,0,0,0,0,0,0,0,0,0,0,0,0,0,0,0,0,0,0,0,0,0,0,0,0,0,0,0,0,0,0,0,0,0,0,0]
[90,{"$f":"OFFSET(Start,'Mellomlagring - antall besøk'!A91,0)","v":0},0,0,0,0,0,0,0,0,0,0,0,0,0,0,0,0,0,0,0,0,0,0,0,0,0,0,0,0,0,0,0,0,0,0,0,0,0]
[91,{"$f":"OFFSET(Start,'Mellomlagring - antall besøk'!A92,0)","v":0},0,0,0,0,0,0,0,0,0,0,0,0,0,0,0,0,0,0,0,0,0,0,0,0,0,0,0,0,0,0,0,0,0,0,0,0,0]
[92,{"$f":"OFFSET(Start,'Mellomlagring - antall besøk'!A93,0)","v":0},{"$f":"IF(TODAY()-C$2>0,(OFFSET(Start,$A93,5)*OFFSET(Start,$A93,7)-OFFSET(Start,$A93,6)*(OFFSET(Start,$A93,C$1)))/60,0)","v":0},0,0,0,0,0,0,0,0,0,{"$f":"IF(TODAY()-M$2>0,(OFFSET(Start,$A93,5)*OFFSET(Start,$A93,7)-OFFSET(Start,$A93,6)*(OFFSET(Start,$A93,M$1)))/60,0)","v":0},0,0,0,0,0,0,0,0,0,{"$f":"IF(TODAY()-W$2>0,(OFFSET(Start,$A93,5)*OFFSET(Start,$A93,7)-OFFSET(Start,$A93,6)*(OFFSET(Start,$A93,W$1)))/60,0)","v":0},0,0,0,0,0,0,0,0,0,{"$f":"IF(TODAY()-AG$2>0,(OFFSET(Start,$A93,5)*OFFSET(Start,$A93,7)-OFFSET(Start,$A93,6)*(OFFSET(Start,$A93,AG$1)))/60,0)","v":0},0,0,0,0,0,0]
[93,{"$f":"OFFSET(Start,'Mellomlagring - antall besøk'!A94,0)","v":0},0,0,0,0,0,0,0,0,0,0,0,0,0,0,0,0,0,0,0,0,0,0,0,0,0,0,0,0,0,0,0,0,0,0,0,0,0]
[94,{"$f":"OFFSET(Start,'Mellomlagring - antall besøk'!A95,0)","v":0},0,0,0,0,0,0,0,0,0,0,0,0,0,0,0,0,0,0,0,0,0,0,0,0,0,0,0,0,0,0,0,0,0,0,0,0,0]
[95,{"$f":"OFFSET(Start,'Mellomlagring - antall besøk'!A96,0)","v":0},0,0,0,0,0,0,0,0,0,0,0,0,0,0,0,0,0,0,0,0,0,0,0,0,0,0,0,0,0,0,0,0,0,0,0,0,0]
[96,{"$f":"OFFSET(Start,'Mellomlagring - antall besøk'!A97,0)","v":0},0,0,0,0,0,0,0,0,0,0,0,0,0,0,0,0,0,0,0,0,0,0,0,0,0,0,0,0,0,0,0,0,0,0,0,0,0]
[97,{"$f":"OFFSET(Start,'Mellomlagring - antall besøk'!A98,0)","v":0},0,0,0,0,0,0,0,0,0,0,0,0,0,0,0,0,0,0,0,0,0,0,0,0,0,0,0,0,0,0,0,0,0,0,0,0,0]
[98,{"$f":"OFFSET(Start,'Mellomlagring - antall besøk'!A99,0)","v":0},0,0,0,0,0,0,0,0,0,0,0,0,0,0,0,0,0,0,0,0,0,0,0,0,0,0,0,0,0,0,0,0,0,0,0,0,0]
[99,{"$f":"OFFSET(Start,'Mellomlagring - antall besøk'!A100,0)","v":0},0,0,0,0,0,0,0,0,0,0,0,0,0,0,0,0,0,0,0,0,0,0,0,0,0,0,0,0,0,0,0,0,0,0,0,0,0]
[100,{"$f":"OFFSET(Start,'Mellomlagring - antall besøk'!A101,0)","v":0},0,0,0,0,0,0,0,0,0,0,0,0,0,0,0,0,0,0,0,0,0,0,0,0,0,0,0,0,0,0,0,0,0,0,0,0,0]
[101,{"$f":"OFFSET(Start,'Mellomlagring - antall besøk'!A102,0)","v":0},0,0,0,0,0,0,0,0,0,0,0,0,0,0,0,0,0,0,0,0,0,0,0,0,0,0,0,0,0,0,0,0,0,0,0,0,0]
[null,"Sum timer per måned",{"$f":"SUM(C3:C102)","v":5},{"$f":"SUM(D3:D102)","v":45},35,44.333333333333336,44.333333333333336,50,0,0,0,0,0,0,0,0,0,0,0,0,0,0,0,0,0,0,0,0,0,0,0,0,0,0,0,0,0,0]

{"sheet":"Gevinst-utsatt plass","index":10,"n_rows":103,"n_cols":39,"rows_kept":103,"cut":false,"hidden":true,"merged":[]}
[null,null,40,{"$f":"C1+3","v":43},{"$f":"D1+3","v":46},49,52,55,58,61,64,67,70,73,76,79,82,85,88,91,94,97,100,103,106,109,112,115,118,121,124,127,130,133,136,139,142,145]
["Nummer","Bruker ID",{"$f":"OFFSET('Månedlig registrering'!$AN$6,0,COLUMN(C:C)*3-9)","v":"2018-01-01"},{"$f":"OFFSET('Månedlig registrering'!$AN$6,0,COLUMN(D:D)*3-9)","v":"2018-02-01"},{"$f":"OFFSET('Månedlig registrering'!$AN$6,0,COLUMN(E:E)*3-9)","v":"2018-03-01"},{"$f":"OFFSET('Månedlig registrering'!$AN$6,0,COLUMN(F:F)*3-9)","v":"2018-04-01"},{"$f":"OFFSET('Månedlig registrering'!$AN$6,0,COLUMN(G:G)*3-9)","v":"2018-05-01"},{"$f":"OFFSET('Månedlig registrering'!$AN$6,0,COLUMN(H:H)*3-9)","v":"2018-06-01"},{"$f":"OFFSET('Månedlig registrering'!$AN$6,0,COLUMN(I:I)*3-9)","v":"2018-07-01"},{"$f":"OFFSET('Månedlig registrering'!$AN$6,0,COLUMN(J:J)*3-9)","v":"2018-08-01"},{"$f":"OFFSET('Månedlig registrering'!$AN$6,0,COLUMN(K:K)*3-9)","v":"2018-09-01"},{"$f":"OFFSET('Månedlig registrering'!$AN$6,0,COLUMN(L:L)*3-9)","v":"2018-10-01"},{"$f":"OFFSET('Månedlig registrering'!$AN$6,0,COLUMN(M:M)*3-9)","v":"2018-11-01"},{"$f":"OFFSET('Månedlig registrering'!$AN$6,0,COLUMN(N:N)*3-9)","v":"2018-12-01"},{"$f":"OFFSET('Månedlig registrering'!$AN$6,0,COLUMN(O:O)*3-9)","v":"2019-01-01"},{"$f":"OFFSET('Månedlig registrering'!$AN$6,0,COLUMN(P:P)*3-9)","v":"2019-02-01"},{"$f":"OFFSET('Månedlig registrering'!$AN$6,0,COLUMN(Q:Q)*3-9)","v":"2019-03-01"},{"$f":"OFFSET('Månedlig registrering'!$AN$6,0,COLUMN(R:R)*3-9)","v":"2019-04-01"},{"$f":"OFFSET('Månedlig registrering'!$AN$6,0,COLUMN(S:S)*3-9)","v":"2019-05-01"},{"$f":"OFFSET('Månedlig registrering'!$AN$6,0,COLUMN(T:T)*3-9)","v":"2019-06-01"},{"$f":"OFFSET('Månedlig registrering'!$AN$6,0,COLUMN(U:U)*3-9)","v":"2019-07-01"},{"$f":"OFFSET('Månedlig registrering'!$AN$6,0,COLUMN(V:V)*3-9)","v":"2019-08-01"},{"$f":"OFFSET('Månedlig registrering'!$AN$6,0,COLUMN(W:W)*3-9)","v":"2019-09-01"},{"$f":"OFFSET('Månedlig registrering'!$AN$6,0,COLUMN(X:X)*3-9)","v":"2019-10-01"},{"$f":"OFFSET('Månedlig registrering'!$AN$6,0,COLUMN(Y:Y)*3-9)","v":"2019-11-01"},{"$f":"OFFSET('Månedlig registrering'!$AN$6,0,COLUMN(Z:Z)*3-9)","v":"2019-12-01"},{"$f":"OFFSET('Månedlig registrering'!$AN$6,0,COLUMN(AA:AA)*3-9)","v":"2020-01-01"},{"$f":"OFFSET('Månedlig registrering'!$AN$6,0,COLUMN(AB:AB)*3-9)","v":"2020-02-01"},{"$f":"OFFSET('Månedlig registrering'!$AN$6,0,COLUMN(AC:AC)*3-9)","v":"2020-03-01"},{"$f":"OFFSET('Månedlig registrering'!$AN$6,0,COLUMN(AD:AD)*3-9)","v":"2020-04-01"},{"$f":"OFFSET('Månedlig registrering'!$AN$6,0,COLUMN(AE:AE)*3-9)","v":"2020-05-01"},{"$f":"OFFSET('Månedlig registrering'!$AN$6,0,COLUMN(AF:AF)*3-9)","v":"2020-06-01"},{"$f":"OFFSET('Månedlig registrering'!$AN$6,0,COLUMN(AG:AG)*3-9)","v":"2020-07-01"},{"$f":"OFFSET('Månedlig registrering'!$AN$6,0,COLUMN(AH:AH)*3-9)","v":"2020-08-01"},{"$f":"OFFSET('Månedlig registrering'!$AN$6,0,COLUMN(AI:AI)*3-9)","v":"2020-09-01"},{"$f":"OFFSET('Månedlig registrering'!$AN$6,0,COLUMN(AJ:AJ)*3-9)","v":"2020-10-01"},{"$f":"OFFSET('Månedlig registrering'!$AN$6,0,COLUMN(AK:AK)*3-9)","v":"2020-11-01"},{"$f":"OFFSET('Månedlig registrering'!$AN$6,0,COLUMN(AL:AL)*3-9)","v":"2020-12-01"},"Gevinstperbruker"]
[2,{"$f":"OFFSET(Start,'Mellomlagring - antall besøk'!A3,0)","v":1001},{"$f":"IF(TODAY()-C$2>0,(OFFSET(Start,$A3,C$1)*(AVERAGE(Dagskost_Korttid,Dagskost_Langtid,Dagskost_Overliggerdøgn)-Årskostnad_Hjemmetjeneste/365)),0)","v":0},0,0,0,0,0,0,0,0,0,{"$f":"IF(TODAY()-M$2>0,(OFFSET(Start,$A3,M$1)*(AVERAGE(Dagskost_Korttid,Dagskost_Langtid,Dagskost_Overliggerdøgn)-Årskostnad_Hjemmetjeneste/365)),0)","v":0},0,0,0,0,0,0,0,0,0,{"$f":"IF(TODAY()-W$2>0,(OFFSET(Start,$A3,W$1)*(AVERAGE(Dagskost_Korttid,Dagskost_Langtid,Dagskost_Overliggerdøgn)-Årskostnad_Hjemmetjeneste/365)),0)","v":0},0,0,0,0,0,0,0,0,0,{"$f":"IF(TODAY()-AG$2>0,(OFFSET(Start,$A3,AG$1)*(AVERAGE(Dagskost_Korttid,Dagskost_Langtid,Dagskost_Overliggerdøgn)-Årskostnad_Hjemmetjeneste/365)),0)","v":0},0,0,0,0,0,{"$f":"SUM(C3:AL3)","v":0}]
[{"$f":"+A3+1","v":3},{"$f":"OFFSET(Start,'Mellomlagring - antall besøk'!A4,0)","v":1002},0,0,0,0,0,0,0,0,0,0,0,0,0,0,0,0,0,0,0,0,0,0,0,0,0,0,0,0,0,0,0,0,0,0,0,0,{"$f":"SUM(C4:AL4)","v":0}]
[{"$f":"+A4+1","v":4},{"$f":"OFFSET(Start,'Mellomlagring - antall besøk'!A5,0)","v":1003},50547.94520547946,94356.164383561656,104465.75342465755,101095.89041095892,104465.75342465755,0,0,0,0,0,0,0,0,0,0,0,0,0,0,0,0,0,0,0,0,0,0,0,0,0,0,0,0,0,0,0,454931.50684931513]
[5,{"$f":"OFFSET(Start,'Mellomlagring - antall besøk'!A6,0)","v":0},0,0,0,0,0,0,0,0,0,0,0,0,0,0,0,0,0,0,0,0,0,0,0,0,0,0,0,0,0,0,0,0,0,0,0,0,0]
[6,{"$f":"OFFSET(Start,'Mellomlagring - antall besøk'!A7,0)","v":0},0,0,0,0,0,0,0,0,0,0,0,0,0,0,0,0,0,0,0,0,0,0,0,0,0,0,0,0,0,0,0,0,0,0,0,0,0]
[7,{"$f":"OFFSET(Start,'Mellomlagring - antall besøk'!A8,0)","v":0},0,0,0,0,0,0,0,0,0,0,0,0,0,0,0,0,0,0,0,0,0,0,0,0,0,0,0,0,0,0,0,0,0,0,0,0,0]
[8,{"$f":"OFFSET(Start,'Mellomlagring - antall besøk'!A9,0)","v":0},0,0,0,0,0,0,0,0,0,0,0,0,0,0,0,0,0,0,0,0,0,0,0,0,0,0,0,0,0,0,0,0,0,0,0,0,0]
[9,{"$f":"OFFSET(Start,'Mellomlagring - antall besøk'!A10,0)","v":0},0,0,0,0,0,0,0,0,0,0,0,0,0,0,0,0,0,0,0,0,0,0,0,0,0,0,0,0,0,0,0,0,0,0,0,0,0]
[10,{"$f":"OFFSET(Start,'Mellomlagring - antall besøk'!A11,0)","v":0},0,0,0,0,0,0,0,0,0,0,0,0,0,0,0,0,0,0,0,0,0,0,0,0,0,0,0,0,0,0,0,0,0,0,0,0,0]
[11,{"$f":"OFFSET(Start,'Mellomlagring - antall besøk'!A12,0)","v":0},0,0,0,0,0,0,0,0,0,0,0,0,0,0,0,0,0,0,0,0,0,0,0,0,0,0,0,0,0,0,0,0,0,0,0,0,0]
[12,{"$f":"OFFSET(Start,'Mellomlagring - antall besøk'!A13,0)","v":0},{"$f":"IF(TODAY()-C$2>0,(OFFSET(Start,$A13,C$1)*(AVERAGE(Dagskost_Korttid,Dagskost_Langtid,Dagskost_Overliggerdøgn)-Årskostnad_Hjemmetjeneste/365)),0)","v":0},0,0,0,0,0,0,0,0,0,{"$f":"IF(TODAY()-M$2>0,(OFFSET(Start,$A13,M$1)*(AVERAGE(Dagskost_Korttid,Dagskost_Langtid,Dagskost_Overliggerdøgn)-Årskostnad_Hjemmetjeneste/365)),0)","v":0},0,0,0,0,0,0,0,0,0,{"$f":"IF(TODAY()-W$2>0,(OFFSET(Start,$A13,W$1)*(AVERAGE(Dagskost_Korttid,Dagskost_Langtid,Dagskost_Overliggerdøgn)-Årskostnad_Hjemmetjeneste/365)),0)","v":0},0,0,0,0,0,0,0,0,0,{"$f":"IF(TODAY()-AG$2>0,(OFFSET(Start,$A13,AG$1)*(AVERAGE(Dagskost_Korttid,Dagskost_Langtid,Dagskost_Overliggerdøgn)-Årskostnad_Hjemmetjeneste/365)),0)","v":0},0,0,0,0,0,0]
[13,{"$f":"OFFSET(Start,'Mellomlagring - antall besøk'!A14,0)","v":0},0,0,0,0,0,0,0,0,0,0,0,0,0,0,0,0,0,0,0,0,0,0,0,0,0,0,0,0,0,0,0,0,0,0,0,0,0]
[14,{"$f":"OFFSET(Start,'Mellomlagring - antall besøk'!A15,0)","v":0},0,0,0,0,0,0,0,0,0,0,0,0,0,0,0,0,0,0,0,0,0,0,0,0,0,0,0,0,0,0,0,0,0,0,0,0,0]
[15,{"$f":"OFFSET(Start,'Mellomlagring - antall besøk'!A16,0)","v":0},0,0,0,0,0,0,0,0,0,0,0,0,0,0,0,0,0,0,0,0,0,0,0,0,0,0,0,0,0,0,0,0,0,0,0,0,0]
[16,{"$f":"OFFSET(Start,'Mellomlagring - antall besøk'!A17,0)","v":0},0,0,0,0,0,0,0,0,0,0,0,0,0,0,0,0,0,0,0,0,0,0,0,0,0,0,0,0,0,0,0,0,0,0,0,0,0]
[17,{"$f":"OFFSET(Start,'Mellomlagring - antall besøk'!A18,0)","v":0},0,0,0,0,0,0,0,0,0,0,0,0,0,0,0,0,0,0,0,0,0,0,0,0,0,0,0,0,0,0,0,0,0,0,0,0,0]
[18,{"$f":"OFFSET(Start,'Mellomlagring - antall besøk'!A19,0)","v":0},0,0,0,0,0,0,0,0,0,0,0,0,0,0,0,0,0,0,0,0,0,0,0,0,0,0,0,0,0,0,0,0,0,0,0,0,0]
[19,{"$f":"OFFSET(Start,'Mellomlagring - antall besøk'!A20,0)","v":0},0,0,0,0,0,0,0,0,0,0,0,0,0,0,0,0,0,0,0,0,0,0,0,0,0,0,0,0,0,0,0,0,0,0,0,0,0]
[20,{"$f":"OFFSET(Start,'Mellomlagring - antall besøk'!A21,0)","v":0},0,0,0,0,0,0,0,0,0,0,0,0,0,0,0,0,0,0,0,0,0,0,0,0,0,0,0,0,0,0,0,0,0,0,0,0,0]
[21,{"$f":"OFFSET(Start,'Mellomlagring - antall besøk'!A22,0)","v":0},0,0,0,0,0,0,0,0,0,0,0,0,0,0,0,0,0,0,0,0,0,0,0,0,0,0,0,0,0,0,0,0,0,0,0,0,0]
[22,{"$f":"OFFSET(Start,'Mellomlagring - antall besøk'!A23,0)","v":0},{"$f":"IF(TODAY()-C$2>0,(OFFSET(Start,$A23,C$1)*(AVERAGE(Dagskost_Korttid,Dagskost_Langtid,Dagskost_Overliggerdøgn)-Årskostnad_Hjemmetjeneste/365)),0)","v":0},0,0,0,0,0,0,0,0,0,{"$f":"IF(TODAY()-M$2>0,(OFFSET(Start,$A23,M$1)*(AVERAGE(Dagskost_Korttid,Dagskost_Langtid,Dagskost_Overliggerdøgn)-Årskostnad_Hjemmetjeneste/365)),0)","v":0},0,0,0,0,0,0,0,0,0,{"$f":"IF(TODAY()-W$2>0,(OFFSET(Start,$A23,W$1)*(AVERAGE(Dagskost_Korttid,Dagskost_Langtid,Dagskost_Overliggerdøgn)-Årskostnad_Hjemmetjeneste/365)),0)","v":0},0,0,0,0,0,0,0,0,0,{"$f":"IF(TODAY()-AG$2>0,(OFFSET(Start,$A23,AG$1)*(AVERAGE(Dagskost_Korttid,Dagskost_Langtid,Dagskost_Overliggerdøgn)-Årskostnad_Hjemmetjeneste/365)),0)","v":0},0,0,0,0,0,0]
[23,{"$f":"OFFSET(Start,'Mellomlagring - antall besøk'!A24,0)","v":0},0,0,0,0,0,0,0,0,0,0,0,0,0,0,0,0,0,0,0,0,0,0,0,0,0,0,0,0,0,0,0,0,0,0,0,0,0]
[24,{"$f":"OFFSET(Start,'Mellomlagring - antall besøk'!A25,0)","v":0},0,0,0,0,0,0,0,0,0,0,0,0,0,0,0,0,0,0,0,0,0,0,0,0,0,0,0,0,0,0,0,0,0,0,0,0,0]
[25,{"$f":"OFFSET(Start,'Mellomlagring - antall besøk'!A26,0)","v":0},0,0,0,0,0,0,0,0,0,0,0,0,0,0,0,0,0,0,0,0,0,0,0,0,0,0,0,0,0,0,0,0,0,0,0,0,0]
[26,{"$f":"OFFSET(Start,'Mellomlagring - antall besøk'!A27,0)","v":0},0,0,0,0,0,0,0,0,0,0,0,0,0,0,0,0,0,0,0,0,0,0,0,0,0,0,0,0,0,0,0,0,0,0,0,0,0]
[27,{"$f":"OFFSET(Start,'Mellomlagring - antall besøk'!A28,0)","v":0},0,0,0,0,0,0,0,0,0,0,0,0,0,0,0,0,0,0,0,0,0,0,0,0,0,0,0,0,0,0,0,0,0,0,0,0,0]
[28,{"$f":"OFFSET(Start,'Mellomlagring - antall besøk'!A29,0)","v":0},0,0,0,0,0,0,0,0,0,0,0,0,0,0,0,0,0,0,0,0,0,0,0,0,0,0,0,0,0,0,0,0,0,0,0,0,0]
[29,{"$f":"OFFSET(Start,'Mellomlagring - antall besøk'!A30,0)","v":0},0,0,0,0,0,0,0,0,0,0,0,0,0,0,0,0,0,0,0,0,0,0,0,0,0,0,0,0,0,0,0,0,0,0,0,0,0]
[30,{"$f":"OFFSET(Start,'Mellomlagring - antall besøk'!A31,0)","v":0},0,0,0,0,0,0,0,0,0,0,0,0,0,0,0,0,0,0,0,0,0,0,0,0,0,0,0,0,0,0,0,0,0,0,0,0,0]
[31,{"$f":"OFFSET(Start,'Mellomlagring - antall besøk'!A32,0)","v":0},0,0,0,0,0,0,0,0,0,0,0,0,0,0,0,0,0,0,0,0,0,0,0,0,0,0,0,0,0,0,0,0,0,0,0,0,0]
[32,{"$f":"OFFSET(Start,'Mellomlagring - antall besøk'!A33,0)","v":0},{"$f":"IF(TODAY()-C$2>0,(OFFSET(Start,$A33,C$1)*(AVERAGE(Dagskost_Korttid,Dagskost_Langtid,Dagskost_Overliggerdøgn)-Årskostnad_Hjemmetjeneste/365)),0)","v":0},0,0,0,0,0,0,0,0,0,{"$f":"IF(TODAY()-M$2>0,(OFFSET(Start,$A33,M$1)*(AVERAGE(Dagskost_Korttid,Dagskost_Langtid,Dagskost_Overliggerdøgn)-Årskostnad_Hjemmetjeneste/365)),0)","v":0},0,0,0,0,0,0,0,0,0,{"$f":"IF(TODAY()-W$2>0,(OFFSET(Start,$A33,W$1)*(AVERAGE(Dagskost_Korttid,Dagskost_Langtid,Dagskost_Overliggerdøgn)-Årskostnad_Hjemmetjeneste/365)),0)","v":0},0,0,0,0,0,0,0,0,0,{"$f":"IF(TODAY()-AG$2>0,(OFFSET(Start,$A33,AG$1)*(AVERAGE(Dagskost_Korttid,Dagskost_Langtid,Dagskost_Overliggerdøgn)-Årskostnad_Hjemmetjeneste/365)),0)","v":0},0,0,0,0,0,0]
[33,{"$f":"OFFSET(Start,'Mellomlagring - antall besøk'!A34,0)","v":0},0,0,0,0,0,0,0,0,0,0,0,0,0,0,0,0,0,0,0,0,0,0,0,0,0,0,0,0,0,0,0,0,0,0,0,0,0]
[34,{"$f":"OFFSET(Start,'Mellomlagring - antall besøk'!A35,0)","v":0},0,0,0,0,0,0,0,0,0,0,0,0,0,0,0,0,0,0,0,0,0,0,0,0,0,0,0,0,0,0,0,0,0,0,0,0,0]
[35,{"$f":"OFFSET(Start,'Mellomlagring - antall besøk'!A36,0)","v":0},0,0,0,0,0,0,0,0,0,0,0,0,0,0,0,0,0,0,0,0,0,0,0,0,0,0,0,0,0,0,0,0,0,0,0,0,0]
[36,{"$f":"OFFSET(Start,'Mellomlagring - antall besøk'!A37,0)","v":0},0,0,0,0,0,0,0,0,0,0,0,0,0,0,0,0,0,0,0,0,0,0,0,0,0,0,0,0,0,0,0,0,0,0,0,0,0]
[37,{"$f":"OFFSET(Start,'Mellomlagring - antall besøk'!A38,0)","v":0},0,0,0,0,0,0,0,0,0,0,0,0,0,0,0,0,0,0,0,0,0,0,0,0,0,0,0,0,0,0,0,0,0,0,0,0,0]
[38,{"$f":"OFFSET(Start,'Mellomlagring - antall besøk'!A39,0)","v":0},0,0,0,0,0,0,0,0,0,0,0,0,0,0,0,0,0,0,0,0,0,0,0,0,0,0,0,0,0,0,0,0,0,0,0,0,0]
[39,{"$f":"OFFSET(Start,'Mellomlagring - antall besøk'!A40,0)","v":0},0,0,0,0,0,0,0,0,0,0,0,0,0,0,0,0,0,0,0,0,0,0,0,0,0,0,0,0,0,0,0,0,0,0,0,0,0]
[40,{"$f":"OFFSET(Start,'Mellomlagring - antall besøk'!A41,0)","v":0},0,0,0,0,0,0,0,0,0,0,0,0,0,0,0,0,0,0,0,0,0,0,0,0,0,0,0,0,0,0,0,0,0,0,0,0,0]
[41,{"$f":"OFFSET(Start,'Mellomlagring - antall besøk'!A42,0)","v":0},0,0,0,0,0,0,0,0,0,0,0,0,0,0,0,0,0,0,0,0,0,0,0,0,0,0,0,0,0,0,0,0,0,0,0,0,0]
[42,{"$f":"OFFSET(Start,'Mellomlagring - antall besøk'!A43,0)","v":0},{"$f":"IF(TODAY()-C$2>0,(OFFSET(Start,$A43,C$1)*(AVERAGE(Dagskost_Korttid,Dagskost_Langtid,Dagskost_Overliggerdøgn)-Årskostnad_Hjemmetjeneste/365)),0)","v":0},0,0,0,0,0,0,0,0,0,{"$f":"IF(TODAY()-M$2>0,(OFFSET(Start,$A43,M$1)*(AVERAGE(Dagskost_Korttid,Dagskost_Langtid,Dagskost_Overliggerdøgn)-Årskostnad_Hjemmetjeneste/365)),0)","v":0},0,0,0,0,0,0,0,0,0,{"$f":"IF(TODAY()-W$2>0,(OFFSET(Start,$A43,W$1)*(AVERAGE(Dagskost_Korttid,Dagskost_Langtid,Dagskost_Overliggerdøgn)-Årskostnad_Hjemmetjeneste/365)),0)","v":0},0,0,0,0,0,0,0,0,0,{"$f":"IF(TODAY()-AG$2>0,(OFFSET(Start,$A43,AG$1)*(AVERAGE(Dagskost_Korttid,Dagskost_Langtid,Dagskost_Overliggerdøgn)-Årskostnad_Hjemmetjeneste/365)),0)","v":0},0,0,0,0,0,0]
[43,{"$f":"OFFSET(Start,'Mellomlagring - antall besøk'!A44,0)","v":0},0,0,0,0,0,0,0,0,0,0,0,0,0,0,0,0,0,0,0,0,0,0,0,0,0,0,0,0,0,0,0,0,0,0,0,0,0]
[44,{"$f":"OFFSET(Start,'Mellomlagring - antall besøk'!A45,0)","v":0},0,0,0,0,0,0,0,0,0,0,0,0,0,0,0,0,0,0,0,0,0,0,0,0,0,0,0,0,0,0,0,0,0,0,0,0,0]
[45,{"$f":"OFFSET(Start,'Mellomlagring - antall besøk'!A46,0)","v":0},0,0,0,0,0,0,0,0,0,0,0,0,0,0,0,0,0,0,0,0,0,0,0,0,0,0,0,0,0,0,0,0,0,0,0,0,0]
[46,{"$f":"OFFSET(Start,'Mellomlagring - antall besøk'!A47,0)","v":0},0,0,0,0,0,0,0,0,0,0,0,0,0,0,0,0,0,0,0,0,0,0,0,0,0,0,0,0,0,0,0,0,0,0,0,0,0]
[47,{"$f":"OFFSET(Start,'Mellomlagring - antall besøk'!A48,0)","v":0},0,0,0,0,0,0,0,0,0,0,0,0,0,0,0,0,0,0,0,0,0,0,0,0,0,0,0,0,0,0,0,0,0,0,0,0,0]
[48,{"$f":"OFFSET(Start,'Mellomlagring - antall besøk'!A49,0)","v":0},0,0,0,0,0,0,0,0,0,0,0,0,0,0,0,0,0,0,0,0,0,0,0,0,0,0,0,0,0,0,0,0,0,0,0,0,0]
[49,{"$f":"OFFSET(Start,'Mellomlagring - antall besøk'!A50,0)","v":0},0,0,0,0,0,0,0,0,0,0,0,0,0,0,0,0,0,0,0,0,0,0,0,0,0,0,0,0,0,0,0,0,0,0,0,0,0]
[50,{"$f":"OFFSET(Start,'Mellomlagring - antall besøk'!A51,0)","v":0},0,0,0,0,0,0,0,0,0,0,0,0,0,0,0,0,0,0,0,0,0,0,0,0,0,0,0,0,0,0,0,0,0,0,0,0,0]
[51,{"$f":"OFFSET(Start,'Mellomlagring - antall besøk'!A52,0)","v":0},0,0,0,0,0,0,0,0,0,0,0,0,0,0,0,0,0,0,0,0,0,0,0,0,0,0,0,0,0,0,0,0,0,0,0,0,0]
[52,{"$f":"OFFSET(Start,'Mellomlagring - antall besøk'!A53,0)","v":0},{"$f":"IF(TODAY()-C$2>0,(OFFSET(Start,$A53,C$1)*(AVERAGE(Dagskost_Korttid,Dagskost_Langtid,Dagskost_Overliggerdøgn)-Årskostnad_Hjemmetjeneste/365)),0)","v":0},0,0,0,0,0,0,0,0,0,{"$f":"IF(TODAY()-M$2>0,(OFFSET(Start,$A53,M$1)*(AVERAGE(Dagskost_Korttid,Dagskost_Langtid,Dagskost_Overliggerdøgn)-Årskostnad_Hjemmetjeneste/365)),0)","v":0},0,0,0,0,0,0,0,0,0,{"$f":"IF(TODAY()-W$2>0,(OFFSET(Start,$A53,W$1)*(AVERAGE(Dagskost_Korttid,Dagskost_Langtid,Dagskost_Overliggerdøgn)-Årskostnad_Hjemmetjeneste/365)),0)","v":0},0,0,0,0,0,0,0,0,0,{"$f":"IF(TODAY()-AG$2>0,(OFFSET(Start,$A53,AG$1)*(AVERAGE(Dagskost_Korttid,Dagskost_Langtid,Dagskost_Overliggerdøgn)-Årskostnad_Hjemmetjeneste/365)),0)","v":0},0,0,0,0,0,0]
[53,{"$f":"OFFSET(Start,'Mellomlagring - antall besøk'!A54,0)","v":0},0,0,0,0,0,0,0,0,0,0,0,0,0,0,0,0,0,0,0,0,0,0,0,0,0,0,0,0,0,0,0,0,0,0,0,0,0]
[54,{"$f":"OFFSET(Start,'Mellomlagring - antall besøk'!A55,0)","v":0},0,0,0,0,0,0,0,0,0,0,0,0,0,0,0,0,0,0,0,0,0,0,0,0,0,0,0,0,0,0,0,0,0,0,0,0,0]
[55,{"$f":"OFFSET(Start,'Mellomlagring - antall besøk'!A56,0)","v":0},0,0,0,0,0,0,0,0,0,0,0,0,0,0,0,0,0,0,0,0,0,0,0,0,0,0,0,0,0,0,0,0,0,0,0,0,0]
[56,{"$f":"OFFSET(Start,'Mellomlagring - antall besøk'!A57,0)","v":0},0,0,0,0,0,0,0,0,0,0,0,0,0,0,0,0,0,0,0,0,0,0,0,0,0,0,0,0,0,0,0,0,0,0,0,0,0]
[57,{"$f":"OFFSET(Start,'Mellomlagring - antall besøk'!A58,0)","v":0},0,0,0,0,0,0,0,0,0,0,0,0,0,0,0,0,0,0,0,0,0,0,0,0,0,0,0,0,0,0,0,0,0,0,0,0,0]
[58,{"$f":"OFFSET(Start,'Mellomlagring - antall besøk'!A59,0)","v":0},0,0,0,0,0,0,0,0,0,0,0,0,0,0,0,0,0,0,0,0,0,0,0,0,0,0,0,0,0,0,0,0,0,0,0,0,0]
[59,{"$f":"OFFSET(Start,'Mellomlagring - antall besøk'!A60,0)","v":0},0,0,0,0,0,0,0,0,0,0,0,0,0,0,0,0,0,0,0,0,0,0,0,0,0,0,0,0,0,0,0,0,0,0,0,0,0]
[60,{"$f":"OFFSET(Start,'Mellomlagring - antall besøk'!A61,0)","v":0},0,0,0,0,0,0,0,0,0,0,0,0,0,0,0,0,0,0,0,0,0,0,0,0,0,0,0,0,0,0,0,0,0,0,0,0,0]
[61,{"$f":"OFFSET(Start,'Mellomlagring - antall besøk'!A62,0)","v":0},0,0,0,0,0,0,0,0,0,0,0,0,0,0,0,0,0,0,0,0,0,0,0,0,0,0,0,0,0,0,0,0,0,0,0,0,0]
[62,{"$f":"OFFSET(Start,'Mellomlagring - antall besøk'!A63,0)","v":0},{"$f":"IF(TODAY()-C$2>0,(OFFSET(Start,$A63,C$1)*(AVERAGE(Dagskost_Korttid,Dagskost_Langtid,Dagskost_Overliggerdøgn)-Årskostnad_Hjemmetjeneste/365)),0)","v":0},0,0,0,0,0,0,0,0,0,{"$f":"IF(TODAY()-M$2>0,(OFFSET(Start,$A63,M$1)*(AVERAGE(Dagskost_Korttid,Dagskost_Langtid,Dagskost_Overliggerdøgn)-Årskostnad_Hjemmetjeneste/365)),0)","v":0},0,0,0,0,0,0,0,0,0,{"$f":"IF(TODAY()-W$2>0,(OFFSET(Start,$A63,W$1)*(AVERAGE(Dagskost_Korttid,Dagskost_Langtid,Dagskost_Overliggerdøgn)-Årskostnad_Hjemmetjeneste/365)),0)","v":0},0,0,0,0,0,0,0,0,0,{"$f":"IF(TODAY()-AG$2>0,(OFFSET(Start,$A63,AG$1)*(AVERAGE(Dagskost_Korttid,Dagskost_Langtid,Dagskost_Overliggerdøgn)-Årskostnad_Hjemmetjeneste/365)),0)","v":0},0,0,0,0,0,0]
[63,{"$f":"OFFSET(Start,'Mellomlagring - antall besøk'!A64,0)","v":0},0,0,0,0,0,0,0,0,0,0,0,0,0,0,0,0,0,0,0,0,0,0,0,0,0,0,0,0,0,0,0,0,0,0,0,0,0]
[64,{"$f":"OFFSET(Start,'Mellomlagring - antall besøk'!A65,0)","v":0},0,0,0,0,0,0,0,0,0,0,0,0,0,0,0,0,0,0,0,0,0,0,0,0,0,0,0,0,0,0,0,0,0,0,0,0,0]
[65,{"$f":"OFFSET(Start,'Mellomlagring - antall besøk'!A66,0)","v":0},0,0,0,0,0,0,0,0,0,0,0,0,0,0,0,0,0,0,0,0,0,0,0,0,0,0,0,0,0,0,0,0,0,0,0,0,0]
[66,{"$f":"OFFSET(Start,'Mellomlagring - antall besøk'!A67,0)","v":0},0,0,0,0,0,0,0,0,0,0,0,0,0,0,0,0,0,0,0,0,0,0,0,0,0,0,0,0,0,0,0,0,0,0,0,0,0]
[67,{"$f":"OFFSET(Start,'Mellomlagring - antall besøk'!A68,0)","v":0},0,0,0,0,0,0,0,0,0,0,0,0,0,0,0,0,0,0,0,0,0,0,0,0,0,0,0,0,0,0,0,0,0,0,0,0,{"$f":"SUM(C68:AL68)","v":0}]
[{"$f":"+A68+1","v":68},{"$f":"OFFSET(Start,'Mellomlagring - antall besøk'!A69,0)","v":0},0,0,0,0,0,0,0,0,0,0,0,0,0,0,0,0,0,0,0,0,0,0,0,0,0,0,0,0,0,0,0,0,0,0,0,0,0]
[69,{"$f":"OFFSET(Start,'Mellomlagring - antall besøk'!A70,0)","v":0},0,0,0,0,0,0,0,0,0,0,0,0,0,0,0,0,0,0,0,0,0,0,0,0,0,0,0,0,0,0,0,0,0,0,0,0,0]
[70,{"$f":"OFFSET(Start,'Mellomlagring - antall besøk'!A71,0)","v":0},0,0,0,0,0,0,0,0,0,0,0,0,0,0,0,0,0,0,0,0,0,0,0,0,0,0,0,0,0,0,0,0,0,0,0,0,0]
[71,{"$f":"OFFSET(Start,'Mellomlagring - antall besøk'!A72,0)","v":0},0,0,0,0,0,0,0,0,0,0,0,0,0,0,0,0,0,0,0,0,0,0,0,0,0,0,0,0,0,0,0,0,0,0,0,0,0]
[72,{"$f":"OFFSET(Start,'Mellomlagring - antall besøk'!A73,0)","v":0},{"$f":"IF(TODAY()-C$2>0,(OFFSET(Start,$A73,C$1)*(AVERAGE(Dagskost_Korttid,Dagskost_Langtid,Dagskost_Overliggerdøgn)-Årskostnad_Hjemmetjeneste/365)),0)","v":0},0,0,0,0,0,0,0,0,0,{"$f":"IF(TODAY()-M$2>0,(OFFSET(Start,$A73,M$1)*(AVERAGE(Dagskost_Korttid,Dagskost_Langtid,Dagskost_Overliggerdøgn)-Årskostnad_Hjemmetjeneste/365)),0)","v":0},0,0,0,0,0,0,0,0,0,{"$f":"IF(TODAY()-W$2>0,(OFFSET(Start,$A73,W$1)*(AVERAGE(Dagskost_Korttid,Dagskost_Langtid,Dagskost_Overliggerdøgn)-Årskostnad_Hjemmetjeneste/365)),0)","v":0},0,0,0,0,0,0,0,0,0,{"$f":"IF(TODAY()-AG$2>0,(OFFSET(Start,$A73,AG$1)*(AVERAGE(Dagskost_Korttid,Dagskost_Langtid,Dagskost_Overliggerdøgn)-Årskostnad_Hjemmetjeneste/365)),0)","v":0},0,0,0,0,0,0]
[73,{"$f":"OFFSET(Start,'Mellomlagring - antall besøk'!A74,0)","v":0},0,0,0,0,0,0,0,0,0,0,0,0,0,0,0,0,0,0,0,0,0,0,0,0,0,0,0,0,0,0,0,0,0,0,0,0,0]
[74,{"$f":"OFFSET(Start,'Mellomlagring - antall besøk'!A75,0)","v":0},0,0,0,0,0,0,0,0,0,0,0,0,0,0,0,0,0,0,0,0,0,0,0,0,0,0,0,0,0,0,0,0,0,0,0,0,0]
[75,{"$f":"OFFSET(Start,'Mellomlagring - antall besøk'!A76,0)","v":0},0,0,0,0,0,0,0,0,0,0,0,0,0,0,0,0,0,0,0,0,0,0,0,0,0,0,0,0,0,0,0,0,0,0,0,0,0]
[76,{"$f":"OFFSET(Start,'Mellomlagring - antall besøk'!A77,0)","v":0},0,0,0,0,0,0,0,0,0,0,0,0,0,0,0,0,0,0,0,0,0,0,0,0,0,0,0,0,0,0,0,0,0,0,0,0,0]
[77,{"$f":"OFFSET(Start,'Mellomlagring - antall besøk'!A78,0)","v":0},0,0,0,0,0,0,0,0,0,0,0,0,0,0,0,0,0,0,0,0,0,0,0,0,0,0,0,0,0,0,0,0,0,0,0,0,0]
[78,{"$f":"OFFSET(Start,'Mellomlagring - antall besøk'!A79,0)","v":0},0,0,0,0,0,0,0,0,0,0,0,0,0,0,0,0,0,0,0,0,0,0,0,0,0,0,0,0,0,0,0,0,0,0,0,0,0]
[79,{"$f":"OFFSET(Start,'Mellomlagring - antall besøk'!A80,0)","v":0},0,0,0,0,0,0,0,0,0,0,0,0,0,0,0,0,0,0,0,0,0,0,0,0,0,0,0,0,0,0,0,0,0,0,0,0,0]
[80,{"$f":"OFFSET(Start,'Mellomlagring - antall besøk'!A81,0)","v":0},0,0,0,0,0,0,0,0,0,0,0,0,0,0,0,0,0,0,0,0,0,0,0,0,0,0,0,0,0,0,0,0,0,0,0,0,0]
[81,{"$f":"OFFSET(Start,'Mellomlagring - antall besøk'!A82,0)","v":0},0,0,0,0,0,0,0,0,0,0,0,0,0,0,0,0,0,0,0,0,0,0,0,0,0,0,0,0,0,0,0,0,0,0,0,0,0]
[82,{"$f":"OFFSET(Start,'Mellomlagring - antall besøk'!A83,0)","v":0},{"$f":"IF(TODAY()-C$2>0,(OFFSET(Start,$A83,C$1)*(AVERAGE(Dagskost_Korttid,Dagskost_Langtid,Dagskost_Overliggerdøgn)-Årskostnad_Hjemmetjeneste/365)),0)","v":0},0,0,0,0,0,0,0,0,0,{"$f":"IF(TODAY()-M$2>0,(OFFSET(Start,$A83,M$1)*(AVERAGE(Dagskost_Korttid,Dagskost_Langtid,Dagskost_Overliggerdøgn)-Årskostnad_Hjemmetjeneste/365)),0)","v":0},0,0,0,0,0,0,0,0,0,{"$f":"IF(TODAY()-W$2>0,(OFFSET(Start,$A83,W$1)*(AVERAGE(Dagskost_Korttid,Dagskost_Langtid,Dagskost_Overliggerdøgn)-Årskostnad_Hjemmetjeneste/365)),0)","v":0},0,0,0,0,0,0,0,0,0,{"$f":"IF(TODAY()-AG$2>0,(OFFSET(Start,$A83,AG$1)*(AVERAGE(Dagskost_Korttid,Dagskost_Langtid,Dagskost_Overliggerdøgn)-Årskostnad_Hjemmetjeneste/365)),0)","v":0},0,0,0,0,0,0]
[83,{"$f":"OFFSET(Start,'Mellomlagring - antall besøk'!A84,0)","v":0},0,0,0,0,0,0,0,0,0,0,0,0,0,0,0,0,0,0,0,0,0,0,0,0,0,0,0,0,0,0,0,0,0,0,0,0,0]
[84,{"$f":"OFFSET(Start,'Mellomlagring - antall besøk'!A85,0)","v":0},0,0,0,0,0,0,0,0,0,0,0,0,0,0,0,0,0,0,0,0,0,0,0,0,0,0,0,0,0,0,0,0,0,0,0,0,0]
[85,{"$f":"OFFSET(Start,'Mellomlagring - antall besøk'!A86,0)","v":0},0,0,0,0,0,0,0,0,0,0,0,0,0,0,0,0,0,0,0,0,0,0,0,0,0,0,0,0,0,0,0,0,0,0,0,0,0]
[86,{"$f":"OFFSET(Start,'Mellomlagring - antall besøk'!A87,0)","v":0},0,0,0,0,0,0,0,0,0,0,0,0,0,0,0,0,0,0,0,0,0,0,0,0,0,0,0,0,0,0,0,0,0,0,0,0,0]
[87,{"$f":"OFFSET(Start,'Mellomlagring - antall besøk'!A88,0)","v":0},0,0,0,0,0,0,0,0,0,0,0,0,0,0,0,0,0,0,0,0,0,0,0,0,0,0,0,0,0,0,0,0,0,0,0,0,0]
[88,{"$f":"OFFSET(Start,'Mellomlagring - antall besøk'!A89,0)","v":0},0,0,0,0,0,0,0,0,0,0,0,0,0,0,0,0,0,0,0,0,0,0,0,0,0,0,0,0,0,0,0,0,0,0,0,0,0]
[89,{"$f":"OFFSET(Start,'Mellomlagring - antall besøk'!A90,0)","v":0},0,0,0,0,0,0,0,0,0,0,0,0,0,0,0,0,0,0,0,0,0,0,0,0,0,0,0,0,0,0,0,0,0,0,0,0,0]
[90,{"$f":"OFFSET(Start,'Mellomlagring - antall besøk'!A91,0)","v":0},0,0,0,0,0,0,0,0,0,0,0,0,0,0,0,0,0,0,0,0,0,0,0,0,0,0,0,0,0,0,0,0,0,0,0,0,0]
[91,{"$f":"OFFSET(Start,'Mellomlagring - antall besøk'!A92,0)","v":0},0,0,0,0,0,0,0,0,0,0,0,0,0,0,0,0,0,0,0,0,0,0,0,0,0,0,0,0,0,0,0,0,0,0,0,0,0]
[92,{"$f":"OFFSET(Start,'Mellomlagring - antall besøk'!A93,0)","v":0},{"$f":"IF(TODAY()-C$2>0,(OFFSET(Start,$A93,C$1)*(AVERAGE(Dagskost_Korttid,Dagskost_Langtid,Dagskost_Overliggerdøgn)-Årskostnad_Hjemmetjeneste/365)),0)","v":0},0,0,0,0,0,0,0,0,0,{"$f":"IF(TODAY()-M$2>0,(OFFSET(Start,$A93,M$1)*(AVERAGE(Dagskost_Korttid,Dagskost_Langtid,Dagskost_Overliggerdøgn)-Årskostnad_Hjemmetjeneste/365)),0)","v":0},0,0,0,0,0,0,0,0,0,{"$f":"IF(TODAY()-W$2>0,(OFFSET(Start,$A93,W$1)*(AVERAGE(Dagskost_Korttid,Dagskost_Langtid,Dagskost_Overliggerdøgn)-Årskostnad_Hjemmetjeneste/365)),0)","v":0},0,0,0,0,0,0,0,0,0,{"$f":"IF(TODAY()-AG$2>0,(OFFSET(Start,$A93,AG$1)*(AVERAGE(Dagskost_Korttid,Dagskost_Langtid,Dagskost_Overliggerdøgn)-Årskostnad_Hjemmetjeneste/365)),0)","v":0},0,0,0,0,0,0]
[93,{"$f":"OFFSET(Start,'Mellomlagring - antall besøk'!A94,0)","v":0},0,0,0,0,0,0,0,0,0,0,0,0,0,0,0,0,0,0,0,0,0,0,0,0,0,0,0,0,0,0,0,0,0,0,0,0,0]
[94,{"$f":"OFFSET(Start,'Mellomlagring - antall besøk'!A95,0)","v":0},0,0,0,0,0,0,0,0,0,0,0,0,0,0,0,0,0,0,0,0,0,0,0,0,0,0,0,0,0,0,0,0,0,0,0,0,0]
[95,{"$f":"OFFSET(Start,'Mellomlagring - antall besøk'!A96,0)","v":0},0,0,0,0,0,0,0,0,0,0,0,0,0,0,0,0,0,0,0,0,0,0,0,0,0,0,0,0,0,0,0,0,0,0,0,0,0]
[96,{"$f":"OFFSET(Start,'Mellomlagring - antall besøk'!A97,0)","v":0},0,0,0,0,0,0,0,0,0,0,0,0,0,0,0,0,0,0,0,0,0,0,0,0,0,0,0,0,0,0,0,0,0,0,0,0,0]
[97,{"$f":"OFFSET(Start,'Mellomlagring - antall besøk'!A98,0)","v":0},0,0,0,0,0,0,0,0,0,0,0,0,0,0,0,0,0,0,0,0,0,0,0,0,0,0,0,0,0,0,0,0,0,0,0,0,0]
[98,{"$f":"OFFSET(Start,'Mellomlagring - antall besøk'!A99,0)","v":0},0,0,0,0,0,0,0,0,0,0,0,0,0,0,0,0,0,0,0,0,0,0,0,0,0,0,0,0,0,0,0,0,0,0,0,0,0]
[99,{"$f":"OFFSET(Start,'Mellomlagring - antall besøk'!A100,0)","v":0},0,0,0,0,0,0,0,0,0,0,0,0,0,0,0,0,0,0,0,0,0,0,0,0,0,0,0,0,0,0,0,0,0,0,0,0,0]
[100,{"$f":"OFFSET(Start,'Mellomlagring - antall besøk'!A101,0)","v":0},0,0,0,0,0,0,0,0,0,0,0,0,0,0,0,0,0,0,0,0,0,0,0,0,0,0,0,0,0,0,0,0,0,0,0,0,0]
[101,{"$f":"OFFSET(Start,'Mellomlagring - antall besøk'!A102,0)","v":0},0,0,0,0,0,0,0,0,0,0,0,0,0,0,0,0,0,0,0,0,0,0,0,0,0,0,0,0,0,0,0,0,0,0,0,0,0]
[null,"Sum per måned",{"$f":"SUM(C3:C102)","v":50547.94520547946},{"$f":"SUM(D3:D102)","v":94356.164383561656},104465.75342465755,101095.89041095892,104465.75342465755,0,0,0,0,0,0,0,0,0,0,0,0,0,0,0,0,0,0,0,0,0,0,0,0,0,0,0,0,0,0,0]

{"sheet":"Resultater","index":11,"n_rows":28,"n_cols":38,"rows_kept":28,"cut":false,"hidden":false,"merged":[[14,29,16,29],[17,33,19,33],[14,33,16,33],[14,30,16,32],[17,30,19,32],[17,29,19,29]]}
[null,{"$f":"OFFSET('Månedlig registrering'!$AN$6,0,COLUMN(C:C)*3-9)","v":"2018-01-01"},{"$f":"OFFSET('Månedlig registrering'!$AN$6,0,COLUMN(D:D)*3-9)","v":"2018-02-01"},{"$f":"OFFSET('Månedlig registrering'!$AN$6,0,COLUMN(E:E)*3-9)","v":"2018-03-01"},{"$f":"OFFSET('Månedlig registrering'!$AN$6,0,COLUMN(F:F)*3-9)","v":"2018-04-01"},{"$f":"OFFSET('Månedlig registrering'!$AN$6,0,COLUMN(G:G)*3-9)","v":"2018-05-01"},{"$f":"OFFSET('Månedlig registrering'!$AN$6,0,COLUMN(H:H)*3-9)","v":"2018-06-01"},{"$f":"OFFSET('Månedlig registrering'!$AN$6,0,COLUMN(I:I)*3-9)","v":"2018-07-01"},{"$f":"OFFSET('Månedlig registrering'!$AN$6,0,COLUMN(J:J)*3-9)","v":"2018-08-01"},{"$f":"OFFSET('Månedlig registrering'!$AN$6,0,COLUMN(K:K)*3-9)","v":"2018-09-01"},{"$f":"OFFSET('Månedlig registrering'!$AN$6,0,COLUMN(L:L)*3-9)","v":"2018-10-01"},{"$f":"OFFSET('Månedlig registrering'!$AN$6,0,COLUMN(M:M)*3-9)","v":"2018-11-01"},{"$f":"OFFSET('Månedlig registrering'!$AN$6,0,COLUMN(N:N)*3-9)","v":"2018-12-01"},{"$f":"OFFSET('Månedlig registrering'!$AN$6,0,COLUMN(O:O)*3-9)","v":"2019-01-01"},{"$f":"OFFSET('Månedlig registrering'!$AN$6,0,COLUMN(P:P)*3-9)","v":"2019-02-01"},{"$f":"OFFSET('Månedlig registrering'!$AN$6,0,COLUMN(Q:Q)*3-9)","v":"2019-03-01"},{"$f":"OFFSET('Månedlig registrering'!$AN$6,0,COLUMN(R:R)*3-9)","v":"2019-04-01"},{"$f":"OFFSET('Månedlig registrering'!$AN$6,0,COLUMN(S:S)*3-9)","v":"2019-05-01"},{"$f":"OFFSET('Månedlig registrering'!$AN$6,0,COLUMN(T:T)*3-9)","v":"2019-06-01"},{"$f":"OFFSET('Månedlig registrering'!$AN$6,0,COLUMN(U:U)*3-9)","v":"2019-07-01"},{"$f":"OFFSET('Månedlig registrering'!$AN$6,0,COLUMN(V:V)*3-9)","v":"2019-08-01"},{"$f":"OFFSET('Månedlig registrering'!$AN$6,0,COLUMN(W:W)*3-9)","v":"2019-09-01"},{"$f":"OFFSET('Månedlig registrering'!$AN$6,0,COLUMN(X:X)*3-9)","v":"2019-10-01"},{"$f":"OFFSET('Månedlig registrering'!$AN$6,0,COLUMN(Y:Y)*3-9)","v":"2019-11-01"},{"$f":"OFFSET('Månedlig registrering'!$AN$6,0,COLUMN(Z:Z)*3-9)","v":"2019-12-01"},{"$f":"OFFSET('Månedlig registrering'!$AN$6,0,COLUMN(AA:AA)*3-9)","v":"2020-01-01"},{"$f":"OFFSET('Månedlig registrering'!$AN$6,0,COLUMN(AB:AB)*3-9)","v":"2020-02-01"},{"$f":"OFFSET('Månedlig registrering'!$AN$6,0,COLUMN(AC:AC)*3-9)","v":"2020-03-01"},{"$f":"OFFSET('Månedlig registrering'!$AN$6,0,COLUMN(AD:AD)*3-9)","v":"2020-04-01"},{"$f":"OFFSET('Månedlig registrering'!$AN$6,0,COLUMN(AE:AE)*3-9)","v":"2020-05-01"},{"$f":"OFFSET('Månedlig registrering'!$AN$6,0,COLUMN(AF:AF)*3-9)","v":"2020-06-01"},{"$f":"OFFSET('Månedlig registrering'!$AN$6,0,COLUMN(AG:AG)*3-9)","v":"2020-07-01"},{"$f":"OFFSET('Månedlig registrering'!$AN$6,0,COLUMN(AH:AH)*3-9)","v":"2020-08-01"},{"$f":"OFFSET('Månedlig registrering'!$AN$6,0,COLUMN(AI:AI)*3-9)","v":"2020-09-01"},{"$f":"OFFSET('Månedlig registrering'!$AN$6,0,COLUMN(AJ:AJ)*3-9)","v":"2020-10-01"},{"$f":"OFFSET('Månedlig registrering'!$AN$6,0,COLUMN(AK:AK)*3-9)","v":"2020-11-01"},{"$f":"OFFSET('Månedlig registrering'!$AN$6,0,COLUMN(AL:AL)*3-9)","v":"2020-12-01"},"SUM TOTAL"]
["Spart tid på ungåtte besøk",{"$f":"'Spart tid - ungått besøk'!C103","v":5},{"$f":"'Spart tid - ungått besøk'!D103","v":45},{"$f":"'Spart tid - ungått besøk'!E103","v":35},{"$f":"'Spart tid - ungått besøk'!F103","v":44.333333333333336},{"$f":"'Spart tid - ungått besøk'!G103","v":44.333333333333336},{"$f":"'Spart tid - ungått besøk'!H103","v":50},{"$f":"'Spart tid - ungått besøk'!I103","v":0},{"$f":"'Spart tid - ungått besøk'!J103","v":0},{"$f":"'Spart tid - ungått besøk'!K103","v":0},{"$f":"'Spart tid - ungått besøk'!L103","v":0},{"$f":"'Spart tid - ungått besøk'!M103","v":0},{"$f":"'Spart tid - ungått besøk'!N103","v":0},{"$f":"'Spart tid - ungått besøk'!O103","v":0},{"$f":"'Spart tid - ungått besøk'!P103","v":0},{"$f":"'Spart tid - ungått besøk'!Q103","v":0},{"$f":"'Spart tid - ungått besøk'!R103","v":0},{"$f":"'Spart tid - ungått besøk'!S103","v":0},{"$f":"'Spart tid - ungått besøk'!T103","v":0},{"$f":"'Spart tid - ungått besøk'!U103","v":0},{"$f":"'Spart tid - ungått besøk'!V103","v":0},{"$f":"'Spart tid - ungått besøk'!W103","v":0},{"$f":"'Spart tid - ungått besøk'!X103","v":0},{"$f":"'Spart tid - ungått besøk'!Y103","v":0},{"$f":"'Spart tid - ungått besøk'!Z103","v":0},{"$f":"'Spart tid - ungått besøk'!AA103","v":0},{"$f":"'Spart tid - ungått besøk'!AB103","v":0},{"$f":"'Spart tid - ungått besøk'!AC103","v":0},{"$f":"'Spart tid - ungått besøk'!AD103","v":0},{"$f":"'Spart tid - ungått besøk'!AE103","v":0},{"$f":"'Spart tid - ungått besøk'!AF103","v":0},{"$f":"'Spart tid - ungått besøk'!AG103","v":0},{"$f":"'Spart tid - ungått besøk'!AH103","v":0},{"$f":"'Spart tid - ungått besøk'!AI103","v":0},{"$f":"'Spart tid - ungått besøk'!AJ103","v":0},{"$f":"'Spart tid - ungått besøk'!AK103","v":0},{"$f":"'Spart tid - ungått besøk'!AL103","v":0},{"$f":"SUM(B2:AK2)","v":223.66666666666669}]
["Ungått kostnad for ungåtte besøk",{"$f":"B2*Timeslønn.Sykepleier","v":2035.0000000000002},18315.000000000004,14245.000000000002,18043.666666666672,18043.666666666672,20350.000000000004,0,0,0,0,0,0,0,0,0,0,0,0,0,0,0,0,0,0,0,0,0,0,0,0,0,0,0,0,0,0,{"$f":"SUM(B3:AK3)","v":91032.333333333343}]
["Ungått kostnad institusjonsplass",{"$f":"'Gevinst-utsatt plass'!C103","v":50547.94520547946},{"$f":"'Gevinst-utsatt plass'!D103","v":94356.164383561656},{"$f":"'Gevinst-utsatt plass'!E103","v":104465.75342465755},{"$f":"'Gevinst-utsatt plass'!F103","v":101095.89041095892},{"$f":"'Gevinst-utsatt plass'!G103","v":104465.75342465755},{"$f":"'Gevinst-utsatt plass'!H103","v":0},{"$f":"'Gevinst-utsatt plass'!I103","v":0},{"$f":"'Gevinst-utsatt plass'!J103","v":0},{"$f":"'Gevinst-utsatt plass'!K103","v":0},{"$f":"'Gevinst-utsatt plass'!L103","v":0},{"$f":"'Gevinst-utsatt plass'!M103","v":0},{"$f":"'Gevinst-utsatt plass'!N103","v":0},{"$f":"'Gevinst-utsatt plass'!O103","v":0},{"$f":"'Gevinst-utsatt plass'!P103","v":0},{"$f":"'Gevinst-utsatt plass'!Q103","v":0},{"$f":"'Gevinst-utsatt plass'!R103","v":0},{"$f":"'Gevinst-utsatt plass'!S103","v":0},{"$f":"'Gevinst-utsatt plass'!T103","v":0},{"$f":"'Gevinst-utsatt plass'!U103","v":0},{"$f":"'Gevinst-utsatt plass'!V103","v":0},{"$f":"'Gevinst-utsatt plass'!W103","v":0},{"$f":"'Gevinst-utsatt plass'!X103","v":0},{"$f":"'Gevinst-utsatt plass'!Y103","v":0},{"$f":"'Gevinst-utsatt plass'!Z103","v":0},{"$f":"'Gevinst-utsatt plass'!AA103","v":0},{"$f":"'Gevinst-utsatt plass'!AB103","v":0},{"$f":"'Gevinst-utsatt plass'!AC103","v":0},{"$f":"'Gevinst-utsatt plass'!AD103","v":0},{"$f":"'Gevinst-utsatt plass'!AE103","v":0},{"$f":"'Gevinst-utsatt plass'!AF103","v":0},{"$f":"'Gevinst-utsatt plass'!AG103","v":0},{"$f":"'Gevinst-utsatt plass'!AH103","v":0},{"$f":"'Gevinst-utsatt plass'!AI103","v":0},{"$f":"'Gevinst-utsatt plass'!AJ103","v":0},{"$f":"'Gevinst-utsatt plass'!AK103","v":0},{"$f":"'Gevinst-utsatt plass'!AL103","v":0},454931.50684931513]
["Månedlig kostnad for velferdsteknologi",{"$f":"'Mellomregning - teknologikostna'!C103","v":531.34},{"$f":"'Mellomregning - teknologikostna'!D103","v":531.34},{"$f":"'Mellomregning - teknologikostna'!E103","v":531.34},{"$f":"'Mellomregning - teknologikostna'!F103","v":531.34},{"$f":"'Mellomregning - teknologikostna'!G103","v":531.34},{"$f":"'Mellomregning - teknologikostna'!H103","v":531.34},{"$f":"'Mellomregning - teknologikostna'!I103","v":0},{"$f":"'Mellomregning - teknologikostna'!J103","v":0},{"$f":"'Mellomregning - teknologikostna'!K103","v":0},{"$f":"'Mellomregning - teknologikostna'!L103","v":0},{"$f":"'Mellomregning - teknologikostna'!M103","v":0},{"$f":"'Mellomregning - teknologikostna'!N103","v":0},{"$f":"'Mellomregning - teknologikostna'!O103","v":0},{"$f":"'Mellomregning - teknologikostna'!P103","v":0},{"$f":"'Mellomregning - teknologikostna'!Q103","v":0},{"$f":"'Mellomregning - teknologikostna'!R103","v":0},{"$f":"'Mellomregning - teknologikostna'!S103","v":0},{"$f":"'Mellomregning - teknologikostna'!T103","v":0},{"$f":"'Mellomregning - teknologikostna'!U103","v":0},{"$f":"'Mellomregning - teknologikostna'!V103","v":0},{"$f":"'Mellomregning - teknologikostna'!W103","v":0},{"$f":"'Mellomregning - teknologikostna'!X103","v":0},{"$f":"'Mellomregning - teknologikostna'!Y103","v":0},{"$f":"'Mellomregning - teknologikostna'!Z103","v":0},{"$f":"'Mellomregning - teknologikostna'!AA103","v":0},{"$f":"'Mellomregning - teknologikostna'!AB103","v":0},{"$f":"'Mellomregning - teknologikostna'!AC103","v":0},{"$f":"'Mellomregning - teknologikostna'!AD103","v":0},{"$f":"'Mellomregning - teknologikostna'!AE103","v":0},{"$f":"'Mellomregning - teknologikostna'!AF103","v":0},{"$f":"'Mellomregning - teknologikostna'!AG103","v":0},{"$f":"'Mellomregning - teknologikostna'!AH103","v":0},{"$f":"'Mellomregning - teknologikostna'!AI103","v":0},{"$f":"'Mellomregning - teknologikostna'!AJ103","v":0},{"$f":"'Mellomregning - teknologikostna'!AK103","v":0},{"$f":"'Mellomregning - teknologikostna'!AL103","v":0},{"$f":"SUM(B5:AK5)","v":3188.0400000000004}]
["Oppstartskostnader for nye brukere (teknologi + instalasjon + opplæring)",{"$f":"Oppstartskostnad!C103","v":4400},{"$f":"Oppstartskostnad!D103","v":0},{"$f":"Oppstartskostnad!E103","v":3500},{"$f":"Oppstartskostnad!F103","v":0},{"$f":"Oppstartskostnad!G103","v":0},{"$f":"Oppstartskostnad!H103","v":0},{"$f":"Oppstartskostnad!I103","v":0},{"$f":"Oppstartskostnad!J103","v":0},{"$f":"Oppstartskostnad!K103","v":0},{"$f":"Oppstartskostnad!L103","v":0},{"$f":"Oppstartskostnad!M103","v":0},{"$f":"Oppstartskostnad!N103","v":0},{"$f":"Oppstartskostnad!O103","v":0},{"$f":"Oppstartskostnad!P103","v":0},{"$f":"Oppstartskostnad!Q103","v":0},{"$f":"Oppstartskostnad!R103","v":0},{"$f":"Oppstartskostnad!S103","v":0},{"$f":"Oppstartskostnad!T103","v":0},{"$f":"Oppstartskostnad!U103","v":0},{"$f":"Oppstartskostnad!V103","v":0},{"$f":"Oppstartskostnad!W103","v":0},{"$f":"Oppstartskostnad!X103","v":0},{"$f":"Oppstartskostnad!Y103","v":0},{"$f":"Oppstartskostnad!Z103","v":0},{"$f":"Oppstartskostnad!AA103","v":0},{"$f":"Oppstartskostnad!AB103","v":0},{"$f":"Oppstartskostnad!AC103","v":0},{"$f":"Oppstartskostnad!AD103","v":0},{"$f":"Oppstartskostnad!AE103","v":0},{"$f":"Oppstartskostnad!AF103","v":0},{"$f":"Oppstartskostnad!AG103","v":0},{"$f":"Oppstartskostnad!AH103","v":0},{"$f":"Oppstartskostnad!AI103","v":0},{"$f":"Oppstartskostnad!AJ103","v":0},{"$f":"Oppstartskostnad!AK103","v":0},{"$f":"Oppstartskostnad!AL103","v":0},{"$f":"SUM(B6:AK6)","v":7900}]
["Fornøyde brukere per måned",{"$f":"'Mellomlagring - kvalitet'!C103","v":0},{"$f":"'Mellomlagring - kvalitet'!D103","v":1},{"$f":"'Mellomlagring - kvalitet'!E103","v":2},{"$f":"'Mellomlagring - kvalitet'!F103","v":2},{"$f":"'Mellomlagring - kvalitet'!G103","v":2},{"$f":"'Mellomlagring - kvalitet'!H103","v":0},{"$f":"'Mellomlagring - kvalitet'!I103","v":0},{"$f":"'Mellomlagring - kvalitet'!J103","v":0},{"$f":"'Mellomlagring - kvalitet'!K103","v":0},{"$f":"'Mellomlagring - kvalitet'!L103","v":0},{"$f":"'Mellomlagring - kvalitet'!M103","v":0},{"$f":"'Mellomlagring - kvalitet'!N103","v":0},{"$f":"'Mellomlagring - kvalitet'!O103","v":0},{"$f":"'Mellomlagring - kvalitet'!P103","v":0},{"$f":"'Mellomlagring - kvalitet'!Q103","v":0},{"$f":"'Mellomlagring - kvalitet'!R103","v":0},{"$f":"'Mellomlagring - kvalitet'!S103","v":0},{"$f":"'Mellomlagring - kvalitet'!T103","v":0},{"$f":"'Mellomlagring - kvalitet'!U103","v":0},{"$f":"'Mellomlagring - kvalitet'!V103","v":0},{"$f":"'Mellomlagring - kvalitet'!W103","v":0},{"$f":"'Mellomlagring - kvalitet'!X103","v":0},{"$f":"'Mellomlagring - kvalitet'!Y103","v":0},{"$f":"'Mellomlagring - kvalitet'!Z103","v":0},{"$f":"'Mellomlagring - kvalitet'!AA103","v":0},{"$f":"'Mellomlagring - kvalitet'!AB103","v":0},{"$f":"'Mellomlagring - kvalitet'!AC103","v":0},{"$f":"'Mellomlagring - kvalitet'!AD103","v":0},{"$f":"'Mellomlagring - kvalitet'!AE103","v":0},{"$f":"'Mellomlagring - kvalitet'!AF103","v":0},{"$f":"'Mellomlagring - kvalitet'!AG103","v":0},{"$f":"'Mellomlagring - kvalitet'!AH103","v":0},{"$f":"'Mellomlagring - kvalitet'!AI103","v":0},{"$f":"'Mellomlagring - kvalitet'!AJ103","v":0},{"$f":"'Mellomlagring - kvalitet'!AK103","v":0},{"$f":"'Mellomlagring - kvalitet'!AL103","v":0},7]
["Nøytrale brukere per måned",{"$f":"'Mellomlagring - kvalitet'!C104","v":1},{"$f":"'Mellomlagring - kvalitet'!D104","v":0},{"$f":"'Mellomlagring - kvalitet'!E104","v":0},{"$f":"'Mellomlagring - kvalitet'!F104","v":0},{"$f":"'Mellomlagring - kvalitet'!G104","v":0},{"$f":"'Mellomlagring - kvalitet'!H104","v":0},{"$f":"'Mellomlagring - kvalitet'!I104","v":0},{"$f":"'Mellomlagring - kvalitet'!J104","v":0},{"$f":"'Mellomlagring - kvalitet'!K104","v":0},{"$f":"'Mellomlagring - kvalitet'!L104","v":0},{"$f":"'Mellomlagring - kvalitet'!M104","v":0},{"$f":"'Mellomlagring - kvalitet'!N104","v":0},{"$f":"'Mellomlagring - kvalitet'!O104","v":0},{"$f":"'Mellomlagring - kvalitet'!P104","v":0},{"$f":"'Mellomlagring - kvalitet'!Q104","v":0},{"$f":"'Mellomlagring - kvalitet'!R104","v":0},{"$f":"'Mellomlagring - kvalitet'!S104","v":0},{"$f":"'Mellomlagring - kvalitet'!T104","v":0},{"$f":"'Mellomlagring - kvalitet'!U104","v":0},{"$f":"'Mellomlagring - kvalitet'!V104","v":0},{"$f":"'Mellomlagring - kvalitet'!W104","v":0},{"$f":"'Mellomlagring - kvalitet'!X104","v":0},{"$f":"'Mellomlagring - kvalitet'!Y104","v":0},{"$f":"'Mellomlagring - kvalitet'!Z104","v":0},{"$f":"'Mellomlagring - kvalitet'!AA104","v":0},{"$f":"'Mellomlagring - kvalitet'!AB104","v":0},{"$f":"'Mellomlagring - kvalitet'!AC104","v":0},{"$f":"'Mellomlagring - kvalitet'!AD104","v":0},{"$f":"'Mellomlagring - kvalitet'!AE104","v":0},{"$f":"'Mellomlagring - kvalitet'!AF104","v":0},{"$f":"'Mellomlagring - kvalitet'!AG104","v":0},{"$f":"'Mellomlagring - kvalitet'!AH104","v":0},{"$f":"'Mellomlagring - kvalitet'!AI104","v":0},{"$f":"'Mellomlagring - kvalitet'!AJ104","v":0},{"$f":"'Mellomlagring - kvalitet'!AK104","v":0},{"$f":"'Mellomlagring - kvalitet'!AL104","v":0},1]
["Misfornøyde brukere per måned",{"$f":"'Mellomlagring - kvalitet'!C105","v":0},{"$f":"'Mellomlagring - kvalitet'!D105","v":0},{"$f":"'Mellomlagring - kvalitet'!E105","v":0},{"$f":"'Mellomlagring - kvalitet'!F105","v":0},{"$f":"'Mellomlagring - kvalitet'!G105","v":0},{"$f":"'Mellomlagring - kvalitet'!H105","v":0},{"$f":"'Mellomlagring - kvalitet'!I105","v":0},{"$f":"'Mellomlagring - kvalitet'!J105","v":0},{"$f":"'Mellomlagring - kvalitet'!K105","v":0},{"$f":"'Mellomlagring - kvalitet'!L105","v":0},{"$f":"'Mellomlagring - kvalitet'!M105","v":0},{"$f":"'Mellomlagring - kvalitet'!N105","v":0},{"$f":"'Mellomlagring - kvalitet'!O105","v":0},{"$f":"'Mellomlagring - kvalitet'!P105","v":0},{"$f":"'Mellomlagring - kvalitet'!Q105","v":0},{"$f":"'Mellomlagring - kvalitet'!R105","v":0},{"$f":"'Mellomlagring - kvalitet'!S105","v":0},{"$f":"'Mellomlagring - kvalitet'!T105","v":0},{"$f":"'Mellomlagring - kvalitet'!U105","v":0},{"$f":"'Mellomlagring - kvalitet'!V105","v":0},{"$f":"'Mellomlagring - kvalitet'!W105","v":0},{"$f":"'Mellomlagring - kvalitet'!X105","v":0},{"$f":"'Mellomlagring - kvalitet'!Y105","v":0},{"$f":"'Mellomlagring - kvalitet'!Z105","v":0},{"$f":"'Mellomlagring - kvalitet'!AA105","v":0},{"$f":"'Mellomlagring - kvalitet'!AB105","v":0},{"$f":"'Mellomlagring - kvalitet'!AC105","v":0},{"$f":"'Mellomlagring - kvalitet'!AD105","v":0},{"$f":"'Mellomlagring - kvalitet'!AE105","v":0},{"$f":"'Mellomlagring - kvalitet'!AF105","v":0},{"$f":"'Mellomlagring - kvalitet'!AG105","v":0},{"$f":"'Mellomlagring - kvalitet'!AH105","v":0},{"$f":"'Mellomlagring - kvalitet'!AI105","v":0},{"$f":"'Mellomlagring - kvalitet'!AJ105","v":0},{"$f":"'Mellomlagring - kvalitet'!AK105","v":0},{"$f":"'Mellomlagring - kvalitet'!AL105","v":0},0]
["Totale gevinster per måned",{"$f":"B3+B4-B5-B6","v":47651.605205479464},{"$f":"C3+C4-C5-C6","v":112139.82438356166},114679.41342465756,118608.2170776256,121978.08009132423,19818.660000000003,0,0,0,0,0,0,0,0,0,0,0,0,0,0,0,0,0,0,0,0,0,0,0,0,0,0,0,0,0,0,{"$f":"AL3+AL4-AL5","v":542775.80018264847}]
[]
[]
[null,null,null,null,null,null,null,null,null,null,null,null,null,null,null,null,null,null,null,null,null,null,null,null,null,null,null,null,null,"Totale gevinster ved innføring av velferdsteknologi"]
[]
[null,null,null,null,null,null,null,null,null,null,null,null,null,null,null,null,null,null,null,null,null,null,null,null,null,null,null,null,null,"Spart kostnad",{"$f":"AL10","v":542775.80018264847},null,null,"kr"]
[]
[]
[null,null,null,null,null,null,null,null,null,null,null,null,null,null,null,null,null,null,null,null,null,null,null,null,null,null,null,null,null,"Spart tid",{"$f":"AL2","v":223.66666666666669},null,null,"timer"]
[]
[]
[]
[]
[]
[]
[]
[]
[]
["Totalt antall sparte timer ved ungåtte besøk: ",null,{"$f":"AL2","v":223.66666666666669},"timer",null,"Total ungått kostnad knyttet til ungåtte besøk: ",null,null,null,null,{"$f":"AL3","v":91032.333333333343},"kr"]